GCC-3.2.3 Java Bug

Justin Piszcz jpiszcz@lucidpixels.com
Thu Apr 24 02:45:00 GMT 2003


/home/war/gcc-3.2.3/gcc/xgcc -shared-libgcc -B/home/war/gcc-3.2.3/gcc/ 
-nostdinc
++ -L/home/war/gcc-3.2.3/i686-pc-linux-gnu/libstdc++-v3/src 
-L/home/war/gcc-3.2.
3/i686-pc-linux-gnu/libstdc++-v3/src/.libs 
-B/app/gcc-3.2.3/i686-pc-linux-gnu/bi
n/ -B/app/gcc-3.2.3/i686-pc-linux-gnu/lib/ -isystem 
/app/gcc-3.2.3/i686-pc-linux
-gnu/include -DHAVE_CONFIG_H -I. -I. -I./include -I./gcj -I. -Iinclude 
-I./inclu
de -I./../boehm-gc/include -DGC_LINUX_THREADS=1 -D_REENTRANT=1 
-DTHREAD_LOCAL_AL
LOC=1 -DSILENT=1 -DNO_SIGNALS=1 -DNO_EXECUTE_PERMISSION=1 
-DALL_INTERIOR_POINTER
S=1 -DJAVA_FINALIZATION=1 -DGC_GCJ_SUPPORT=1 -DATOMIC_UNCOLLECTABLE=1 
-I./libltd
l -I./libltdl -I./../.././libjava/../gcc -I./../zlib 
-I./../libffi/include -I../
libffi/include -fno-rtti -fnon-call-exceptions -fdollars-in-identifiers 
-D__NO_M
ATH_INLINES -ffloat-store -W -Wall -D_GNU_SOURCE 
-DPREFIX=\"/app/gcc-3.2.3\" -O3
 -pipe -fomit-frame-pointer -funroll-loops -march=pentium4 
-mcpu=pentium4 -mfpma
th=sse -mmmx -msse -msse2 -D_GNU_SOURCE -Wp,-MD,.deps/defineclass.pp -c 
definecl
ass.cc  -fPIC -DPIC -o .libs/defineclass.o
In file included from defineclass.cc:31:
java/lang/Double.h:43: `inf' was not declared in this scope
java/lang/Double.h:44: `inf' was not declared in this scope
java/lang/Double.h:45: `nan' was not declared in this scope
make[2]: *** [defineclass.lo] Error 1
make[2]: Leaving directory `/home/war/gcc-3.2.3/i686-pc-linux-gnu/libjava'
make[1]: *** [all-recursive] Error 1
make[1]: Leaving directory `/home/war/gcc-3.2.3/i686-pc-linux-gnu/libjava'
make: *** [all-target-libjava] Error 2
Command exited with non-zero status 2
644.58user 79.88system 12:55.55elapsed 93%CPU (0avgtext+0avgdata 
0maxresident)k
0inputs+0outputs (7155658major+8338605minor)pagefaults 0swaps
war@war:~/gcc-3.2.3$ echo $CFLAGS
-O3 -pipe -fomit-frame-pointer -funroll-loops -march=pentium4 
-mcpu=pentium4 -mf
pmath=sse -mmmx -msse -msse2
war@war:~/gcc-3.2.3$

Anyone else get this error?




More information about the Gcc-bugs mailing list