error during compilation of the latest cvs

Levente Farkas lfarkas@mindmaker.hu
Fri Jun 30 05:02:00 GMT 2000


hi,
when I try to compile the latest gcc from cvs, I've got the following error:
------------------------
make[3]: Entering directory `/home/cvs/gcc/obj-i386-linux/gcc/po'
file=`echo en_GB | sed 's,.*/,,'`.gmo \
  && rm -f $file && PATH=../src:$PATH no -o $file ../../../gcc/po/en_GB.po
/bin/sh: no: command not found
make[3]: *** [en_GB.gmo] Error 127
make[3]: Leaving directory `/home/cvs/gcc/obj-i386-linux/gcc/po'
make[2]: *** [intl.all] Error 1
make[2]: Leaving directory `/home/cvs/gcc/obj-i386-linux/gcc'
make[1]: *** [bootstrap-lean] Error 2
make[1]: Leaving directory `/home/cvs/gcc/obj-i386-linux/gcc'
make: *** [bootstrap-lean] Error 2
Bad exit status from /var/tmp/rpm-tmp.79978 (%build)
------------------------ 
this "no" is real program which missing form my linux or it's a bug
in the gcc (makefile) ?
thanks.

 -- Levente
 "The only thing worse than not knowing the truth is
  ruining the bliss of ignorance."


More information about the Gcc-bugs mailing list