G++ compiler bug on SCO OSR5
Bruce Korb
bkorb@sco.COM
Wed Feb 16 08:27:00 GMT 2000
Build log:
/bin/sh ../libtool --mode=compile c++ -DHAVE_CONFIG_H -I. -I../../am2msdev-0.4.0
/src -I.. -I../../am2msdev-0.4.0/am -g -O2 -Wall -c ../../am2msdev-0.4.0/src/
AmFileEditor.cxx
c++ -DHAVE_CONFIG_H -I. -I../../am2msdev-0.4.0/src -I.. -I../../am2msdev-0.4.0/a
m -g -O2 -Wall -c -fPIC -DPIC ../../am2msdev-0.4.0/src/AmFileEditor.cxx -o AmFi
leEditor.lo
../../am2msdev-0.4.0/am/AmFileEditor.h:72: Internal compiler error in `dwarfout_
finish', at dwarfout.c:6102
Please submit a full bug report.
See <URL: http://www.gnu.org/software/gcc/faq.html#bugreport > for instructions.
make[2]: *** [AmFileEditor.lo] Error 1
make[2]: Leaving directory `/u/bkorb/tools/am2msdev/=build/src'
make[1]: *** [all-recursive] Error 1
make[1]: Leaving directory `/u/bkorb/tools/am2msdev/=build'
make: *** [all-recursive-am] Error 2
[[ Robert - should the Skunkware G++ compiler be emitting dwarf output?? ]]
============
$ c++ --version
2.95.2
$ sh ~/tools/gcc/egcs/config.guess
i686-pc-sco3.2v5.0.5
============
Suggested build method. "AmFileEditor.ii.gz" is attached:
$ c++ -DHAVE_CONFIG_H -I. -I../../am2msdev-0.4.0/src -I.. \
-I../../am2msdev-0.4.0/am -Wall -v --save-temps \
../../am2msdev-0.4.0/src/AmFileEditor.cxx
Reading specs from /usr/local/lib/gcc-lib/i386-pc-sco3.2v5.0.5/2.95.2/specs
gcc version 2.95.2 19991024 (release)
/usr/local/lib/gcc-lib/i386-pc-sco3.2v5.0.5/2.95.2/cpp -lang-c++ -v -I. -I../..
/am2msdev-0.4.0/src -I.. -I../../am2msdev-0.4.0/am -D__GNUC__=2 -D__GNUG__=2 -D_
_GNUC_MINOR__=95 -D__cplusplus -Asystem(svr3) -D__EXCEPTIONS -Wall -Acpu(i386) -
Amachine(i386) -Di386 -D__i386 -D__i386__ -D__i386 -D__unix -D_SCO_DS=1 -D_M_I38
6 -D_M_XENIX -D_M_UNIX -D_STRICT_NAMES -D_SCO_XPG_VERS=4 -D_M_I86 -D_M_I86SM -D_
M_INTERNAT -D_M_SDATA -D_M_STEXT -D_M_BITFIELDS -D_M_SYS5 -D_M_SYSV -D_M_SYSIII
-D_M_WORDSWAP -Dunix -DM_I386 -DM_UNIX -DM_XENIX -D_SCO_ELF -D_SCO_C_DIALECT=1 -
DHAVE_CONFIG_H ../../am2msdev-0.4.0/src/AmFileEditor.cxx AmFileEditor.ii
GNU CPP version 2.95.2 19991024 (release) (i386, SCO OpenServer 5 Syntax)
#include "..." search starts here:
#include <...> search starts here:
.
../../am2msdev-0.4.0/src
..
../../am2msdev-0.4.0/am
/usr/local/lib/gcc-lib/i386-pc-sco3.2v5.0.5/2.95.2/../../../../include/g++-3
/usr/local/include
/usr/local/lib/gcc-lib/i386-pc-sco3.2v5.0.5/2.95.2/../../../../i386-pc-sco3.2v5
.0.5/include
/usr/local/lib/gcc-lib/i386-pc-sco3.2v5.0.5/2.95.2/include
/usr/include
End of search list.
The following default directories have been omitted from the search path:
End of omitted list.
/usr/local/lib/gcc-lib/i386-pc-sco3.2v5.0.5/2.95.2/cc1plus AmFileEditor.ii -qui
et -dumpbase AmFileEditor.cc -Wall -version -o AmFileEditor.s
GNU C++ version 2.95.2 19991024 (release) (i386-pc-sco3.2v5.0.5) compiled by GNU
C version 2.95.2 19991024 (release).
/usr/ccs/bin/as -b elf -Ea,XPG4PLUS,ELF -Qn -o AmFileEditor.o AmFileEditor.s
/usr/local/lib/gcc-lib/i386-pc-sco3.2v5.0.5/2.95.2/collect2 -b elf -Ra,XPG4PLUS
,ELF -YP,/usr/ccs/lib:/lib:/usr/lib -Qn /usr/ccs/lib/crt1.o /usr/ccs/lib/values-
Xa.o /usr/local/lib/gcc-lib/i386-pc-sco3.2v5.0.5/2.95.2/crtbegin.o -L/usr/local/
lib/gcc-lib/i386-pc-sco3.2v5.0.5/2.95.2 -L/usr/ccs/bin -L/usr/ccs/lib -L/usr/loc
al/lib AmFileEditor.o -lstdc++ -lm -lgcc -lcrypt -lgen -lc -lgcc /usr/local/lib/
gcc-lib/i386-pc-sco3.2v5.0.5/2.95.2/crtend.o /usr/ccs/lib/crtn.o
/usr/local/lib/gcc-lib/i386-pc-sco3.2v5.0.5/2.95.2/libstdc++.a(cstrmain.o): fata
l error: symbol `__pl__H3ZcZt18string_char_traits1ZcZt24__default_alloc_template
2b0i0_RCt12basic_string3ZX01ZX11ZX21PCX01_t12basic_string3ZX01ZX11ZX21` multiply
-defined, also in file AmFileEditor.o
collect2: ld returned 1 exit status
AmFileEditor.ii.gz
-------------- next part --------------
A non-text attachment was scrubbed...
Name: AmFileEditor.ii.gz
Type: application/x-gzip
Size: 39349 bytes
Desc: not available
URL: <http://gcc.gnu.org/pipermail/gcc-bugs/attachments/20000216/afe09153/attachment.bin>
More information about the Gcc-bugs
mailing list