Build Failure for 2.96 19990921

Jeffrey A Law law@cygnus.com
Thu Sep 30 19:57:00 GMT 1999


  In message < 199909211934.PAA00464@ronispc.chem.mcgill.ca >you write:
  > 
  > In doing the final stages of a bootstrap build I got the following:
  > 
  > /home/ronis/Project/objdir/gcc/xgcc -B/home/ronis/Project/objdir/gcc/ -B/us
  > r/i586-pc-linux-gnu/bin/ -fgnu-runtime -c -o gc.o -I. -I../../../egcs/libob
  > jc   -O3 -march=pentium -funroll-loops -fomit-frame-pointer -fstrict-aliasi
  > ng -DIN_GCC -I../../../egcs/libobjc/objc  -I../../../egcs/libobjc/../gcc -I
  > ../../../egcs/libobjc/../gcc/config -I../../gcc -I../../../egcs/libobjc/../
  > include ../../../egcs/libobjc/gc.c
  > cc1: Invalid option `-fgnu-runtime'
  > make[2]: *** [gc.o] Error 1
  > make[2]: Leaving directory `/home/ronis/Project/objdir/i586-pc-linux-gnu/li
  > bobjc'
  > make[1]: *** [all-target-libobjc] Error 2
  > make[1]: Leaving directory `/home/ronis/Project/objdir'
  > make: *** [bootstrap] Error 2
I fixed this earlier today.
jeff




More information about the Gcc-bugs mailing list