Bug in gcc 2.95

Scott Simpson simpsonsATintergame.com
Tue Sep 14 10:13:00 GMT 1999


Unixware 2.1 while compiling libstdc++-2.90.6

../bits/locale_facets.tcc:561: char-array initialized from wide string
../bits/string.tcc: At top level:
../bits/string.tcc:54: Internal compiler error in `dwarfout_finish',
at dwarfout
.c:6098
Please submit a full bug report.
See <URL: http://egcs.cygnus.com/faq.html#bugreport > for instructions.
make[2]: *** [locale-inst.lo] Error 1
make[2]: Leaving directory
`/tmp_mnt/opt/installers/lang/libstdc++-2.90.6/src'
make[1]: *** [all-recursive] Error 1
make[1]: Leaving directory
`/tmp_mnt/opt/installers/lang/libstdc++-2.90.6'
make: *** [all-recursive-am] Error 2
[root@coleridge libstdc++-2.90.6]# gcc -v
Reading specs from
/opt/gnu/lib/gcc-lib/i386-pc-sysv4.2uw2.1/2.95/specs
gcc version 2.95 19990728 (release)
[root@coleridge libstdc++-2.90.6]# uname -a
UNIX_SV coleridge 4.2MP 2.1 i386 x86at
[root@coleridge libstdc++-2.90.6]#

The file "t" contains the command line I used when running gcc.






More information about the Gcc-bugs mailing list