egcs-19991019 on sparc-redhat-linux boostrap failure

Horst von Brand vonbrand@inf.utfsm.cl
Wed Oct 20 06:30:00 GMT 1999


[...]

for name in _muldi3 _divdi3 _moddi3 _udivdi3 _umoddi3 _negdi2 _lshrdi3 _ashldi3 _ashrdi3 _ffsdi2 _udiv_w_sdiv _udivmoddi4 _cmpdi2 _ucmpdi2 _floatdidf _floatdisf _fixunsdfsi _fixunssfsi _fixunsdfdi _fixdfdi _fixunssfdi _fixsfdi _fixxfdi _fixunsxfdi _floatdixf _fixunsxfsi _fixtfdi _fixunstfdi _floatditf __gcc_bcmp _varargs __dummy _eprintf _bb _shtab _clear_cache _trampoline __main _exit _ctors _pure; \
do \
  echo ${name}; \
  ./xgcc -B/usr/sparc-redhat-linux/bin/ -B./ -I/usr/sparc-redhat-linux/include -O2   -DIN_GCC    -g -W -Wall -I./include  -fPIC -g1 -DHAVE_GTHR_DEFAULT -DIN_LIBGCC2 -D__GCC_FLOAT_NOT_NEEDED  -I. -I/usr/src/build/egcs-19991019/gcc -I/usr/src/build/egcs-19991019/gcc/config -I/usr/src/build/egcs-19991019/gcc/../include -c -DL${name} \
       /usr/src/build/egcs-19991019/gcc/libgcc2.c -o ${name}.o; \
  if [ $? -eq 0 ] ; then true; else exit 1; fi; \
  ` if [ -f /usr/src/build/build-egcs-19991019/gcc/../binutils/ar ] ; then echo /usr/src/build/build-egcs-19991019/gcc/../binutils/ar ; else if [ "sparc-redhat-linux-gnu" = "sparc-redhat-linux-gnu" ] ; then echo ar; else t='s,x,x,'; echo ar | sed -e $t ; fi; fi` rc tmplibgcc2.a ${name}.o; \
  rm -f ${name}.o; \
done
_muldi3

[...]

__dummy
_eprintf
In file included from /usr/include/stdio.h:631,
                 from /usr/src/build/egcs-19991019/gcc/libgcc2.c:1418:
/usr/include/bits/stdio.h: In function `vprintf':
/usr/include/bits/stdio.h:35: warning: format not a string literal, argument types not checked
/usr/src/build/egcs-19991019/gcc/libgcc2.c: In function `__eprintf':
/usr/src/build/egcs-19991019/gcc/libgcc2.c:1427: warning: format not a string literal, argument types not checked
_bb
In file included from /usr/include/stdio.h:631,
                 from /usr/src/build/egcs-19991019/gcc/libgcc2.c:1465:
/usr/include/bits/stdio.h: In function `vprintf':
/usr/include/bits/stdio.h:35: warning: format not a string literal, argument types not checked
xgcc: Internal compiler error: program cc1 got fatal signal 11
make[2]: *** [libgcc2.a] Error 1
make[2]: Leaving directory `/usr/src/build/build-egcs-19991019/gcc'
make[1]: *** [bootstrap-lean] Error 2
make[1]: Leaving directory `/usr/src/build/build-egcs-19991019/gcc'
make: *** [bootstrap-lean] Error 2
-- 
Dr. Horst H. von Brand                       mailto:vonbrand@inf.utfsm.cl
Departamento de Informatica                     Fono: +56 32 654431
Universidad Tecnica Federico Santa Maria              +56 32 654239
Casilla 110-V, Valparaiso, Chile                Fax:  +56 32 797513


More information about the Gcc-bugs mailing list