Bootstrap failure: tree.c:1941: Internal compiler error

Gerald Pfeifer pfeifer@dbai.tuwien.ac.at
Wed Mar 10 15:03:00 GMT 1999


Current CVS sources fail to bootstrap on FreeBSD 3.1, where the
bootstrapping compiler is gcc 2.7.2.1.

:
test x"no" != xyes || \
  /files/pfeifer/OBJ-1003-21:38/gcc/xgcc -B/files/pfeifer/OBJ-1003-21:38/gcc/ -B/sw/swtest/egcs/FreeBSD/i386-unknown-freebsdelf/bin/ -c -g -O2 -fno-implicit-templates -I/sw/swtest/egcs/egcs/libstdc++ -I/sw/swtest/egcs/egcs/libstdc++/stl -I../libio -I/sw/swtest/egcs/egcs/libstdc++/../libio -nostdinc++   /sw/swtest/egcs/egcs/libstdc++/cstringi.cc -o pic/cstringi.o
/files/pfeifer/OBJ-1003-21:38/gcc/xgcc -B/files/pfeifer/OBJ-1003-21:38/gcc/ -B/sw/swtest/egcs/FreeBSD/i386-unknown-freebsdelf/bin/ -c -g -O2 -fno-implicit-templates -I/sw/swtest/egcs/egcs/libstdc++ -I/sw/swtest/egcs/egcs/libstdc++/stl -I../libio -I/sw/swtest/egcs/egcs/libstdc++/../libio -nostdinc++  /sw/swtest/egcs/egcs/libstdc++/cstringi.cc
test x"no" != xyes || \
  /files/pfeifer/OBJ-1003-21:38/gcc/xgcc -B/files/pfeifer/OBJ-1003-21:38/gcc/ -B/sw/swtest/egcs/FreeBSD/i386-unknown-freebsdelf/bin/ -c -g -O2 -fno-implicit-templates -I/sw/swtest/egcs/egcs/libstdc++ -I/sw/swtest/egcs/egcs/libstdc++/stl -I../libio -I/sw/swtest/egcs/egcs/libstdc++/../libio -nostdinc++   /sw/swtest/egcs/egcs/libstdc++/stdexcepti.cc -o pic/stdexcepti.o
/files/pfeifer/OBJ-1003-21:38/gcc/xgcc -B/files/pfeifer/OBJ-1003-21:38/gcc/ -B/sw/swtest/egcs/FreeBSD/i386-unknown-freebsdelf/bin/ -c -g -O2 -fno-implicit-templates -I/sw/swtest/egcs/egcs/libstdc++ -I/sw/swtest/egcs/egcs/libstdc++/stl -I../libio -I/sw/swtest/egcs/egcs/libstdc++/../libio -nostdinc++  /sw/swtest/egcs/egcs/libstdc++/stdexcepti.cc
In file included from /sw/swtest/egcs/egcs/libstdc++/stl/alloc.h:21,
                 from /sw/swtest/egcs/egcs/libstdc++/std/bastring.h:39,
                 from /sw/swtest/egcs/egcs/libstdc++/string:6,
                 from /sw/swtest/egcs/egcs/libstdc++/stdexcept:36,
                 from /sw/swtest/egcs/egcs/libstdc++/stdexcepti.cc:8:
/sw/swtest/egcs/egcs/libstdc++/stl/stl_alloc.h:745: parse error before `&'
/sw/swtest/egcs/egcs/gcc/tree.c:1941: Internal compiler error in function chainon
Please submit a full bug report to `egcs-bugs@egcs.cygnus.com'.
See <URL: http://egcs.cygnus.com/faq.html#bugreport > for details.
gmake[2]: *** [stdexcepti.o] Error 1
gmake[2]: Leaving directory `/files/pfeifer/OBJ-1003-21:38/i386-unknown-freebsdelf/libstdc++'
gmake[1]: *** [all-target-libstdc++] Error 2
gmake[1]: Leaving directory `/files/pfeifer/OBJ-1003-21:38'
gmake: *** [bootstrap] Error 2
:

Gerald
-- 
Gerald "Jerry" pfeifer@dbai.tuwien.ac.at http://www.dbai.tuwien.ac.at/~pfeifer/



More information about the Gcc-bugs mailing list