g++ bug

Super-User root@barracuda.nrl.navy.mil
Fri Dec 31 20:54:00 GMT 1999


Hello,

I'm getting the following copiling error when compiling
Octave-2.0.14
on an
SGI
running IRIX 6.5.5 with
gcc-g++.2.95.2

make[2]: Entering directory `/usr/data1/ShareWare/GNU/octave-2.0.14/src'

c++ -c  -I. -I.. -I../liboctave -I../src -I../libcruft/misc  -I../glob
-I../glob -DHAVE_CONFIG_H -fno-rtti -fno-exceptions
-fno-implicit-templates -g -O2 -Wall sighandlers.cc
sighandlers.cc:631: Internal compiler error in `output_die', at
dwarf2out.c:5426
Please submit a full bug report.
See <URL: http://www.gnu.org/software/gcc/faq.html#bugreport > for
instructions.
make[2]: *** [sighandlers.o] Error 1
make[2]: Leaving directory `/usr/data1/ShareWare/GNU/octave-2.0.14/src'
make[1]: *** [src] Error 2
make[1]: Leaving directory `/usr/data1/ShareWare/GNU/octave-2.0.14'
make: *** [all] Error 2

There were no other errors up to this point....

btw
gcc-g++ compiled without error.

Any hints?

Regards,
Gregory J. Orris
Naval Research Lab
4555 Overlook Ave.
Code 7145
Tel: +1 202.404.4827





More information about the Gcc-bugs mailing list