Fw: egcs bug

Tony Cox a.cox@lion.rbgkew.org.uk
Mon Mar 30 23:39:00 GMT 1998


I'm using egcs to compile the Mysql RDBMS package under MkLinux (ppc) DR3
and the compilation falls over with the following error message:

>Making all in share
>make[3]: Entering directory `/usr/local/src/mysql-3.21.26-gamma/sql/share'
>make[3]: Nothing to be done for `all'.
>make[3]: Leaving directory `/usr/local/src/mysql-3.21.26-gamma/sql/share'
>c++ -DMYSQL_SERVER -DDEFAULT_MYSQL_HOME="\"/usr/local\"" -DDATADIR="\"/usr/
local/var\"" -DSHAREDIR="\"/usr/local/share/mysql\"" -DHAVE_CONFIG_H -I./../
include -I./../regex -I. -I../include -I.. -I.  -O -g -O2 -fno-implicit-temp
lates -DDBUG_OFF  -c sql_yac
>vm_enough_memory: refusing 1 page to [P8188 cc1plus]
>sql_yacc.yy: In function `int yyparse()':
>sql_yacc.yy:1157: Internal compiler error.
>sql_yacc.yy:1157: Please submit a full bug report to
>make[2]: *** [sql_yacc.o] Error 1
>make[2]: Leaving directory `/usr/local/src/mysql-3.21.26-gamma/sql'
>make[1]: *** [all-recursive] Error 1
>make[1]: Leaving directory `/usr/local/src/mysql-3.21.26-gamma'
>make: *** [all-recursive-am] Error 2

there appears to be enough memory to complete the operation (32M + 32M

The compiler is bundled with the MkLinux DR3 distribution.
I'm using egcs v1.0.2 (2.90.25) 980302.

any advice on what to do now?


Dr. Tony Cox                        email:   a.cox@rbgkew.org.uk
Jodrell Laboratory                   http:   www.rbgkew.org.uk
Royal Botanic Gardens                 tel:   (44)-181-332-5360
Kew, U.K.                             fax:   (44)-181-332-5310

More information about the Gcc-bugs mailing list