sparcv9 19981226 bootstrap failure
Stephen L Moshier
moshier@mediaone.net
Thu Dec 31 16:27:00 GMT 1998
Trying to bootstrap a sparcv9-sun-solaris2.7 with -O2 (the default)
lead to this bootstrap failure.
stage1/xgcc -Bstage1/
-B/usr/users/smoshier/solaris27bin/sparcv9-sun-solaris2.7/bin/
-c -DIN_GCC -DHAIFA -DSVR4 -W -Wall -O2 -DHAVE_CONFIG_H
-I. -I../ccdir/gcc -I../ccdir/gcc/config -I../ccdir/gcc/../include
../ccdir/gcc/reload.c
...
/usr/ccs/bin/as: "/var/tmp/ccL5OIGj.s", line 20080: error: statement
syntax
/usr/ccs/bin/as: "/var/tmp/ccL5OIGj.s", line 20094: error: statement
syntax
/usr/ccs/bin/as: "/var/tmp/ccL5OIGj.s", line 20108: error: statement
syntax
make[2]: *** [reload.o] Error 1
Bootstrapping with -O completed but there were numerous c-torture errors.
ERROR: va-arg-6.c: compiled program got signal 10:
ERROR: va-arg-5.c: compiled program got signal 10:
ERROR: regstack-1.c: compiled program got signal 11:
ERROR: gofast.c: compiled program got signal 6:
ERROR: conversion.c: compiled program got signal 6:
...
More information about the Gcc-bugs
mailing list