This is the mail archive of the libstdc++@gcc.gnu.org mailing list for the libstdc++ project.


Index Nav: [Date Index] [Subject Index] [Author Index] [Thread Index]
Message Nav: [Date Prev] [Date Next] [Thread Prev] [Thread Next]
Other format: [Raw text]

Re: autotools transition report: v 28.07


Hi Phil,

I doubt if I get directly to you. So I cc libstdc++.

Let me know what you need, I build in parallel also on sol9. With multilib.

Andreas

From the multilib dir build:

Making all in testsuite
`/Volumes/xufs/gcc-cvs-clean/objdir/powerpc-apple-darwin6.3/soft-float/libstdc++-v3/scripts/testsuite_flags --build-cxx` -DHAVE_CONFIG_H -I. -I/Volumes/xufs/gcc-cvs-clean/gcc/libstdc++-v3/testsuite -I.. -nostdinc++ -I/Volumes/xufs/gcc-cvs-clean/objdir/powerpc-apple-darwin6.3/soft-float/libstdc++-v3/include/powerpc-apple-darwin6.3 -I/Volumes/xufs/gcc-cvs-clean/objdir/powerpc-apple-darwin6.3/soft-float/libstdc++-v3/include -I/Volumes/xufs/gcc-cvs-clean/gcc/libstdc++-v3/libsupc++ -O2 -g -O2 -g -O2 -c -o testsuite_hooks.o `test -f '/Volumes/xufs/gcc-cvs-clean/gcc/libstdc++-v3/testsuite/testsuite_hooks.cc' || echo '/Volumes/xufs/gcc-cvs-clean/gcc/libstdc++-v3/testsuite/'`/Volumes/xufs/gcc-cvs-clean/gcc/libstdc++-v3/testsuite/testsuite_hooks.cc
/bin/sh: @glibcxx_CXX@: command not found
make[2]: *** [testsuite_hooks.o] Error 127
make[1]: *** [all-recursive] Error 1
make: *** [all] Error 2



Index Nav: [Date Index] [Subject Index] [Author Index] [Thread Index]
Message Nav: [Date Prev] [Date Next] [Thread Prev] [Thread Next]