This is the mail archive of the gcc-testresults@gcc.gnu.org mailing list for the GCC project.


Index Nav: [Date Index] [Subject Index] [Author Index] [Thread Index]
Message Nav: [Date Prev] [Date Next] [Thread Prev] [Thread Next]
Other format: [Raw text]

Gcc [trunk revision 228248] failed to bootstrap on i686!


rm -rf bld
mkdir -p bld
cd bld; \
 PATH="/sbin:/bin:$PATH" CC="gcc -m32" CXX="g++ -m32" ../src-trunk/configure \
	 --prefix=/usr/local --enable-clocale=gnu --with-system-zlib --enable-shared --with-demangler-in-ld --enable-cloog-backend=isl --with-ppl=/opt/gnu --with-cloog=/opt/gnu i686-linux --with-fpmath=sse --enable-languages=c,c++,fortran,java,lto,objc
configure: WARNING: you should use --build, --host, --target
checking build system type... i686-pc-linux-gnu
    grep "Error " makelog.228248.trunk.i686.core-avx512 >> makelog.228248.trunk.i686.core-avx512.mail; \
make[5]: *** [compare] Error 1
make[4]: *** [stage3-bubble] Error 2
make[3]: *** [bootstrap] Error 2
make[2]: *** [bootstrap] Error 2
  lib=`echo "${rootpre}" | sed -e 's,^.*/\([^/][^/]*\)/$,\1,'`; \
  compiler="/nightly/gcc.svn/test-intel32corei7avx512/gcc-build-trunk/bld/./gcc/xgcc -B/nightly/gcc.svn/test-intel32corei7avx512/gcc-build-trunk/bld/./gcc/ -B/usr/local/i686-linux/bin/ -B/usr/local/i686-linux/lib/ -isystem /usr/local/i686-linux/include -isystem /usr/local/i686-linux/sys-include   "; \
  for i in `${compiler} --print-multi-lib 2>/dev/null`; do \
    dir=`echo $i | sed -e 's/;.*$//'`; \
    if [ "${dir}" = "." ]; then \
      true; \
    else \
      if [ -d ../${dir}/${lib} ]; then \
	flags=`echo $i | sed -e 's/^[^;]*;//' -e 's/@/ -/g'`; \
	if (cd ../${dir}/${lib}; make "AR_FLAGS=rc" "CC_FOR_BUILD=gcc -m32" "CC_FOR_TARGET=/nightly/gcc.svn/test-intel32corei7avx512/gcc-build-trunk/bld/./gcc/xgcc -B/nightly/gcc.svn/test-intel32corei7avx512/gcc-build-trunk/bld/./gcc/" "CFLAGS=-g -O2" "CXXFLAGS=-g -O2 -D_GNU_SOURCE" "CFLAGS_FOR_BUILD=-g -O2" "CFLAGS_FOR_TARGET=-g -O2" "INSTALL=/bin/install -c" "INSTALL_DATA=/bin/install -c -m 644" "INSTALL_PROGRAM=/bin/install -c" "INSTALL_SCRIPT=/bin/install -c" "LDFLAGS=" "LIBCFLAGS=-g -O2" "LIBCFLAGS_FOR_TARGET=-g -O2" "MAKE=make" "MAKEINFO=makeinfo --split-size=5000000 --split-size=5000000 --split-size=5000000    " "SHELL=/bin/sh" "RUNTESTFLAGS=--target_board='sde-sim' i386.exp=avx512*" "exec_prefix=/usr/local" "infodir=/usr/local/share/info" "libdir=/usr/local/lib" "includedir=/usr/local/include" "prefix=/usr/local" "tooldir=/usr/local/i686-linux" "gxx_include_dir=/usr/local/include/c++/6.0.0" "AR=/usr/local/i686-linux/bin/ar" "AS=/nightly/gcc.svn/test-intel32corei7avx512/gcc-build-trunk/bld/./gcc/as" "LD=/nightly/gcc.svn/test-intel32corei7avx512/gcc-build-trunk/bld/./gcc/collect-ld" "RANLIB=/usr/local/i686-linux/bin/ranlib" "NM=/nightly/gcc.svn/test-intel32corei7avx512/gcc-build-trunk/bld/./gcc/nm" "NM_FOR_BUILD=" "NM_FOR_TARGET=/usr/local/i686-linux/bin/nm" "DESTDIR=" "WERROR=" \
			CFLAGS="-g -O2 ${flags}" \
			CCASFLAGS=" ${flags}" \
			FCFLAGS=" ${flags}" \
			FFLAGS=" ${flags}" \
			ADAFLAGS=" ${flags}" \
			prefix="/usr/local" \
			exec_prefix="/usr/local" \
			GCJFLAGS=" ${flags}" \
			GOCFLAGS="-O2 -g ${flags}" \
			CXXFLAGS="-g -O2 -D_GNU_SOURCE ${flags}" \
			LIBCFLAGS="-g -O2 ${flags}" \
			LIBCXXFLAGS="-g -O2 -D_GNU_SOURCE -fno-implicit-templates ${flags}" \
			LDFLAGS=" ${flags}" \
			MULTIFLAGS="${flags}" \
			DESTDIR="" \
			INSTALL="/bin/install -c" \
			INSTALL_DATA="/bin/install -c -m 644" \
			INSTALL_PROGRAM="/bin/install -c" \
			INSTALL_SCRIPT="/bin/install -c" \
			all); then \
	  true; \
	else \
	  exit 1; \
	fi; \
      else true; \
      fi; \
    fi; \
  done; \
fi
make[9]: Leaving directory `/nightly/gcc.svn/test-intel32corei7avx512/gcc-build-trunk/bld/i686-linux/libstdc++-v3'
make[8]: Leaving directory `/nightly/gcc.svn/test-intel32corei7avx512/gcc-build-trunk/bld/i686-linux/libstdc++-v3'
make[7]: Leaving directory `/nightly/gcc.svn/test-intel32corei7avx512/gcc-build-trunk/bld/i686-linux/libstdc++-v3'
make[6]: Leaving directory `/nightly/gcc.svn/test-intel32corei7avx512/gcc-build-trunk/bld/i686-linux/libstdc++-v3'
make[5]: Leaving directory `/nightly/gcc.svn/test-intel32corei7avx512/gcc-build-trunk/bld'
make "DESTDIR=" "RPATH_ENVVAR=LD_LIBRARY_PATH" "TARGET_SUBDIR=i686-linux" "bindir=/usr/local/bin" "datadir=/usr/local/share" "exec_prefix=/usr/local" "includedir=/usr/local/include" "datarootdir=/usr/local/share" "docdir=/usr/local/share/doc/" "infodir=/usr/local/share/info" "pdfdir=/usr/local/share/doc/" "htmldir=/usr/local/share/doc/" "libdir=/usr/local/lib" "libexecdir=/usr/local/libexec" "lispdir=" "localstatedir=/usr/local/var" "mandir=/usr/local/share/man" "oldincludedir=/usr/include" "prefix=/usr/local" "sbindir=/usr/local/sbin" "sharedstatedir=/usr/local/com" "sysconfdir=/usr/local/etc" "tooldir=/usr/local/i686-linux" "build_tooldir=/usr/local/i686-linux" "target_alias=i686-linux" "AWK=gawk" "BISON=bison" "CC_FOR_BUILD=gcc -m32" "CFLAGS_FOR_BUILD=-g -O2" "CXX_FOR_BUILD=g++ -m32" "EXPECT=expect" "FLEX=flex" "INSTALL=/bin/install -c" "INSTALL_DATA=/bin/install -c -m 644" "INSTALL_PROGRAM=/bin/install -c" "INSTALL_SCRIPT=/bin/install -c" "LDFLAGS_FOR_BUILD=" "LEX=flex" "M4=m4" "MAKE=make" "RUNTEST=runtest" "RUNTESTFLAGS=--target_board='sde-sim' i386.exp=avx512*" "SED=/bin/sed" "SHELL=/bin/sh" "YACC=bison -y" "`echo 'ADAFLAGS=' | sed -e s'/[^=][^=]*=$/XFOO=/'`" "ADA_CFLAGS=" "AR_FLAGS=rc" "`echo 'BOOT_ADAFLAGS=-gnatpg' | sed -e s'/[^=][^=]*=$/XFOO=/'`" "BOOT_CFLAGS=-g -O2" "BOOT_LDFLAGS=" "CFLAGS=-g -O2" "CXXFLAGS=-g -O2" "LDFLAGS=" "LIBCFLAGS=-g -O2" "LIBCXXFLAGS=-g -O2 -fno-implicit-templates" "STAGE1_CHECKING=--enable-checking=yes,types" "STAGE1_LANGUAGES=c,c++,lto" "GNATBIND=no" "GNATMAKE=no" "AR_FOR_TARGET=/usr/local/i686-linux/bin/ar" "AS_FOR_TARGET=/usr/local/i686-linux/bin/as" "CC_FOR_TARGET=/nightly/gcc.svn/test-intel32corei7avx512/gcc-build-trunk/bld/./gcc/xgcc -B/nightly/gcc.svn/test-intel32corei7avx512/gcc-build-trunk/bld/./gcc/" "CFLAGS_FOR_TARGET=-g -O2" "CPPFLAGS_FOR_TARGET=" "CXXFLAGS_FOR_TARGET=-g -O2 -D_GNU_SOURCE" "DLLTOOL_FOR_TARGET=dlltool" "FLAGS_FOR_TARGET=-B/usr/local/i686-linux/bin/ -B/usr/local/i686-linux/lib/ -isystem /usr/local/i686-linux/include -isystem /usr/local/i686-linux/sys-include" "GCJ_FOR_TARGET=/nightly/gcc.svn/test-intel32corei7avx512/gcc-build-trunk/bld/./gcc/gcj -B/nightly/gcc.svn/test-intel32corei7avx512/gcc-build-trunk/bld/./gcc/" "GFORTRAN_FOR_TARGET=/nightly/gcc.svn/test-intel32corei7avx512/gcc-build-trunk/bld/./gcc/gfortran -B/nightly/gcc.svn/test-intel32corei7avx512/gcc-build-trunk/bld/./gcc/" "GOC_FOR_TARGET=" "GOCFLAGS_FOR_TARGET=-O2 -g" "LD_FOR_TARGET=/usr/local/i686-linux/bin/ld" "LIPO_FOR_TARGET=lipo" "LDFLAGS_FOR_TARGET=" "LIBCFLAGS_FOR_TARGET=-g -O2" "LIBCXXFLAGS_FOR_TARGET=-g -O2 -D_GNU_SOURCE -fno-implicit-templates" "NM_FOR_TARGET=/usr/local/i686-linux/bin/nm" "OBJDUMP_FOR_TARGET=/usr/local/i686-linux/bin/objdump" "OBJCOPY_FOR_TARGET=/usr/local/i686-linux/bin/objcopy" "RANLIB_FOR_TARGET=/usr/local/i686-linux/bin/ranlib" "READELF_FOR_TARGET=/usr/local/i686-linux/bin/readelf" "STRIP_FOR_TARGET=/usr/local/i686-linux/bin/strip" "WINDRES_FOR_TARGET=windres" "WINDMC_FOR_TARGET=windmc" "BUILD_CONFIG=bootstrap-debug" "`echo 'LANGUAGES=' | sed -e s'/[^=][^=]*=$/XFOO=/'`" "LEAN=false" "STAGE1_CFLAGS=-g" "STAGE1_CXXFLAGS=-g" "STAGE1_TFLAGS=" "STAGE2_CFLAGS=-g -O2 -gtoggle" "STAGE2_CXXFLAGS=-g -O2 -gtoggle" "STAGE2_TFLAGS=" "STAGE3_CFLAGS=-g -O2" "STAGE3_CXXFLAGS=-g -O2" "STAGE3_TFLAGS=" "STAGE4_CFLAGS=-g -O2" "STAGE4_CXXFLAGS=-g -O2" "STAGE4_TFLAGS=" "STAGEprofile_CFLAGS=-g -O2 -gtoggle -fprofile-generate" "STAGEprofile_CXXFLAGS=-g -O2 -gtoggle -fprofile-generate" "STAGEprofile_TFLAGS=" "STAGEfeedback_CFLAGS=-g -O2 -fprofile-use" "STAGEfeedback_CXXFLAGS=-g -O2 -fprofile-use" "STAGEfeedback_TFLAGS=" "CXX_FOR_TARGET= $r/./gcc/xg++ -B$r/./gcc/ -nostdinc++ `if test -f $r/i686-linux/libstdc++-v3/scripts/testsuite_flags; then /bin/sh $r/i686-linux/libstdc++-v3/scripts/testsuite_flags --build-includes; else echo -funconfigured-libstdc++-v3 ; fi` -L$r/i686-linux/libstdc++-v3/src -L$r/i686-linux/libstdc++-v3/src/.libs -L$r/i686-linux/libstdc++-v3/libsupc++/.libs" "TFLAGS=" "CONFIG_SHELL=/bin/sh" "MAKEINFO=makeinfo --split-size=5000000 --split-size=5000000"  compare
make[5]: Entering directory `/nightly/gcc.svn/test-intel32corei7avx512/gcc-build-trunk/bld'
make[6]: Entering directory `/nightly/gcc.svn/test-intel32corei7avx512/gcc-build-trunk/bld'
rm -f stage_current
make[6]: Leaving directory `/nightly/gcc.svn/test-intel32corei7avx512/gcc-build-trunk/bld'
Comparing stages 2 and 3
warning: gcc/cc1obj-checksum.o differs
warning: gcc/cc1-checksum.o differs
warning: gcc/cc1plus-checksum.o differs
Bootstrap comparison failure!
gcc/double-int.o differs
gcc/i386-c.o differs
gcc/tree-ssa-math-opts.o differs
gcc/function.o differs
gcc/expr.o differs
gcc/gimple-fold.o differs
gcc/gcov.o differs
gcc/cfgloopmanip.o differs
gcc/cp/init.o differs
gcc/gimple-ssa-strength-reduction.o differs
gcc/dwarf2out.o differs
gcc/fortran/trans-common.o differs
gcc/ipa-prop.o differs
gcc/combine.o differs
gcc/predict.o differs
gcc/fold-const.o differs
gcc/tree-ssa-alias.o differs
gcc/tree-ssa-sccvn.o differs
gcc/tree-ssa-reassoc.o differs
gcc/tree-affine.o differs
gcc/tree-ssa-loop-niter.o differs
gcc/loop-unroll.o differs
gcc/coverage.o differs
gcc/tree-dfa.o differs
gcc/tree-ssa-ccp.o differs
gcc/tree-ssa-forwprop.o differs
gcc/mcf.o differs
gcc/gcov-dump.o differs
gcc/dwarf2cfi.o differs
gcc/value-prof.o differs
gcc/tree-vrp.o differs
gcc/loop-iv.o differs
gcc/tree-vect-loop.o differs
gcc/tree-ssa-loop-ivcanon.o differs
gcc/var-tracking.o differs
libcpp/expr.o differs
make[5]: *** [compare] Error 1
make[5]: Leaving directory `/nightly/gcc.svn/test-intel32corei7avx512/gcc-build-trunk/bld'
make[4]: *** [stage3-bubble] Error 2
make[4]: Leaving directory `/nightly/gcc.svn/test-intel32corei7avx512/gcc-build-trunk/bld'
make[3]: *** [bootstrap] Error 2
make[3]: Leaving directory `/nightly/gcc.svn/test-intel32corei7avx512/gcc-build-trunk/bld'
14368.74user 283.77system 2:08:20elapsed 190%CPU (0avgtext+0avgdata 540676maxresident)k
1173408inputs+11563224outputs (3220major+149821779minor)pagefaults 0swaps
make[2]: *** [bootstrap] Error 2
make[2]: Leaving directory `/nightly/gcc.svn/test-intel32corei7avx512/gcc-build-trunk'


Index Nav: [Date Index] [Subject Index] [Author Index] [Thread Index]
Message Nav: [Date Prev] [Date Next] [Thread Prev] [Thread Next]