This is the mail archive of the gcc-testresults@gcc.gnu.org mailing list for the GCC project.


Index Nav: [Date Index] [Subject Index] [Author Index] [Thread Index]
Message Nav: [Date Prev] [Date Next] [Thread Prev] [Thread Next]
Other format: [Raw text]

Results for 4.3.3 20081010 (prerelease) [gcc-4_3-branch revision 141048] (GCC) gcc testsuite on avr-unknown-none


Debian 4 on x86_64
cross tool versions:
GNU assembler (GNU Binutils) 2.18.50.20080726
GNU gdb 6.4
GNU ld (GNU Binutils) 2.18.50.20080726

GNU Make 3.81
expect version 5.43.0
host gcc version: gcc (GCC) 4.4.0 20080823 (experimental) [trunk revision 139524]
LAST_UPDATED: Fri Oct 10 22:06:05 UTC 2008 (revision 141048)

Target is avr-unknown-none
Host   is x86_64-unknown-linux-gnu

		=== gcc tests ===


Running target avrtest-m128-sim
FAIL: gcc.c-torture/compile/20010226-1.c  -O0  (internal compiler error)
FAIL: gcc.c-torture/compile/20010226-1.c  -O0  (test for excess errors)
FAIL: gcc.c-torture/compile/20010226-1.c  -O1  (internal compiler error)
FAIL: gcc.c-torture/compile/20010226-1.c  -O1  (test for excess errors)
FAIL: gcc.c-torture/compile/20010226-1.c  -O2  (internal compiler error)
FAIL: gcc.c-torture/compile/20010226-1.c  -O2  (test for excess errors)
FAIL: gcc.c-torture/compile/20010226-1.c  -O3 -fomit-frame-pointer  (internal compiler error)
FAIL: gcc.c-torture/compile/20010226-1.c  -O3 -fomit-frame-pointer  (test for excess errors)
FAIL: gcc.c-torture/compile/20010226-1.c  -O3 -g  (internal compiler error)
FAIL: gcc.c-torture/compile/20010226-1.c  -O3 -g  (test for excess errors)
FAIL: gcc.c-torture/compile/20010226-1.c  -Os  (internal compiler error)
FAIL: gcc.c-torture/compile/20010226-1.c  -Os  (test for excess errors)
FAIL: gcc.c-torture/compile/20010327-1.c  -O0  (test for excess errors)
FAIL: gcc.c-torture/compile/20010327-1.c  -O1  (test for excess errors)
FAIL: gcc.c-torture/compile/20010327-1.c  -O2  (test for excess errors)
FAIL: gcc.c-torture/compile/20010327-1.c  -O3 -fomit-frame-pointer  (test for excess errors)
FAIL: gcc.c-torture/compile/20010327-1.c  -O3 -g  (test for excess errors)
FAIL: gcc.c-torture/compile/20010327-1.c  -Os  (test for excess errors)
FAIL: gcc.c-torture/compile/20020604-1.c  -O0  (test for excess errors)
FAIL: gcc.c-torture/compile/20020604-1.c  -O1  (test for excess errors)
FAIL: gcc.c-torture/compile/20020604-1.c  -O2  (test for excess errors)
FAIL: gcc.c-torture/compile/20020604-1.c  -O3 -fomit-frame-pointer  (test for excess errors)
FAIL: gcc.c-torture/compile/20020604-1.c  -O3 -fomit-frame-pointer -funroll-loops  (test for excess errors)
FAIL: gcc.c-torture/compile/20020604-1.c  -O3 -fomit-frame-pointer -funroll-all-loops -finline-functions  (test for excess errors)
FAIL: gcc.c-torture/compile/20020604-1.c  -O3 -g  (test for excess errors)
FAIL: gcc.c-torture/compile/20020604-1.c  -Os  (test for excess errors)
FAIL: gcc.c-torture/compile/20050122-2.c  -O0  (internal compiler error)
FAIL: gcc.c-torture/compile/20050122-2.c  -O0  (test for excess errors)
FAIL: gcc.c-torture/compile/20050122-2.c  -O1  (internal compiler error)
FAIL: gcc.c-torture/compile/20050122-2.c  -O1  (test for excess errors)
FAIL: gcc.c-torture/compile/20050122-2.c  -O2  (internal compiler error)
FAIL: gcc.c-torture/compile/20050122-2.c  -O2  (test for excess errors)
FAIL: gcc.c-torture/compile/20050122-2.c  -O3 -fomit-frame-pointer  (internal compiler error)
FAIL: gcc.c-torture/compile/20050122-2.c  -O3 -fomit-frame-pointer  (test for excess errors)
FAIL: gcc.c-torture/compile/20050122-2.c  -O3 -g  (internal compiler error)
FAIL: gcc.c-torture/compile/20050122-2.c  -O3 -g  (test for excess errors)
FAIL: gcc.c-torture/compile/20050122-2.c  -Os  (internal compiler error)
FAIL: gcc.c-torture/compile/20050122-2.c  -Os  (test for excess errors)
FAIL: gcc.c-torture/compile/20080625-1.c  -O0  (test for excess errors)
FAIL: gcc.c-torture/compile/20080625-1.c  -O1  (test for excess errors)
FAIL: gcc.c-torture/compile/20080625-1.c  -O2  (test for excess errors)
FAIL: gcc.c-torture/compile/20080625-1.c  -O3 -fomit-frame-pointer  (test for excess errors)
FAIL: gcc.c-torture/compile/20080625-1.c  -O3 -g  (test for excess errors)
FAIL: gcc.c-torture/compile/20080625-1.c  -Os  (test for excess errors)
FAIL: gcc.c-torture/compile/limits-fndefn.c  -O1  (internal compiler error)
FAIL: gcc.c-torture/compile/limits-fndefn.c  -O1  (test for excess errors)
FAIL: gcc.c-torture/compile/limits-fndefn.c  -O2  (internal compiler error)
FAIL: gcc.c-torture/compile/limits-fndefn.c  -O2  (test for excess errors)
FAIL: gcc.c-torture/compile/limits-fndefn.c  -O3 -fomit-frame-pointer  (internal compiler error)
FAIL: gcc.c-torture/compile/limits-fndefn.c  -O3 -fomit-frame-pointer  (test for excess errors)
FAIL: gcc.c-torture/compile/limits-fndefn.c  -O3 -g  (internal compiler error)
FAIL: gcc.c-torture/compile/limits-fndefn.c  -O3 -g  (test for excess errors)
FAIL: gcc.c-torture/compile/limits-fndefn.c  -Os  (internal compiler error)
FAIL: gcc.c-torture/compile/limits-fndefn.c  -Os  (test for excess errors)
FAIL: gcc.c-torture/compile/limits-stringlit.c  -O0  (test for excess errors)
FAIL: gcc.c-torture/compile/limits-stringlit.c  -O1  (test for excess errors)
FAIL: gcc.c-torture/compile/limits-stringlit.c  -O2  (test for excess errors)
FAIL: gcc.c-torture/compile/limits-stringlit.c  -O3 -fomit-frame-pointer  (test for excess errors)
FAIL: gcc.c-torture/compile/limits-stringlit.c  -O3 -g  (test for excess errors)
FAIL: gcc.c-torture/compile/limits-stringlit.c  -Os  (test for excess errors)
FAIL: gcc.c-torture/compile/nested-1.c  -O0  (internal compiler error)
FAIL: gcc.c-torture/compile/nested-1.c  -O0  (test for excess errors)
FAIL: gcc.c-torture/compile/nested-1.c  -O1  (internal compiler error)
FAIL: gcc.c-torture/compile/nested-1.c  -O1  (test for excess errors)
FAIL: gcc.c-torture/compile/nested-1.c  -O2  (internal compiler error)
FAIL: gcc.c-torture/compile/nested-1.c  -O2  (test for excess errors)
FAIL: gcc.c-torture/compile/nested-1.c  -O3 -fomit-frame-pointer  (internal compiler error)
FAIL: gcc.c-torture/compile/nested-1.c  -O3 -fomit-frame-pointer  (test for excess errors)
FAIL: gcc.c-torture/compile/nested-1.c  -O3 -g  (internal compiler error)
FAIL: gcc.c-torture/compile/nested-1.c  -O3 -g  (test for excess errors)
FAIL: gcc.c-torture/compile/nested-1.c  -Os  (internal compiler error)
FAIL: gcc.c-torture/compile/nested-1.c  -Os  (test for excess errors)
FAIL: gcc.c-torture/compile/pr27889.c  -O0  (internal compiler error)
FAIL: gcc.c-torture/compile/pr27889.c  -O0  (test for excess errors)
FAIL: gcc.c-torture/compile/pr27889.c  -O1  (internal compiler error)
FAIL: gcc.c-torture/compile/pr27889.c  -O1  (test for excess errors)
FAIL: gcc.c-torture/compile/pr27889.c  -O2  (internal compiler error)
FAIL: gcc.c-torture/compile/pr27889.c  -O2  (test for excess errors)
FAIL: gcc.c-torture/compile/pr27889.c  -O3 -fomit-frame-pointer  (internal compiler error)
FAIL: gcc.c-torture/compile/pr27889.c  -O3 -fomit-frame-pointer  (test for excess errors)
FAIL: gcc.c-torture/compile/pr27889.c  -O3 -g  (internal compiler error)
FAIL: gcc.c-torture/compile/pr27889.c  -O3 -g  (test for excess errors)
FAIL: gcc.c-torture/compile/pr27889.c  -Os  (internal compiler error)
FAIL: gcc.c-torture/compile/pr27889.c  -Os  (test for excess errors)
FAIL: gcc.c-torture/execute/builtins/memcpy-chk.c compilation,  -O0 
UNRESOLVED: gcc.c-torture/execute/builtins/memcpy-chk.c execution,  -O0 
FAIL: gcc.c-torture/execute/builtins/memcpy-chk.c compilation,  -O1 
UNRESOLVED: gcc.c-torture/execute/builtins/memcpy-chk.c execution,  -O1 
FAIL: gcc.c-torture/execute/builtins/memcpy-chk.c compilation,  -O2 
UNRESOLVED: gcc.c-torture/execute/builtins/memcpy-chk.c execution,  -O2 
FAIL: gcc.c-torture/execute/builtins/memcpy-chk.c compilation,  -O3 -fomit-frame-pointer 
UNRESOLVED: gcc.c-torture/execute/builtins/memcpy-chk.c execution,  -O3 -fomit-frame-pointer 
FAIL: gcc.c-torture/execute/builtins/memcpy-chk.c compilation,  -O3 -fomit-frame-pointer -funroll-loops 
UNRESOLVED: gcc.c-torture/execute/builtins/memcpy-chk.c execution,  -O3 -fomit-frame-pointer -funroll-loops 
FAIL: gcc.c-torture/execute/builtins/memcpy-chk.c compilation,  -O3 -fomit-frame-pointer -funroll-all-loops -finline-functions 
UNRESOLVED: gcc.c-torture/execute/builtins/memcpy-chk.c execution,  -O3 -fomit-frame-pointer -funroll-all-loops -finline-functions 
FAIL: gcc.c-torture/execute/builtins/memcpy-chk.c compilation,  -O3 -g 
UNRESOLVED: gcc.c-torture/execute/builtins/memcpy-chk.c execution,  -O3 -g 
FAIL: gcc.c-torture/execute/builtins/memcpy-chk.c compilation,  -Os 
UNRESOLVED: gcc.c-torture/execute/builtins/memcpy-chk.c execution,  -Os 
FAIL: gcc.c-torture/execute/builtins/memmove-chk.c compilation,  -O0 
UNRESOLVED: gcc.c-torture/execute/builtins/memmove-chk.c execution,  -O0 
FAIL: gcc.c-torture/execute/builtins/memmove-chk.c compilation,  -O1 
UNRESOLVED: gcc.c-torture/execute/builtins/memmove-chk.c execution,  -O1 
FAIL: gcc.c-torture/execute/builtins/memmove-chk.c compilation,  -O2 
UNRESOLVED: gcc.c-torture/execute/builtins/memmove-chk.c execution,  -O2 
FAIL: gcc.c-torture/execute/builtins/memmove-chk.c compilation,  -O3 -fomit-frame-pointer 
UNRESOLVED: gcc.c-torture/execute/builtins/memmove-chk.c execution,  -O3 -fomit-frame-pointer 
FAIL: gcc.c-torture/execute/builtins/memmove-chk.c compilation,  -O3 -fomit-frame-pointer -funroll-loops 
UNRESOLVED: gcc.c-torture/execute/builtins/memmove-chk.c execution,  -O3 -fomit-frame-pointer -funroll-loops 
FAIL: gcc.c-torture/execute/builtins/memmove-chk.c compilation,  -O3 -fomit-frame-pointer -funroll-all-loops -finline-functions 
UNRESOLVED: gcc.c-torture/execute/builtins/memmove-chk.c execution,  -O3 -fomit-frame-pointer -funroll-all-loops -finline-functions 
FAIL: gcc.c-torture/execute/builtins/memmove-chk.c compilation,  -O3 -g 
UNRESOLVED: gcc.c-torture/execute/builtins/memmove-chk.c execution,  -O3 -g 
FAIL: gcc.c-torture/execute/builtins/memmove-chk.c compilation,  -Os 
UNRESOLVED: gcc.c-torture/execute/builtins/memmove-chk.c execution,  -Os 
FAIL: gcc.c-torture/execute/builtins/mempcpy-chk.c compilation,  -O0 
UNRESOLVED: gcc.c-torture/execute/builtins/mempcpy-chk.c execution,  -O0 
FAIL: gcc.c-torture/execute/builtins/mempcpy-chk.c compilation,  -O1 
UNRESOLVED: gcc.c-torture/execute/builtins/mempcpy-chk.c execution,  -O1 
FAIL: gcc.c-torture/execute/builtins/mempcpy-chk.c compilation,  -O2 
UNRESOLVED: gcc.c-torture/execute/builtins/mempcpy-chk.c execution,  -O2 
FAIL: gcc.c-torture/execute/builtins/mempcpy-chk.c compilation,  -O3 -fomit-frame-pointer 
UNRESOLVED: gcc.c-torture/execute/builtins/mempcpy-chk.c execution,  -O3 -fomit-frame-pointer 
FAIL: gcc.c-torture/execute/builtins/mempcpy-chk.c compilation,  -O3 -fomit-frame-pointer -funroll-loops 
UNRESOLVED: gcc.c-torture/execute/builtins/mempcpy-chk.c execution,  -O3 -fomit-frame-pointer -funroll-loops 
FAIL: gcc.c-torture/execute/builtins/mempcpy-chk.c compilation,  -O3 -fomit-frame-pointer -funroll-all-loops -finline-functions 
UNRESOLVED: gcc.c-torture/execute/builtins/mempcpy-chk.c execution,  -O3 -fomit-frame-pointer -funroll-all-loops -finline-functions 
FAIL: gcc.c-torture/execute/builtins/mempcpy-chk.c compilation,  -O3 -g 
UNRESOLVED: gcc.c-torture/execute/builtins/mempcpy-chk.c execution,  -O3 -g 
FAIL: gcc.c-torture/execute/builtins/mempcpy-chk.c compilation,  -Os 
UNRESOLVED: gcc.c-torture/execute/builtins/mempcpy-chk.c execution,  -Os 
FAIL: gcc.c-torture/execute/builtins/memset-chk.c compilation,  -O0 
UNRESOLVED: gcc.c-torture/execute/builtins/memset-chk.c execution,  -O0 
FAIL: gcc.c-torture/execute/builtins/memset-chk.c compilation,  -O1 
UNRESOLVED: gcc.c-torture/execute/builtins/memset-chk.c execution,  -O1 
FAIL: gcc.c-torture/execute/builtins/memset-chk.c compilation,  -O2 
UNRESOLVED: gcc.c-torture/execute/builtins/memset-chk.c execution,  -O2 
FAIL: gcc.c-torture/execute/builtins/memset-chk.c compilation,  -O3 -fomit-frame-pointer 
UNRESOLVED: gcc.c-torture/execute/builtins/memset-chk.c execution,  -O3 -fomit-frame-pointer 
FAIL: gcc.c-torture/execute/builtins/memset-chk.c compilation,  -O3 -fomit-frame-pointer -funroll-loops 
UNRESOLVED: gcc.c-torture/execute/builtins/memset-chk.c execution,  -O3 -fomit-frame-pointer -funroll-loops 
FAIL: gcc.c-torture/execute/builtins/memset-chk.c compilation,  -O3 -fomit-frame-pointer -funroll-all-loops -finline-functions 
UNRESOLVED: gcc.c-torture/execute/builtins/memset-chk.c execution,  -O3 -fomit-frame-pointer -funroll-all-loops -finline-functions 
FAIL: gcc.c-torture/execute/builtins/memset-chk.c compilation,  -O3 -g 
UNRESOLVED: gcc.c-torture/execute/builtins/memset-chk.c execution,  -O3 -g 
FAIL: gcc.c-torture/execute/builtins/memset-chk.c compilation,  -Os 
UNRESOLVED: gcc.c-torture/execute/builtins/memset-chk.c execution,  -Os 
FAIL: gcc.c-torture/execute/builtins/pr23484-chk.c compilation,  -O0 
UNRESOLVED: gcc.c-torture/execute/builtins/pr23484-chk.c execution,  -O0 
FAIL: gcc.c-torture/execute/builtins/pr23484-chk.c compilation,  -O1 
UNRESOLVED: gcc.c-torture/execute/builtins/pr23484-chk.c execution,  -O1 
FAIL: gcc.c-torture/execute/builtins/pr23484-chk.c compilation,  -O2 
UNRESOLVED: gcc.c-torture/execute/builtins/pr23484-chk.c execution,  -O2 
FAIL: gcc.c-torture/execute/builtins/pr23484-chk.c compilation,  -O3 -fomit-frame-pointer 
UNRESOLVED: gcc.c-torture/execute/builtins/pr23484-chk.c execution,  -O3 -fomit-frame-pointer 
FAIL: gcc.c-torture/execute/builtins/pr23484-chk.c compilation,  -O3 -g 
UNRESOLVED: gcc.c-torture/execute/builtins/pr23484-chk.c execution,  -O3 -g 
FAIL: gcc.c-torture/execute/builtins/pr23484-chk.c compilation,  -Os 
UNRESOLVED: gcc.c-torture/execute/builtins/pr23484-chk.c execution,  -Os 
FAIL: gcc.c-torture/execute/builtins/snprintf-chk.c compilation,  -O0 
UNRESOLVED: gcc.c-torture/execute/builtins/snprintf-chk.c execution,  -O0 
FAIL: gcc.c-torture/execute/builtins/snprintf-chk.c compilation,  -O1 
UNRESOLVED: gcc.c-torture/execute/builtins/snprintf-chk.c execution,  -O1 
FAIL: gcc.c-torture/execute/builtins/snprintf-chk.c compilation,  -O2 
UNRESOLVED: gcc.c-torture/execute/builtins/snprintf-chk.c execution,  -O2 
FAIL: gcc.c-torture/execute/builtins/snprintf-chk.c compilation,  -O3 -fomit-frame-pointer 
UNRESOLVED: gcc.c-torture/execute/builtins/snprintf-chk.c execution,  -O3 -fomit-frame-pointer 
FAIL: gcc.c-torture/execute/builtins/snprintf-chk.c compilation,  -O3 -fomit-frame-pointer -funroll-loops 
UNRESOLVED: gcc.c-torture/execute/builtins/snprintf-chk.c execution,  -O3 -fomit-frame-pointer -funroll-loops 
FAIL: gcc.c-torture/execute/builtins/snprintf-chk.c compilation,  -O3 -fomit-frame-pointer -funroll-all-loops -finline-functions 
UNRESOLVED: gcc.c-torture/execute/builtins/snprintf-chk.c execution,  -O3 -fomit-frame-pointer -funroll-all-loops -finline-functions 
FAIL: gcc.c-torture/execute/builtins/snprintf-chk.c compilation,  -O3 -g 
UNRESOLVED: gcc.c-torture/execute/builtins/snprintf-chk.c execution,  -O3 -g 
FAIL: gcc.c-torture/execute/builtins/snprintf-chk.c compilation,  -Os 
UNRESOLVED: gcc.c-torture/execute/builtins/snprintf-chk.c execution,  -Os 
FAIL: gcc.c-torture/execute/builtins/sprintf-chk.c compilation,  -O0 
UNRESOLVED: gcc.c-torture/execute/builtins/sprintf-chk.c execution,  -O0 
FAIL: gcc.c-torture/execute/builtins/sprintf-chk.c compilation,  -O1 
UNRESOLVED: gcc.c-torture/execute/builtins/sprintf-chk.c execution,  -O1 
FAIL: gcc.c-torture/execute/builtins/sprintf-chk.c compilation,  -O2 
UNRESOLVED: gcc.c-torture/execute/builtins/sprintf-chk.c execution,  -O2 
FAIL: gcc.c-torture/execute/builtins/sprintf-chk.c compilation,  -O3 -fomit-frame-pointer 
UNRESOLVED: gcc.c-torture/execute/builtins/sprintf-chk.c execution,  -O3 -fomit-frame-pointer 
FAIL: gcc.c-torture/execute/builtins/sprintf-chk.c compilation,  -O3 -fomit-frame-pointer -funroll-loops 
UNRESOLVED: gcc.c-torture/execute/builtins/sprintf-chk.c execution,  -O3 -fomit-frame-pointer -funroll-loops 
FAIL: gcc.c-torture/execute/builtins/sprintf-chk.c compilation,  -O3 -fomit-frame-pointer -funroll-all-loops -finline-functions 
UNRESOLVED: gcc.c-torture/execute/builtins/sprintf-chk.c execution,  -O3 -fomit-frame-pointer -funroll-all-loops -finline-functions 
FAIL: gcc.c-torture/execute/builtins/sprintf-chk.c compilation,  -O3 -g 
UNRESOLVED: gcc.c-torture/execute/builtins/sprintf-chk.c execution,  -O3 -g 
FAIL: gcc.c-torture/execute/builtins/sprintf-chk.c compilation,  -Os 
UNRESOLVED: gcc.c-torture/execute/builtins/sprintf-chk.c execution,  -Os 
FAIL: gcc.c-torture/execute/builtins/stpcpy-chk.c compilation,  -O0 
UNRESOLVED: gcc.c-torture/execute/builtins/stpcpy-chk.c execution,  -O0 
FAIL: gcc.c-torture/execute/builtins/stpcpy-chk.c compilation,  -O1 
UNRESOLVED: gcc.c-torture/execute/builtins/stpcpy-chk.c execution,  -O1 
FAIL: gcc.c-torture/execute/builtins/stpcpy-chk.c compilation,  -O2 
UNRESOLVED: gcc.c-torture/execute/builtins/stpcpy-chk.c execution,  -O2 
FAIL: gcc.c-torture/execute/builtins/stpcpy-chk.c compilation,  -O3 -fomit-frame-pointer 
UNRESOLVED: gcc.c-torture/execute/builtins/stpcpy-chk.c execution,  -O3 -fomit-frame-pointer 
FAIL: gcc.c-torture/execute/builtins/stpcpy-chk.c compilation,  -O3 -fomit-frame-pointer -funroll-loops 
UNRESOLVED: gcc.c-torture/execute/builtins/stpcpy-chk.c execution,  -O3 -fomit-frame-pointer -funroll-loops 
FAIL: gcc.c-torture/execute/builtins/stpcpy-chk.c compilation,  -O3 -fomit-frame-pointer -funroll-all-loops -finline-functions 
UNRESOLVED: gcc.c-torture/execute/builtins/stpcpy-chk.c execution,  -O3 -fomit-frame-pointer -funroll-all-loops -finline-functions 
FAIL: gcc.c-torture/execute/builtins/stpcpy-chk.c compilation,  -O3 -g 
UNRESOLVED: gcc.c-torture/execute/builtins/stpcpy-chk.c execution,  -O3 -g 
FAIL: gcc.c-torture/execute/builtins/stpcpy-chk.c compilation,  -Os 
UNRESOLVED: gcc.c-torture/execute/builtins/stpcpy-chk.c execution,  -Os 
FAIL: gcc.c-torture/execute/builtins/strcat-chk.c compilation,  -O0 
UNRESOLVED: gcc.c-torture/execute/builtins/strcat-chk.c execution,  -O0 
FAIL: gcc.c-torture/execute/builtins/strcat-chk.c compilation,  -O1 
UNRESOLVED: gcc.c-torture/execute/builtins/strcat-chk.c execution,  -O1 
FAIL: gcc.c-torture/execute/builtins/strcat-chk.c compilation,  -O2 
UNRESOLVED: gcc.c-torture/execute/builtins/strcat-chk.c execution,  -O2 
FAIL: gcc.c-torture/execute/builtins/strcat-chk.c compilation,  -O3 -fomit-frame-pointer 
UNRESOLVED: gcc.c-torture/execute/builtins/strcat-chk.c execution,  -O3 -fomit-frame-pointer 
FAIL: gcc.c-torture/execute/builtins/strcat-chk.c compilation,  -O3 -fomit-frame-pointer -funroll-loops 
UNRESOLVED: gcc.c-torture/execute/builtins/strcat-chk.c execution,  -O3 -fomit-frame-pointer -funroll-loops 
FAIL: gcc.c-torture/execute/builtins/strcat-chk.c compilation,  -O3 -fomit-frame-pointer -funroll-all-loops -finline-functions 
UNRESOLVED: gcc.c-torture/execute/builtins/strcat-chk.c execution,  -O3 -fomit-frame-pointer -funroll-all-loops -finline-functions 
FAIL: gcc.c-torture/execute/builtins/strcat-chk.c compilation,  -O3 -g 
UNRESOLVED: gcc.c-torture/execute/builtins/strcat-chk.c execution,  -O3 -g 
FAIL: gcc.c-torture/execute/builtins/strcat-chk.c compilation,  -Os 
UNRESOLVED: gcc.c-torture/execute/builtins/strcat-chk.c execution,  -Os 
FAIL: gcc.c-torture/execute/builtins/strcpy-chk.c compilation,  -O0 
UNRESOLVED: gcc.c-torture/execute/builtins/strcpy-chk.c execution,  -O0 
FAIL: gcc.c-torture/execute/builtins/strcpy-chk.c compilation,  -O1 
UNRESOLVED: gcc.c-torture/execute/builtins/strcpy-chk.c execution,  -O1 
FAIL: gcc.c-torture/execute/builtins/strcpy-chk.c compilation,  -O2 
UNRESOLVED: gcc.c-torture/execute/builtins/strcpy-chk.c execution,  -O2 
FAIL: gcc.c-torture/execute/builtins/strcpy-chk.c compilation,  -O3 -fomit-frame-pointer 
UNRESOLVED: gcc.c-torture/execute/builtins/strcpy-chk.c execution,  -O3 -fomit-frame-pointer 
FAIL: gcc.c-torture/execute/builtins/strcpy-chk.c compilation,  -O3 -fomit-frame-pointer -funroll-loops 
UNRESOLVED: gcc.c-torture/execute/builtins/strcpy-chk.c execution,  -O3 -fomit-frame-pointer -funroll-loops 
FAIL: gcc.c-torture/execute/builtins/strcpy-chk.c compilation,  -O3 -fomit-frame-pointer -funroll-all-loops -finline-functions 
UNRESOLVED: gcc.c-torture/execute/builtins/strcpy-chk.c execution,  -O3 -fomit-frame-pointer -funroll-all-loops -finline-functions 
FAIL: gcc.c-torture/execute/builtins/strcpy-chk.c compilation,  -O3 -g 
UNRESOLVED: gcc.c-torture/execute/builtins/strcpy-chk.c execution,  -O3 -g 
FAIL: gcc.c-torture/execute/builtins/strcpy-chk.c compilation,  -Os 
UNRESOLVED: gcc.c-torture/execute/builtins/strcpy-chk.c execution,  -Os 
FAIL: gcc.c-torture/execute/builtins/strncat-chk.c compilation,  -O0 
UNRESOLVED: gcc.c-torture/execute/builtins/strncat-chk.c execution,  -O0 
FAIL: gcc.c-torture/execute/builtins/strncat-chk.c compilation,  -O1 
UNRESOLVED: gcc.c-torture/execute/builtins/strncat-chk.c execution,  -O1 
FAIL: gcc.c-torture/execute/builtins/strncat-chk.c compilation,  -O2 
UNRESOLVED: gcc.c-torture/execute/builtins/strncat-chk.c execution,  -O2 
FAIL: gcc.c-torture/execute/builtins/strncat-chk.c compilation,  -O3 -fomit-frame-pointer 
UNRESOLVED: gcc.c-torture/execute/builtins/strncat-chk.c execution,  -O3 -fomit-frame-pointer 
FAIL: gcc.c-torture/execute/builtins/strncat-chk.c compilation,  -O3 -fomit-frame-pointer -funroll-loops 
UNRESOLVED: gcc.c-torture/execute/builtins/strncat-chk.c execution,  -O3 -fomit-frame-pointer -funroll-loops 
FAIL: gcc.c-torture/execute/builtins/strncat-chk.c compilation,  -O3 -fomit-frame-pointer -funroll-all-loops -finline-functions 
UNRESOLVED: gcc.c-torture/execute/builtins/strncat-chk.c execution,  -O3 -fomit-frame-pointer -funroll-all-loops -finline-functions 
FAIL: gcc.c-torture/execute/builtins/strncat-chk.c compilation,  -O3 -g 
UNRESOLVED: gcc.c-torture/execute/builtins/strncat-chk.c execution,  -O3 -g 
FAIL: gcc.c-torture/execute/builtins/strncat-chk.c compilation,  -Os 
UNRESOLVED: gcc.c-torture/execute/builtins/strncat-chk.c execution,  -Os 
FAIL: gcc.c-torture/execute/builtins/strncpy-chk.c compilation,  -O0 
UNRESOLVED: gcc.c-torture/execute/builtins/strncpy-chk.c execution,  -O0 
FAIL: gcc.c-torture/execute/builtins/strncpy-chk.c compilation,  -O1 
UNRESOLVED: gcc.c-torture/execute/builtins/strncpy-chk.c execution,  -O1 
FAIL: gcc.c-torture/execute/builtins/strncpy-chk.c compilation,  -O2 
UNRESOLVED: gcc.c-torture/execute/builtins/strncpy-chk.c execution,  -O2 
FAIL: gcc.c-torture/execute/builtins/strncpy-chk.c compilation,  -O3 -fomit-frame-pointer 
UNRESOLVED: gcc.c-torture/execute/builtins/strncpy-chk.c execution,  -O3 -fomit-frame-pointer 
FAIL: gcc.c-torture/execute/builtins/strncpy-chk.c compilation,  -O3 -fomit-frame-pointer -funroll-loops 
UNRESOLVED: gcc.c-torture/execute/builtins/strncpy-chk.c execution,  -O3 -fomit-frame-pointer -funroll-loops 
FAIL: gcc.c-torture/execute/builtins/strncpy-chk.c compilation,  -O3 -fomit-frame-pointer -funroll-all-loops -finline-functions 
UNRESOLVED: gcc.c-torture/execute/builtins/strncpy-chk.c execution,  -O3 -fomit-frame-pointer -funroll-all-loops -finline-functions 
FAIL: gcc.c-torture/execute/builtins/strncpy-chk.c compilation,  -O3 -g 
UNRESOLVED: gcc.c-torture/execute/builtins/strncpy-chk.c execution,  -O3 -g 
FAIL: gcc.c-torture/execute/builtins/strncpy-chk.c compilation,  -Os 
UNRESOLVED: gcc.c-torture/execute/builtins/strncpy-chk.c execution,  -Os 
FAIL: gcc.c-torture/execute/builtins/vsnprintf-chk.c compilation,  -O0 
UNRESOLVED: gcc.c-torture/execute/builtins/vsnprintf-chk.c execution,  -O0 
FAIL: gcc.c-torture/execute/builtins/vsnprintf-chk.c compilation,  -O1 
UNRESOLVED: gcc.c-torture/execute/builtins/vsnprintf-chk.c execution,  -O1 
FAIL: gcc.c-torture/execute/builtins/vsnprintf-chk.c compilation,  -O2 
UNRESOLVED: gcc.c-torture/execute/builtins/vsnprintf-chk.c execution,  -O2 
FAIL: gcc.c-torture/execute/builtins/vsnprintf-chk.c compilation,  -O3 -fomit-frame-pointer 
UNRESOLVED: gcc.c-torture/execute/builtins/vsnprintf-chk.c execution,  -O3 -fomit-frame-pointer 
FAIL: gcc.c-torture/execute/builtins/vsnprintf-chk.c compilation,  -O3 -fomit-frame-pointer -funroll-loops 
UNRESOLVED: gcc.c-torture/execute/builtins/vsnprintf-chk.c execution,  -O3 -fomit-frame-pointer -funroll-loops 
FAIL: gcc.c-torture/execute/builtins/vsnprintf-chk.c compilation,  -O3 -fomit-frame-pointer -funroll-all-loops -finline-functions 
UNRESOLVED: gcc.c-torture/execute/builtins/vsnprintf-chk.c execution,  -O3 -fomit-frame-pointer -funroll-all-loops -finline-functions 
FAIL: gcc.c-torture/execute/builtins/vsnprintf-chk.c compilation,  -O3 -g 
UNRESOLVED: gcc.c-torture/execute/builtins/vsnprintf-chk.c execution,  -O3 -g 
FAIL: gcc.c-torture/execute/builtins/vsnprintf-chk.c compilation,  -Os 
UNRESOLVED: gcc.c-torture/execute/builtins/vsnprintf-chk.c execution,  -Os 
FAIL: gcc.c-torture/execute/builtins/vsprintf-chk.c compilation,  -O0 
UNRESOLVED: gcc.c-torture/execute/builtins/vsprintf-chk.c execution,  -O0 
FAIL: gcc.c-torture/execute/builtins/vsprintf-chk.c compilation,  -O1 
UNRESOLVED: gcc.c-torture/execute/builtins/vsprintf-chk.c execution,  -O1 
FAIL: gcc.c-torture/execute/builtins/vsprintf-chk.c compilation,  -O2 
UNRESOLVED: gcc.c-torture/execute/builtins/vsprintf-chk.c execution,  -O2 
FAIL: gcc.c-torture/execute/builtins/vsprintf-chk.c compilation,  -O3 -fomit-frame-pointer 
UNRESOLVED: gcc.c-torture/execute/builtins/vsprintf-chk.c execution,  -O3 -fomit-frame-pointer 
FAIL: gcc.c-torture/execute/builtins/vsprintf-chk.c compilation,  -O3 -fomit-frame-pointer -funroll-loops 
UNRESOLVED: gcc.c-torture/execute/builtins/vsprintf-chk.c execution,  -O3 -fomit-frame-pointer -funroll-loops 
FAIL: gcc.c-torture/execute/builtins/vsprintf-chk.c compilation,  -O3 -fomit-frame-pointer -funroll-all-loops -finline-functions 
UNRESOLVED: gcc.c-torture/execute/builtins/vsprintf-chk.c execution,  -O3 -fomit-frame-pointer -funroll-all-loops -finline-functions 
FAIL: gcc.c-torture/execute/builtins/vsprintf-chk.c compilation,  -O3 -g 
UNRESOLVED: gcc.c-torture/execute/builtins/vsprintf-chk.c execution,  -O3 -g 
FAIL: gcc.c-torture/execute/builtins/vsprintf-chk.c compilation,  -Os 
UNRESOLVED: gcc.c-torture/execute/builtins/vsprintf-chk.c execution,  -Os 
FAIL: gcc.c-torture/execute/20010122-1.c execution,  -O0 
FAIL: gcc.c-torture/execute/20010122-1.c execution,  -O1 
FAIL: gcc.c-torture/execute/20010122-1.c execution,  -O2 
FAIL: gcc.c-torture/execute/20010122-1.c execution,  -O3 -g 
FAIL: gcc.c-torture/execute/20010122-1.c execution,  -Os 
FAIL: gcc.c-torture/execute/20021127-1.c compilation,  -O0 
UNRESOLVED: gcc.c-torture/execute/20021127-1.c execution,  -O0 
FAIL: gcc.c-torture/execute/20021127-1.c compilation,  -O1 
UNRESOLVED: gcc.c-torture/execute/20021127-1.c execution,  -O1 
FAIL: gcc.c-torture/execute/20021127-1.c compilation,  -O2 
UNRESOLVED: gcc.c-torture/execute/20021127-1.c execution,  -O2 
FAIL: gcc.c-torture/execute/20021127-1.c compilation,  -O3 -fomit-frame-pointer 
UNRESOLVED: gcc.c-torture/execute/20021127-1.c execution,  -O3 -fomit-frame-pointer 
FAIL: gcc.c-torture/execute/20021127-1.c compilation,  -O3 -g 
UNRESOLVED: gcc.c-torture/execute/20021127-1.c execution,  -O3 -g 
FAIL: gcc.c-torture/execute/20021127-1.c compilation,  -Os 
UNRESOLVED: gcc.c-torture/execute/20021127-1.c execution,  -Os 
FAIL: gcc.c-torture/execute/20071211-1.c compilation,  -O0 
UNRESOLVED: gcc.c-torture/execute/20071211-1.c execution,  -O0 
FAIL: gcc.c-torture/execute/20071211-1.c compilation,  -O1 
UNRESOLVED: gcc.c-torture/execute/20071211-1.c execution,  -O1 
FAIL: gcc.c-torture/execute/20071211-1.c compilation,  -O2 
UNRESOLVED: gcc.c-torture/execute/20071211-1.c execution,  -O2 
FAIL: gcc.c-torture/execute/20071211-1.c compilation,  -O3 -fomit-frame-pointer 
UNRESOLVED: gcc.c-torture/execute/20071211-1.c execution,  -O3 -fomit-frame-pointer 
FAIL: gcc.c-torture/execute/20071211-1.c compilation,  -O3 -g 
UNRESOLVED: gcc.c-torture/execute/20071211-1.c execution,  -O3 -g 
FAIL: gcc.c-torture/execute/20071211-1.c compilation,  -Os 
UNRESOLVED: gcc.c-torture/execute/20071211-1.c execution,  -Os 
FAIL: gcc.c-torture/execute/built-in-setjmp.c execution,  -O2 
FAIL: gcc.c-torture/execute/built-in-setjmp.c execution,  -O3 -fomit-frame-pointer 
FAIL: gcc.c-torture/execute/built-in-setjmp.c execution,  -O3 -fomit-frame-pointer -funroll-loops 
FAIL: gcc.c-torture/execute/built-in-setjmp.c execution,  -O3 -fomit-frame-pointer -funroll-all-loops -finline-functions 
FAIL: gcc.c-torture/execute/built-in-setjmp.c execution,  -O3 -g 
FAIL: gcc.c-torture/execute/built-in-setjmp.c execution,  -Os 
FAIL: gcc.c-torture/execute/builtin-bitops-1.c compilation,  -O0 
UNRESOLVED: gcc.c-torture/execute/builtin-bitops-1.c execution,  -O0 
FAIL: gcc.c-torture/execute/builtin-bitops-1.c compilation,  -O1 
UNRESOLVED: gcc.c-torture/execute/builtin-bitops-1.c execution,  -O1 
FAIL: gcc.c-torture/execute/builtin-bitops-1.c compilation,  -O2 
UNRESOLVED: gcc.c-torture/execute/builtin-bitops-1.c execution,  -O2 
FAIL: gcc.c-torture/execute/builtin-bitops-1.c compilation,  -O3 -fomit-frame-pointer 
UNRESOLVED: gcc.c-torture/execute/builtin-bitops-1.c execution,  -O3 -fomit-frame-pointer 
FAIL: gcc.c-torture/execute/builtin-bitops-1.c compilation,  -O3 -fomit-frame-pointer -funroll-loops 
UNRESOLVED: gcc.c-torture/execute/builtin-bitops-1.c execution,  -O3 -fomit-frame-pointer -funroll-loops 
FAIL: gcc.c-torture/execute/builtin-bitops-1.c compilation,  -O3 -fomit-frame-pointer -funroll-all-loops -finline-functions 
UNRESOLVED: gcc.c-torture/execute/builtin-bitops-1.c execution,  -O3 -fomit-frame-pointer -funroll-all-loops -finline-functions 
FAIL: gcc.c-torture/execute/builtin-bitops-1.c compilation,  -O3 -g 
UNRESOLVED: gcc.c-torture/execute/builtin-bitops-1.c execution,  -O3 -g 
FAIL: gcc.c-torture/execute/builtin-bitops-1.c compilation,  -Os 
UNRESOLVED: gcc.c-torture/execute/builtin-bitops-1.c execution,  -Os 
FAIL: gcc.c-torture/execute/ffs-1.c compilation,  -O0 
UNRESOLVED: gcc.c-torture/execute/ffs-1.c execution,  -O0 
FAIL: gcc.c-torture/execute/ffs-1.c compilation,  -O1 
UNRESOLVED: gcc.c-torture/execute/ffs-1.c execution,  -O1 
FAIL: gcc.c-torture/execute/ffs-1.c compilation,  -O2 
UNRESOLVED: gcc.c-torture/execute/ffs-1.c execution,  -O2 
FAIL: gcc.c-torture/execute/ffs-1.c compilation,  -O3 -fomit-frame-pointer 
UNRESOLVED: gcc.c-torture/execute/ffs-1.c execution,  -O3 -fomit-frame-pointer 
FAIL: gcc.c-torture/execute/ffs-1.c compilation,  -O3 -g 
UNRESOLVED: gcc.c-torture/execute/ffs-1.c execution,  -O3 -g 
FAIL: gcc.c-torture/execute/ffs-1.c compilation,  -Os 
UNRESOLVED: gcc.c-torture/execute/ffs-1.c execution,  -Os 
FAIL: gcc.c-torture/execute/ffs-2.c compilation,  -O0 
UNRESOLVED: gcc.c-torture/execute/ffs-2.c execution,  -O0 
FAIL: gcc.c-torture/execute/ffs-2.c compilation,  -O1 
UNRESOLVED: gcc.c-torture/execute/ffs-2.c execution,  -O1 
FAIL: gcc.c-torture/execute/ffs-2.c compilation,  -O2 
UNRESOLVED: gcc.c-torture/execute/ffs-2.c execution,  -O2 
FAIL: gcc.c-torture/execute/ffs-2.c compilation,  -O3 -fomit-frame-pointer 
UNRESOLVED: gcc.c-torture/execute/ffs-2.c execution,  -O3 -fomit-frame-pointer 
FAIL: gcc.c-torture/execute/ffs-2.c compilation,  -O3 -fomit-frame-pointer -funroll-loops 
UNRESOLVED: gcc.c-torture/execute/ffs-2.c execution,  -O3 -fomit-frame-pointer -funroll-loops 
FAIL: gcc.c-torture/execute/ffs-2.c compilation,  -O3 -fomit-frame-pointer -funroll-all-loops -finline-functions 
UNRESOLVED: gcc.c-torture/execute/ffs-2.c execution,  -O3 -fomit-frame-pointer -funroll-all-loops -finline-functions 
FAIL: gcc.c-torture/execute/ffs-2.c compilation,  -O3 -g 
UNRESOLVED: gcc.c-torture/execute/ffs-2.c execution,  -O3 -g 
FAIL: gcc.c-torture/execute/ffs-2.c compilation,  -Os 
UNRESOLVED: gcc.c-torture/execute/ffs-2.c execution,  -Os 
FAIL: gcc.c-torture/execute/float-floor.c execution,  -O0 
FAIL: gcc.c-torture/execute/float-floor.c execution,  -O1 
FAIL: gcc.c-torture/execute/float-floor.c execution,  -O2 
FAIL: gcc.c-torture/execute/float-floor.c execution,  -O3 -fomit-frame-pointer 
FAIL: gcc.c-torture/execute/float-floor.c execution,  -O3 -g 
FAIL: gcc.c-torture/execute/float-floor.c execution,  -Os 
FAIL: gcc.c-torture/execute/pr17377.c execution,  -O0 
FAIL: gcc.c-torture/execute/pr17377.c execution,  -O1 
FAIL: gcc.c-torture/execute/pr17377.c execution,  -O2 
FAIL: gcc.c-torture/execute/pr17377.c execution,  -O3 -fomit-frame-pointer 
FAIL: gcc.c-torture/execute/pr17377.c execution,  -O3 -g 
FAIL: gcc.c-torture/execute/pr17377.c execution,  -Os 
FAIL: gcc.c-torture/execute/pr22493-1.c execution,  -O1 
FAIL: gcc.c-torture/execute/pr22493-1.c execution,  -O2 
FAIL: gcc.c-torture/execute/pr22493-1.c execution,  -Os 
FAIL: gcc.c-torture/execute/pr35163.c execution,  -O0 
FAIL: gcc.c-torture/execute/pr35163.c execution,  -O1 
FAIL: gcc.c-torture/execute/pr35163.c execution,  -O2 
FAIL: gcc.c-torture/execute/pr35163.c execution,  -O3 -fomit-frame-pointer 
FAIL: gcc.c-torture/execute/pr35163.c execution,  -O3 -g 
FAIL: gcc.c-torture/execute/pr35163.c execution,  -Os 
FAIL: gcc.c-torture/execute/ieee/fp-cmp-1.c compilation,  -O0 
UNRESOLVED: gcc.c-torture/execute/ieee/fp-cmp-1.c execution,  -O0 
FAIL: gcc.c-torture/execute/ieee/fp-cmp-1.c compilation,  -O1 
UNRESOLVED: gcc.c-torture/execute/ieee/fp-cmp-1.c execution,  -O1 
FAIL: gcc.c-torture/execute/ieee/fp-cmp-1.c compilation,  -O2 
UNRESOLVED: gcc.c-torture/execute/ieee/fp-cmp-1.c execution,  -O2 
FAIL: gcc.c-torture/execute/ieee/fp-cmp-1.c compilation,  -O3 -fomit-frame-pointer 
UNRESOLVED: gcc.c-torture/execute/ieee/fp-cmp-1.c execution,  -O3 -fomit-frame-pointer 
FAIL: gcc.c-torture/execute/ieee/fp-cmp-1.c compilation,  -O3 -fomit-frame-pointer -funroll-loops 
UNRESOLVED: gcc.c-torture/execute/ieee/fp-cmp-1.c execution,  -O3 -fomit-frame-pointer -funroll-loops 
FAIL: gcc.c-torture/execute/ieee/fp-cmp-1.c compilation,  -O3 -fomit-frame-pointer -funroll-all-loops -finline-functions 
UNRESOLVED: gcc.c-torture/execute/ieee/fp-cmp-1.c execution,  -O3 -fomit-frame-pointer -funroll-all-loops -finline-functions 
FAIL: gcc.c-torture/execute/ieee/fp-cmp-1.c compilation,  -O3 -g 
UNRESOLVED: gcc.c-torture/execute/ieee/fp-cmp-1.c execution,  -O3 -g 
FAIL: gcc.c-torture/execute/ieee/fp-cmp-1.c compilation,  -Os 
UNRESOLVED: gcc.c-torture/execute/ieee/fp-cmp-1.c execution,  -Os 
FAIL: gcc.c-torture/execute/ieee/fp-cmp-2.c compilation,  -O0 
UNRESOLVED: gcc.c-torture/execute/ieee/fp-cmp-2.c execution,  -O0 
FAIL: gcc.c-torture/execute/ieee/fp-cmp-2.c compilation,  -O1 
UNRESOLVED: gcc.c-torture/execute/ieee/fp-cmp-2.c execution,  -O1 
FAIL: gcc.c-torture/execute/ieee/fp-cmp-2.c compilation,  -O2 
UNRESOLVED: gcc.c-torture/execute/ieee/fp-cmp-2.c execution,  -O2 
FAIL: gcc.c-torture/execute/ieee/fp-cmp-2.c compilation,  -O3 -fomit-frame-pointer 
UNRESOLVED: gcc.c-torture/execute/ieee/fp-cmp-2.c execution,  -O3 -fomit-frame-pointer 
FAIL: gcc.c-torture/execute/ieee/fp-cmp-2.c compilation,  -O3 -fomit-frame-pointer -funroll-loops 
UNRESOLVED: gcc.c-torture/execute/ieee/fp-cmp-2.c execution,  -O3 -fomit-frame-pointer -funroll-loops 
FAIL: gcc.c-torture/execute/ieee/fp-cmp-2.c compilation,  -O3 -fomit-frame-pointer -funroll-all-loops -finline-functions 
UNRESOLVED: gcc.c-torture/execute/ieee/fp-cmp-2.c execution,  -O3 -fomit-frame-pointer -funroll-all-loops -finline-functions 
FAIL: gcc.c-torture/execute/ieee/fp-cmp-2.c compilation,  -O3 -g 
UNRESOLVED: gcc.c-torture/execute/ieee/fp-cmp-2.c execution,  -O3 -g 
FAIL: gcc.c-torture/execute/ieee/fp-cmp-2.c compilation,  -Os 
UNRESOLVED: gcc.c-torture/execute/ieee/fp-cmp-2.c execution,  -Os 
FAIL: gcc.c-torture/execute/ieee/fp-cmp-3.c compilation,  -O0 
UNRESOLVED: gcc.c-torture/execute/ieee/fp-cmp-3.c execution,  -O0 
FAIL: gcc.c-torture/execute/ieee/fp-cmp-3.c compilation,  -O1 
UNRESOLVED: gcc.c-torture/execute/ieee/fp-cmp-3.c execution,  -O1 
FAIL: gcc.c-torture/execute/ieee/fp-cmp-3.c compilation,  -O2 
UNRESOLVED: gcc.c-torture/execute/ieee/fp-cmp-3.c execution,  -O2 
FAIL: gcc.c-torture/execute/ieee/fp-cmp-3.c compilation,  -O3 -fomit-frame-pointer 
UNRESOLVED: gcc.c-torture/execute/ieee/fp-cmp-3.c execution,  -O3 -fomit-frame-pointer 
FAIL: gcc.c-torture/execute/ieee/fp-cmp-3.c compilation,  -O3 -fomit-frame-pointer -funroll-loops 
UNRESOLVED: gcc.c-torture/execute/ieee/fp-cmp-3.c execution,  -O3 -fomit-frame-pointer -funroll-loops 
FAIL: gcc.c-torture/execute/ieee/fp-cmp-3.c compilation,  -O3 -fomit-frame-pointer -funroll-all-loops -finline-functions 
UNRESOLVED: gcc.c-torture/execute/ieee/fp-cmp-3.c execution,  -O3 -fomit-frame-pointer -funroll-all-loops -finline-functions 
FAIL: gcc.c-torture/execute/ieee/fp-cmp-3.c compilation,  -O3 -g 
UNRESOLVED: gcc.c-torture/execute/ieee/fp-cmp-3.c execution,  -O3 -g 
FAIL: gcc.c-torture/execute/ieee/fp-cmp-3.c compilation,  -Os 
UNRESOLVED: gcc.c-torture/execute/ieee/fp-cmp-3.c execution,  -Os 
FAIL: gcc.c-torture/execute/ieee/unsafe-fp-assoc-1.c execution,  -O0 
FAIL: gcc.c-torture/execute/ieee/unsafe-fp-assoc-1.c execution,  -O1 
FAIL: gcc.c-torture/execute/ieee/unsafe-fp-assoc-1.c execution,  -O2 
FAIL: gcc.c-torture/execute/ieee/unsafe-fp-assoc-1.c execution,  -O3 -fomit-frame-pointer 
FAIL: gcc.c-torture/execute/ieee/unsafe-fp-assoc-1.c execution,  -O3 -g 
FAIL: gcc.c-torture/execute/ieee/unsafe-fp-assoc-1.c execution,  -Os 
FAIL: gcc.dg/compat/struct-by-value-16 c_compat_x_tst.o-c_compat_y_tst.o link
UNRESOLVED: gcc.dg/compat/struct-by-value-16 c_compat_x_tst.o-c_compat_y_tst.o execute "-Os -mcall-prologues","-Os -mcall-prologues"
FAIL: gcc.dg/compat/struct-by-value-17 c_compat_x_tst.o-c_compat_y_tst.o link
UNRESOLVED: gcc.dg/compat/struct-by-value-17 c_compat_x_tst.o-c_compat_y_tst.o execute "-Os -mcall-prologues","-Os -mcall-prologues"
FAIL: gcc.dg/compat/struct-by-value-18 c_compat_x_tst.o-c_compat_y_tst.o link
UNRESOLVED: gcc.dg/compat/struct-by-value-18 c_compat_x_tst.o-c_compat_y_tst.o execute "-Os -mcall-prologues","-Os -mcall-prologues"
FAIL: gcc.dg/compat/struct-by-value-1 c_compat_x_tst.o-c_compat_y_tst.o execute "-Os -mcall-prologues","-Os -mcall-prologues"
FAIL: gcc.dg/compat/struct-by-value-2 c_compat_x_tst.o-c_compat_y_tst.o execute "-Os -mcall-prologues","-Os -mcall-prologues"
FAIL: gcc.dg/compat/struct-by-value-4 c_compat_x_tst.o-c_compat_y_tst.o execute "-Os -mcall-prologues","-Os -mcall-prologues"
FAIL: gcc.dg/compat/struct-by-value-5b c_compat_x_tst.o-c_compat_y_tst.o execute "-Os -mcall-prologues","-Os -mcall-prologues"
FAIL: gcc.dg/compat/struct-by-value-6b c_compat_x_tst.o-c_compat_y_tst.o execute "-Os -mcall-prologues","-Os -mcall-prologues"
FAIL: gcc.dg/compat/struct-by-value-7b c_compat_x_tst.o-c_compat_y_tst.o execute "-Os -mcall-prologues","-Os -mcall-prologues"
FAIL: gcc.dg/compat/struct-by-value-8 c_compat_x_tst.o-c_compat_y_tst.o execute "-Os -mcall-prologues","-Os -mcall-prologues"
FAIL: gcc.dg/compat/struct-by-value-9 c_compat_x_tst.o-c_compat_y_tst.o execute "-Os -mcall-prologues","-Os -mcall-prologues"
FAIL: gcc.dg/compat/struct-layout-1 c_compat_main_tst.o compile, "-Os -mcall-prologues","-Os -mcall-prologues"
FAIL: gcc.dg/compat/struct-layout-1 c_compat_x_tst.o compile, "-Os -mcall-prologues","-Os -mcall-prologues"
FAIL: gcc.dg/compat/struct-layout-1 c_compat_y_tst.o compile, "-Os -mcall-prologues","-Os -mcall-prologues"
UNRESOLVED: gcc.dg/compat/struct-layout-1 c_compat_x_tst.o-c_compat_y_tst.o link "-Os -mcall-prologues","-Os -mcall-prologues"
UNRESOLVED: gcc.dg/compat/struct-layout-1 c_compat_x_tst.o-c_compat_y_tst.o execute "-Os -mcall-prologues","-Os -mcall-prologues"
FAIL: gcc.dg/compat/struct-return-10 c_compat_x_tst.o-c_compat_y_tst.o execute "-Os -mcall-prologues","-Os -mcall-prologues"
FAIL: gcc.dg/compat/struct-return-2 c_compat_x_tst.o-c_compat_y_tst.o execute "-Os -mcall-prologues","-Os -mcall-prologues"
FAIL: gcc.dg/compat/vector-1 c_compat_x_tst.o compile, "-Os -mcall-prologues","-Os -mcall-prologues"
FAIL: gcc.dg/compat/vector-1 c_compat_y_tst.o compile, "-Os -mcall-prologues","-Os -mcall-prologues"
UNRESOLVED: gcc.dg/compat/vector-1 c_compat_x_tst.o-c_compat_y_tst.o link "-Os -mcall-prologues","-Os -mcall-prologues"
UNRESOLVED: gcc.dg/compat/vector-1 c_compat_x_tst.o-c_compat_y_tst.o execute "-Os -mcall-prologues","-Os -mcall-prologues"
FAIL: gcc.dg/compat/vector-2 c_compat_x_tst.o compile, "-Os -mcall-prologues","-Os -mcall-prologues"
FAIL: gcc.dg/compat/vector-2 c_compat_y_tst.o compile, "-Os -mcall-prologues","-Os -mcall-prologues"
UNRESOLVED: gcc.dg/compat/vector-2 c_compat_x_tst.o-c_compat_y_tst.o link "-Os -mcall-prologues","-Os -mcall-prologues"
UNRESOLVED: gcc.dg/compat/vector-2 c_compat_x_tst.o-c_compat_y_tst.o execute "-Os -mcall-prologues","-Os -mcall-prologues"
FAIL: tmpdir-gcc.dg-struct-layout-1/t001 c_compat_main_tst.o compile, "-Os -mcall-prologues","-Os -mcall-prologues"
FAIL: tmpdir-gcc.dg-struct-layout-1/t001 c_compat_x_tst.o compile, "-Os -mcall-prologues","-Os -mcall-prologues"
FAIL: tmpdir-gcc.dg-struct-layout-1/t001 c_compat_y_tst.o compile, "-Os -mcall-prologues","-Os -mcall-prologues"
UNRESOLVED: tmpdir-gcc.dg-struct-layout-1/t001 c_compat_x_tst.o-c_compat_y_tst.o link "-Os -mcall-prologues","-Os -mcall-prologues"
UNRESOLVED: tmpdir-gcc.dg-struct-layout-1/t001 c_compat_x_tst.o-c_compat_y_tst.o execute "-Os -mcall-prologues","-Os -mcall-prologues"
FAIL: tmpdir-gcc.dg-struct-layout-1/t002 c_compat_main_tst.o compile, "-Os -mcall-prologues","-Os -mcall-prologues"
FAIL: tmpdir-gcc.dg-struct-layout-1/t002 c_compat_x_tst.o compile, "-Os -mcall-prologues","-Os -mcall-prologues"
FAIL: tmpdir-gcc.dg-struct-layout-1/t002 c_compat_y_tst.o compile, "-Os -mcall-prologues","-Os -mcall-prologues"
UNRESOLVED: tmpdir-gcc.dg-struct-layout-1/t002 c_compat_x_tst.o-c_compat_y_tst.o link "-Os -mcall-prologues","-Os -mcall-prologues"
UNRESOLVED: tmpdir-gcc.dg-struct-layout-1/t002 c_compat_x_tst.o-c_compat_y_tst.o execute "-Os -mcall-prologues","-Os -mcall-prologues"
FAIL: tmpdir-gcc.dg-struct-layout-1/t003 c_compat_main_tst.o compile, "-Os -mcall-prologues","-Os -mcall-prologues"
FAIL: tmpdir-gcc.dg-struct-layout-1/t003 c_compat_x_tst.o compile, "-Os -mcall-prologues","-Os -mcall-prologues"
FAIL: tmpdir-gcc.dg-struct-layout-1/t003 c_compat_y_tst.o compile, "-Os -mcall-prologues","-Os -mcall-prologues"
UNRESOLVED: tmpdir-gcc.dg-struct-layout-1/t003 c_compat_x_tst.o-c_compat_y_tst.o link "-Os -mcall-prologues","-Os -mcall-prologues"
UNRESOLVED: tmpdir-gcc.dg-struct-layout-1/t003 c_compat_x_tst.o-c_compat_y_tst.o execute "-Os -mcall-prologues","-Os -mcall-prologues"
FAIL: tmpdir-gcc.dg-struct-layout-1/t004 c_compat_main_tst.o compile, "-Os -mcall-prologues","-Os -mcall-prologues"
FAIL: tmpdir-gcc.dg-struct-layout-1/t004 c_compat_x_tst.o compile, "-Os -mcall-prologues","-Os -mcall-prologues"
FAIL: tmpdir-gcc.dg-struct-layout-1/t004 c_compat_y_tst.o compile, "-Os -mcall-prologues","-Os -mcall-prologues"
UNRESOLVED: tmpdir-gcc.dg-struct-layout-1/t004 c_compat_x_tst.o-c_compat_y_tst.o link "-Os -mcall-prologues","-Os -mcall-prologues"
UNRESOLVED: tmpdir-gcc.dg-struct-layout-1/t004 c_compat_x_tst.o-c_compat_y_tst.o execute "-Os -mcall-prologues","-Os -mcall-prologues"
FAIL: tmpdir-gcc.dg-struct-layout-1/t005 c_compat_main_tst.o compile, "-Os -mcall-prologues","-Os -mcall-prologues"
FAIL: tmpdir-gcc.dg-struct-layout-1/t005 c_compat_x_tst.o compile, "-Os -mcall-prologues","-Os -mcall-prologues"
FAIL: tmpdir-gcc.dg-struct-layout-1/t005 c_compat_y_tst.o compile, "-Os -mcall-prologues","-Os -mcall-prologues"
UNRESOLVED: tmpdir-gcc.dg-struct-layout-1/t005 c_compat_x_tst.o-c_compat_y_tst.o link "-Os -mcall-prologues","-Os -mcall-prologues"
UNRESOLVED: tmpdir-gcc.dg-struct-layout-1/t005 c_compat_x_tst.o-c_compat_y_tst.o execute "-Os -mcall-prologues","-Os -mcall-prologues"
FAIL: tmpdir-gcc.dg-struct-layout-1/t006 c_compat_main_tst.o compile, "-Os -mcall-prologues","-Os -mcall-prologues"
FAIL: tmpdir-gcc.dg-struct-layout-1/t006 c_compat_x_tst.o compile, "-Os -mcall-prologues","-Os -mcall-prologues"
FAIL: tmpdir-gcc.dg-struct-layout-1/t006 c_compat_y_tst.o compile, "-Os -mcall-prologues","-Os -mcall-prologues"
UNRESOLVED: tmpdir-gcc.dg-struct-layout-1/t006 c_compat_x_tst.o-c_compat_y_tst.o link "-Os -mcall-prologues","-Os -mcall-prologues"
UNRESOLVED: tmpdir-gcc.dg-struct-layout-1/t006 c_compat_x_tst.o-c_compat_y_tst.o execute "-Os -mcall-prologues","-Os -mcall-prologues"
FAIL: tmpdir-gcc.dg-struct-layout-1/t007 c_compat_main_tst.o compile, "-Os -mcall-prologues","-Os -mcall-prologues"
FAIL: tmpdir-gcc.dg-struct-layout-1/t007 c_compat_x_tst.o compile, "-Os -mcall-prologues","-Os -mcall-prologues"
FAIL: tmpdir-gcc.dg-struct-layout-1/t007 c_compat_y_tst.o compile, "-Os -mcall-prologues","-Os -mcall-prologues"
UNRESOLVED: tmpdir-gcc.dg-struct-layout-1/t007 c_compat_x_tst.o-c_compat_y_tst.o link "-Os -mcall-prologues","-Os -mcall-prologues"
UNRESOLVED: tmpdir-gcc.dg-struct-layout-1/t007 c_compat_x_tst.o-c_compat_y_tst.o execute "-Os -mcall-prologues","-Os -mcall-prologues"
FAIL: tmpdir-gcc.dg-struct-layout-1/t008 c_compat_main_tst.o compile, "-Os -mcall-prologues","-Os -mcall-prologues"
FAIL: tmpdir-gcc.dg-struct-layout-1/t008 c_compat_x_tst.o compile, "-Os -mcall-prologues","-Os -mcall-prologues"
FAIL: tmpdir-gcc.dg-struct-layout-1/t008 c_compat_y_tst.o compile, "-Os -mcall-prologues","-Os -mcall-prologues"
UNRESOLVED: tmpdir-gcc.dg-struct-layout-1/t008 c_compat_x_tst.o-c_compat_y_tst.o link "-Os -mcall-prologues","-Os -mcall-prologues"
UNRESOLVED: tmpdir-gcc.dg-struct-layout-1/t008 c_compat_x_tst.o-c_compat_y_tst.o execute "-Os -mcall-prologues","-Os -mcall-prologues"
FAIL: tmpdir-gcc.dg-struct-layout-1/t009 c_compat_main_tst.o compile, "-Os -mcall-prologues","-Os -mcall-prologues"
FAIL: tmpdir-gcc.dg-struct-layout-1/t009 c_compat_x_tst.o compile, "-Os -mcall-prologues","-Os -mcall-prologues"
FAIL: tmpdir-gcc.dg-struct-layout-1/t009 c_compat_y_tst.o compile, "-Os -mcall-prologues","-Os -mcall-prologues"
UNRESOLVED: tmpdir-gcc.dg-struct-layout-1/t009 c_compat_x_tst.o-c_compat_y_tst.o link "-Os -mcall-prologues","-Os -mcall-prologues"
UNRESOLVED: tmpdir-gcc.dg-struct-layout-1/t009 c_compat_x_tst.o-c_compat_y_tst.o execute "-Os -mcall-prologues","-Os -mcall-prologues"
FAIL: tmpdir-gcc.dg-struct-layout-1/t010 c_compat_main_tst.o compile, "-Os -mcall-prologues","-Os -mcall-prologues"
FAIL: tmpdir-gcc.dg-struct-layout-1/t010 c_compat_x_tst.o compile, "-Os -mcall-prologues","-Os -mcall-prologues"
FAIL: tmpdir-gcc.dg-struct-layout-1/t010 c_compat_y_tst.o compile, "-Os -mcall-prologues","-Os -mcall-prologues"
UNRESOLVED: tmpdir-gcc.dg-struct-layout-1/t010 c_compat_x_tst.o-c_compat_y_tst.o link "-Os -mcall-prologues","-Os -mcall-prologues"
UNRESOLVED: tmpdir-gcc.dg-struct-layout-1/t010 c_compat_x_tst.o-c_compat_y_tst.o execute "-Os -mcall-prologues","-Os -mcall-prologues"
FAIL: tmpdir-gcc.dg-struct-layout-1/t011 c_compat_main_tst.o compile, "-Os -mcall-prologues","-Os -mcall-prologues"
FAIL: tmpdir-gcc.dg-struct-layout-1/t011 c_compat_x_tst.o compile, "-Os -mcall-prologues","-Os -mcall-prologues"
FAIL: tmpdir-gcc.dg-struct-layout-1/t011 c_compat_y_tst.o compile, "-Os -mcall-prologues","-Os -mcall-prologues"
UNRESOLVED: tmpdir-gcc.dg-struct-layout-1/t011 c_compat_x_tst.o-c_compat_y_tst.o link "-Os -mcall-prologues","-Os -mcall-prologues"
UNRESOLVED: tmpdir-gcc.dg-struct-layout-1/t011 c_compat_x_tst.o-c_compat_y_tst.o execute "-Os -mcall-prologues","-Os -mcall-prologues"
FAIL: tmpdir-gcc.dg-struct-layout-1/t012 c_compat_main_tst.o compile, "-Os -mcall-prologues","-Os -mcall-prologues"
FAIL: tmpdir-gcc.dg-struct-layout-1/t012 c_compat_x_tst.o compile, "-Os -mcall-prologues","-Os -mcall-prologues"
FAIL: tmpdir-gcc.dg-struct-layout-1/t012 c_compat_y_tst.o compile, "-Os -mcall-prologues","-Os -mcall-prologues"
UNRESOLVED: tmpdir-gcc.dg-struct-layout-1/t012 c_compat_x_tst.o-c_compat_y_tst.o link "-Os -mcall-prologues","-Os -mcall-prologues"
UNRESOLVED: tmpdir-gcc.dg-struct-layout-1/t012 c_compat_x_tst.o-c_compat_y_tst.o execute "-Os -mcall-prologues","-Os -mcall-prologues"
FAIL: tmpdir-gcc.dg-struct-layout-1/t013 c_compat_main_tst.o compile, "-Os -mcall-prologues","-Os -mcall-prologues"
FAIL: tmpdir-gcc.dg-struct-layout-1/t013 c_compat_x_tst.o compile, "-Os -mcall-prologues","-Os -mcall-prologues"
FAIL: tmpdir-gcc.dg-struct-layout-1/t013 c_compat_y_tst.o compile, "-Os -mcall-prologues","-Os -mcall-prologues"
UNRESOLVED: tmpdir-gcc.dg-struct-layout-1/t013 c_compat_x_tst.o-c_compat_y_tst.o link "-Os -mcall-prologues","-Os -mcall-prologues"
UNRESOLVED: tmpdir-gcc.dg-struct-layout-1/t013 c_compat_x_tst.o-c_compat_y_tst.o execute "-Os -mcall-prologues","-Os -mcall-prologues"
FAIL: tmpdir-gcc.dg-struct-layout-1/t014 c_compat_main_tst.o compile, "-Os -mcall-prologues","-Os -mcall-prologues"
FAIL: tmpdir-gcc.dg-struct-layout-1/t014 c_compat_x_tst.o compile, "-Os -mcall-prologues","-Os -mcall-prologues"
FAIL: tmpdir-gcc.dg-struct-layout-1/t014 c_compat_y_tst.o compile, "-Os -mcall-prologues","-Os -mcall-prologues"
UNRESOLVED: tmpdir-gcc.dg-struct-layout-1/t014 c_compat_x_tst.o-c_compat_y_tst.o link "-Os -mcall-prologues","-Os -mcall-prologues"
UNRESOLVED: tmpdir-gcc.dg-struct-layout-1/t014 c_compat_x_tst.o-c_compat_y_tst.o execute "-Os -mcall-prologues","-Os -mcall-prologues"
FAIL: tmpdir-gcc.dg-struct-layout-1/t015 c_compat_main_tst.o compile, "-Os -mcall-prologues","-Os -mcall-prologues"
FAIL: tmpdir-gcc.dg-struct-layout-1/t015 c_compat_x_tst.o compile, "-Os -mcall-prologues","-Os -mcall-prologues"
FAIL: tmpdir-gcc.dg-struct-layout-1/t015 c_compat_y_tst.o compile, "-Os -mcall-prologues","-Os -mcall-prologues"
UNRESOLVED: tmpdir-gcc.dg-struct-layout-1/t015 c_compat_x_tst.o-c_compat_y_tst.o link "-Os -mcall-prologues","-Os -mcall-prologues"
UNRESOLVED: tmpdir-gcc.dg-struct-layout-1/t015 c_compat_x_tst.o-c_compat_y_tst.o execute "-Os -mcall-prologues","-Os -mcall-prologues"
FAIL: tmpdir-gcc.dg-struct-layout-1/t016 c_compat_main_tst.o compile, "-Os -mcall-prologues","-Os -mcall-prologues"
FAIL: tmpdir-gcc.dg-struct-layout-1/t016 c_compat_x_tst.o compile, "-Os -mcall-prologues","-Os -mcall-prologues"
FAIL: tmpdir-gcc.dg-struct-layout-1/t016 c_compat_y_tst.o compile, "-Os -mcall-prologues","-Os -mcall-prologues"
UNRESOLVED: tmpdir-gcc.dg-struct-layout-1/t016 c_compat_x_tst.o-c_compat_y_tst.o link "-Os -mcall-prologues","-Os -mcall-prologues"
UNRESOLVED: tmpdir-gcc.dg-struct-layout-1/t016 c_compat_x_tst.o-c_compat_y_tst.o execute "-Os -mcall-prologues","-Os -mcall-prologues"
FAIL: tmpdir-gcc.dg-struct-layout-1/t017 c_compat_main_tst.o compile, "-Os -mcall-prologues","-Os -mcall-prologues"
FAIL: tmpdir-gcc.dg-struct-layout-1/t017 c_compat_x_tst.o compile, "-Os -mcall-prologues","-Os -mcall-prologues"
FAIL: tmpdir-gcc.dg-struct-layout-1/t017 c_compat_y_tst.o compile, "-Os -mcall-prologues","-Os -mcall-prologues"
UNRESOLVED: tmpdir-gcc.dg-struct-layout-1/t017 c_compat_x_tst.o-c_compat_y_tst.o link "-Os -mcall-prologues","-Os -mcall-prologues"
UNRESOLVED: tmpdir-gcc.dg-struct-layout-1/t017 c_compat_x_tst.o-c_compat_y_tst.o execute "-Os -mcall-prologues","-Os -mcall-prologues"
FAIL: tmpdir-gcc.dg-struct-layout-1/t018 c_compat_main_tst.o compile, "-Os -mcall-prologues","-Os -mcall-prologues"
FAIL: tmpdir-gcc.dg-struct-layout-1/t018 c_compat_x_tst.o compile, "-Os -mcall-prologues","-Os -mcall-prologues"
FAIL: tmpdir-gcc.dg-struct-layout-1/t018 c_compat_y_tst.o compile, "-Os -mcall-prologues","-Os -mcall-prologues"
UNRESOLVED: tmpdir-gcc.dg-struct-layout-1/t018 c_compat_x_tst.o-c_compat_y_tst.o link "-Os -mcall-prologues","-Os -mcall-prologues"
UNRESOLVED: tmpdir-gcc.dg-struct-layout-1/t018 c_compat_x_tst.o-c_compat_y_tst.o execute "-Os -mcall-prologues","-Os -mcall-prologues"
FAIL: tmpdir-gcc.dg-struct-layout-1/t019 c_compat_main_tst.o compile, "-Os -mcall-prologues","-Os -mcall-prologues"
FAIL: tmpdir-gcc.dg-struct-layout-1/t019 c_compat_x_tst.o compile, "-Os -mcall-prologues","-Os -mcall-prologues"
FAIL: tmpdir-gcc.dg-struct-layout-1/t019 c_compat_y_tst.o compile, "-Os -mcall-prologues","-Os -mcall-prologues"
UNRESOLVED: tmpdir-gcc.dg-struct-layout-1/t019 c_compat_x_tst.o-c_compat_y_tst.o link "-Os -mcall-prologues","-Os -mcall-prologues"
UNRESOLVED: tmpdir-gcc.dg-struct-layout-1/t019 c_compat_x_tst.o-c_compat_y_tst.o execute "-Os -mcall-prologues","-Os -mcall-prologues"
FAIL: tmpdir-gcc.dg-struct-layout-1/t020 c_compat_main_tst.o compile, "-Os -mcall-prologues","-Os -mcall-prologues"
FAIL: tmpdir-gcc.dg-struct-layout-1/t020 c_compat_x_tst.o compile, "-Os -mcall-prologues","-Os -mcall-prologues"
FAIL: tmpdir-gcc.dg-struct-layout-1/t020 c_compat_y_tst.o compile, "-Os -mcall-prologues","-Os -mcall-prologues"
UNRESOLVED: tmpdir-gcc.dg-struct-layout-1/t020 c_compat_x_tst.o-c_compat_y_tst.o link "-Os -mcall-prologues","-Os -mcall-prologues"
UNRESOLVED: tmpdir-gcc.dg-struct-layout-1/t020 c_compat_x_tst.o-c_compat_y_tst.o execute "-Os -mcall-prologues","-Os -mcall-prologues"
FAIL: tmpdir-gcc.dg-struct-layout-1/t021 c_compat_main_tst.o compile, "-Os -mcall-prologues","-Os -mcall-prologues"
FAIL: tmpdir-gcc.dg-struct-layout-1/t021 c_compat_x_tst.o compile, "-Os -mcall-prologues","-Os -mcall-prologues"
FAIL: tmpdir-gcc.dg-struct-layout-1/t021 c_compat_y_tst.o compile, "-Os -mcall-prologues","-Os -mcall-prologues"
UNRESOLVED: tmpdir-gcc.dg-struct-layout-1/t021 c_compat_x_tst.o-c_compat_y_tst.o link "-Os -mcall-prologues","-Os -mcall-prologues"
UNRESOLVED: tmpdir-gcc.dg-struct-layout-1/t021 c_compat_x_tst.o-c_compat_y_tst.o execute "-Os -mcall-prologues","-Os -mcall-prologues"
FAIL: tmpdir-gcc.dg-struct-layout-1/t022 c_compat_main_tst.o compile, "-Os -mcall-prologues","-Os -mcall-prologues"
FAIL: tmpdir-gcc.dg-struct-layout-1/t022 c_compat_x_tst.o compile, "-Os -mcall-prologues","-Os -mcall-prologues"
FAIL: tmpdir-gcc.dg-struct-layout-1/t022 c_compat_y_tst.o compile, "-Os -mcall-prologues","-Os -mcall-prologues"
UNRESOLVED: tmpdir-gcc.dg-struct-layout-1/t022 c_compat_x_tst.o-c_compat_y_tst.o link "-Os -mcall-prologues","-Os -mcall-prologues"
UNRESOLVED: tmpdir-gcc.dg-struct-layout-1/t022 c_compat_x_tst.o-c_compat_y_tst.o execute "-Os -mcall-prologues","-Os -mcall-prologues"
FAIL: tmpdir-gcc.dg-struct-layout-1/t023 c_compat_main_tst.o compile, "-Os -mcall-prologues","-Os -mcall-prologues"
FAIL: tmpdir-gcc.dg-struct-layout-1/t023 c_compat_x_tst.o compile, "-Os -mcall-prologues","-Os -mcall-prologues"
FAIL: tmpdir-gcc.dg-struct-layout-1/t023 c_compat_y_tst.o compile, "-Os -mcall-prologues","-Os -mcall-prologues"
UNRESOLVED: tmpdir-gcc.dg-struct-layout-1/t023 c_compat_x_tst.o-c_compat_y_tst.o link "-Os -mcall-prologues","-Os -mcall-prologues"
UNRESOLVED: tmpdir-gcc.dg-struct-layout-1/t023 c_compat_x_tst.o-c_compat_y_tst.o execute "-Os -mcall-prologues","-Os -mcall-prologues"
FAIL: tmpdir-gcc.dg-struct-layout-1/t024 c_compat_main_tst.o compile, "-Os -mcall-prologues","-Os -mcall-prologues"
FAIL: tmpdir-gcc.dg-struct-layout-1/t024 c_compat_x_tst.o compile, "-Os -mcall-prologues","-Os -mcall-prologues"
FAIL: tmpdir-gcc.dg-struct-layout-1/t024 c_compat_y_tst.o compile, "-Os -mcall-prologues","-Os -mcall-prologues"
UNRESOLVED: tmpdir-gcc.dg-struct-layout-1/t024 c_compat_x_tst.o-c_compat_y_tst.o link "-Os -mcall-prologues","-Os -mcall-prologues"
UNRESOLVED: tmpdir-gcc.dg-struct-layout-1/t024 c_compat_x_tst.o-c_compat_y_tst.o execute "-Os -mcall-prologues","-Os -mcall-prologues"
FAIL: tmpdir-gcc.dg-struct-layout-1/t025 c_compat_main_tst.o compile, "-Os -mcall-prologues","-Os -mcall-prologues"
FAIL: tmpdir-gcc.dg-struct-layout-1/t025 c_compat_x_tst.o compile, "-Os -mcall-prologues","-Os -mcall-prologues"
FAIL: tmpdir-gcc.dg-struct-layout-1/t025 c_compat_y_tst.o compile, "-Os -mcall-prologues","-Os -mcall-prologues"
UNRESOLVED: tmpdir-gcc.dg-struct-layout-1/t025 c_compat_x_tst.o-c_compat_y_tst.o link "-Os -mcall-prologues","-Os -mcall-prologues"
UNRESOLVED: tmpdir-gcc.dg-struct-layout-1/t025 c_compat_x_tst.o-c_compat_y_tst.o execute "-Os -mcall-prologues","-Os -mcall-prologues"
FAIL: tmpdir-gcc.dg-struct-layout-1/t026 c_compat_main_tst.o compile, "-Os -mcall-prologues","-Os -mcall-prologues"
FAIL: tmpdir-gcc.dg-struct-layout-1/t026 c_compat_x_tst.o compile, "-Os -mcall-prologues","-Os -mcall-prologues"
FAIL: tmpdir-gcc.dg-struct-layout-1/t026 c_compat_y_tst.o compile, "-Os -mcall-prologues","-Os -mcall-prologues"
UNRESOLVED: tmpdir-gcc.dg-struct-layout-1/t026 c_compat_x_tst.o-c_compat_y_tst.o link "-Os -mcall-prologues","-Os -mcall-prologues"
UNRESOLVED: tmpdir-gcc.dg-struct-layout-1/t026 c_compat_x_tst.o-c_compat_y_tst.o execute "-Os -mcall-prologues","-Os -mcall-prologues"
FAIL: tmpdir-gcc.dg-struct-layout-1/t027 c_compat_main_tst.o compile, "-Os -mcall-prologues","-Os -mcall-prologues"
FAIL: tmpdir-gcc.dg-struct-layout-1/t027 c_compat_x_tst.o compile, "-Os -mcall-prologues","-Os -mcall-prologues"
FAIL: tmpdir-gcc.dg-struct-layout-1/t027 c_compat_y_tst.o compile, "-Os -mcall-prologues","-Os -mcall-prologues"
UNRESOLVED: tmpdir-gcc.dg-struct-layout-1/t027 c_compat_x_tst.o-c_compat_y_tst.o link "-Os -mcall-prologues","-Os -mcall-prologues"
UNRESOLVED: tmpdir-gcc.dg-struct-layout-1/t027 c_compat_x_tst.o-c_compat_y_tst.o execute "-Os -mcall-prologues","-Os -mcall-prologues"
FAIL: tmpdir-gcc.dg-struct-layout-1/t028 c_compat_main_tst.o compile, "-Os -mcall-prologues","-Os -mcall-prologues"
FAIL: tmpdir-gcc.dg-struct-layout-1/t028 c_compat_x_tst.o compile, "-Os -mcall-prologues","-Os -mcall-prologues"
FAIL: tmpdir-gcc.dg-struct-layout-1/t028 c_compat_y_tst.o compile, "-Os -mcall-prologues","-Os -mcall-prologues"
UNRESOLVED: tmpdir-gcc.dg-struct-layout-1/t028 c_compat_x_tst.o-c_compat_y_tst.o link "-Os -mcall-prologues","-Os -mcall-prologues"
UNRESOLVED: tmpdir-gcc.dg-struct-layout-1/t028 c_compat_x_tst.o-c_compat_y_tst.o execute "-Os -mcall-prologues","-Os -mcall-prologues"
FAIL: gcc.dg/cpp/19990407-1.c (test for excess errors)
UNRESOLVED: gcc.dg/cpp/19990407-1.c compilation failed to produce executable
FAIL: gcc.dg/cpp/digraphs.c (test for excess errors)
UNRESOLVED: gcc.dg/cpp/digraphs.c compilation failed to produce executable
FAIL: gcc.dg/cpp/macro1.c (test for excess errors)
UNRESOLVED: gcc.dg/cpp/macro1.c compilation failed to produce executable
FAIL: gcc.dg/cpp/macro3.c (test for excess errors)
UNRESOLVED: gcc.dg/cpp/macro3.c compilation failed to produce executable
FAIL: gcc.dg/cpp/macro6.c (test for excess errors)
UNRESOLVED: gcc.dg/cpp/macro6.c compilation failed to produce executable
FAIL: gcc.dg/cpp/paste2.c (test for excess errors)
UNRESOLVED: gcc.dg/cpp/paste2.c compilation failed to produce executable
FAIL: gcc.dg/cpp/paste7.c (test for excess errors)
UNRESOLVED: gcc.dg/cpp/paste7.c compilation failed to produce executable
FAIL: gcc.dg/cpp/strify2.c (test for excess errors)
UNRESOLVED: gcc.dg/cpp/strify2.c compilation failed to produce executable
FAIL: gcc.dg/cpp/strify3.c (test for excess errors)
UNRESOLVED: gcc.dg/cpp/strify3.c compilation failed to produce executable
FAIL: gcc.dg/cpp/strify4.c (test for excess errors)
UNRESOLVED: gcc.dg/cpp/strify4.c compilation failed to produce executable
FAIL: gcc.dg/cpp/strp1.c (test for excess errors)
UNRESOLVED: gcc.dg/cpp/strp1.c compilation failed to produce executable
FAIL: gcc.dg/cpp/strp2.c (test for excess errors)
UNRESOLVED: gcc.dg/cpp/strp2.c compilation failed to produce executable
FAIL: gcc.dg/cpp/trigraphs.c (test for excess errors)
UNRESOLVED: gcc.dg/cpp/trigraphs.c compilation failed to produce executable
FAIL: gcc.dg/cpp/ucnid-1.c (test for excess errors)
UNRESOLVED: gcc.dg/cpp/ucnid-1.c compilation failed to produce executable
FAIL: gcc.dg/cpp/ucnid-2.c (test for excess errors)
UNRESOLVED: gcc.dg/cpp/ucnid-2.c compilation failed to produce executable
FAIL: gcc.dg/debug/debug-3.c -gdwarf-21 (internal compiler error)
FAIL: gcc.dg/debug/debug-3.c -gdwarf-21 (test for excess errors)
FAIL: gcc.dg/debug/debug-3.c -gdwarf-21 -O (internal compiler error)
FAIL: gcc.dg/debug/debug-3.c -gdwarf-21 -O (test for excess errors)
FAIL: gcc.dg/debug/debug-3.c -gdwarf-21 -O3 (internal compiler error)
FAIL: gcc.dg/debug/debug-3.c -gdwarf-21 -O3 (test for excess errors)
FAIL: gcc.dg/debug/debug-3.c -gdwarf-2 (internal compiler error)
FAIL: gcc.dg/debug/debug-3.c -gdwarf-2 (test for excess errors)
FAIL: gcc.dg/debug/debug-3.c -gdwarf-2 -O (internal compiler error)
FAIL: gcc.dg/debug/debug-3.c -gdwarf-2 -O (test for excess errors)
FAIL: gcc.dg/debug/debug-3.c -gdwarf-2 -O3 (internal compiler error)
FAIL: gcc.dg/debug/debug-3.c -gdwarf-2 -O3 (test for excess errors)
FAIL: gcc.dg/debug/debug-3.c -gdwarf-23 (internal compiler error)
FAIL: gcc.dg/debug/debug-3.c -gdwarf-23 (test for excess errors)
FAIL: gcc.dg/debug/debug-3.c -gdwarf-23 -O (internal compiler error)
FAIL: gcc.dg/debug/debug-3.c -gdwarf-23 -O (test for excess errors)
FAIL: gcc.dg/debug/debug-3.c -gdwarf-23 -O3 (internal compiler error)
FAIL: gcc.dg/debug/debug-3.c -gdwarf-23 -O3 (test for excess errors)
FAIL: gcc.dg/debug/debug-3.c -gstabs1 (internal compiler error)
FAIL: gcc.dg/debug/debug-3.c -gstabs1 (test for excess errors)
FAIL: gcc.dg/debug/debug-3.c -gstabs1 -O (internal compiler error)
FAIL: gcc.dg/debug/debug-3.c -gstabs1 -O (test for excess errors)
FAIL: gcc.dg/debug/debug-3.c -gstabs1 -O3 (internal compiler error)
FAIL: gcc.dg/debug/debug-3.c -gstabs1 -O3 (test for excess errors)
FAIL: gcc.dg/debug/debug-3.c -gstabs (internal compiler error)
FAIL: gcc.dg/debug/debug-3.c -gstabs (test for excess errors)
FAIL: gcc.dg/debug/debug-3.c -gstabs -O (internal compiler error)
FAIL: gcc.dg/debug/debug-3.c -gstabs -O (test for excess errors)
FAIL: gcc.dg/debug/debug-3.c -gstabs -O3 (internal compiler error)
FAIL: gcc.dg/debug/debug-3.c -gstabs -O3 (test for excess errors)
FAIL: gcc.dg/debug/debug-3.c -gstabs3 (internal compiler error)
FAIL: gcc.dg/debug/debug-3.c -gstabs3 (test for excess errors)
FAIL: gcc.dg/debug/debug-3.c -gstabs3 -O (internal compiler error)
FAIL: gcc.dg/debug/debug-3.c -gstabs3 -O (test for excess errors)
FAIL: gcc.dg/debug/debug-3.c -gstabs3 -O3 (internal compiler error)
FAIL: gcc.dg/debug/debug-3.c -gstabs3 -O3 (test for excess errors)
FAIL: gcc.dg/debug/debug-3.c -gstabs+1 (internal compiler error)
FAIL: gcc.dg/debug/debug-3.c -gstabs+1 (test for excess errors)
FAIL: gcc.dg/debug/debug-3.c -gstabs+1 -O (internal compiler error)
FAIL: gcc.dg/debug/debug-3.c -gstabs+1 -O (test for excess errors)
FAIL: gcc.dg/debug/debug-3.c -gstabs+1 -O3 (internal compiler error)
FAIL: gcc.dg/debug/debug-3.c -gstabs+1 -O3 (test for excess errors)
FAIL: gcc.dg/debug/debug-3.c -gstabs+ (internal compiler error)
FAIL: gcc.dg/debug/debug-3.c -gstabs+ (test for excess errors)
FAIL: gcc.dg/debug/debug-3.c -gstabs+ -O (internal compiler error)
FAIL: gcc.dg/debug/debug-3.c -gstabs+ -O (test for excess errors)
FAIL: gcc.dg/debug/debug-3.c -gstabs+ -O3 (internal compiler error)
FAIL: gcc.dg/debug/debug-3.c -gstabs+ -O3 (test for excess errors)
FAIL: gcc.dg/debug/debug-3.c -gstabs+3 (internal compiler error)
FAIL: gcc.dg/debug/debug-3.c -gstabs+3 (test for excess errors)
FAIL: gcc.dg/debug/debug-3.c -gstabs+3 -O (internal compiler error)
FAIL: gcc.dg/debug/debug-3.c -gstabs+3 -O (test for excess errors)
FAIL: gcc.dg/debug/debug-3.c -gstabs+3 -O3 (internal compiler error)
FAIL: gcc.dg/debug/debug-3.c -gstabs+3 -O3 (test for excess errors)
FAIL: gcc.dg/debug/debug-5.c -gdwarf-21 (internal compiler error)
FAIL: gcc.dg/debug/debug-5.c -gdwarf-21 (test for excess errors)
FAIL: gcc.dg/debug/debug-5.c -gdwarf-21 -O (internal compiler error)
FAIL: gcc.dg/debug/debug-5.c -gdwarf-21 -O (test for excess errors)
FAIL: gcc.dg/debug/debug-5.c -gdwarf-21 -O3 (internal compiler error)
FAIL: gcc.dg/debug/debug-5.c -gdwarf-21 -O3 (test for excess errors)
FAIL: gcc.dg/debug/debug-5.c -gdwarf-2 (internal compiler error)
FAIL: gcc.dg/debug/debug-5.c -gdwarf-2 (test for excess errors)
FAIL: gcc.dg/debug/debug-5.c -gdwarf-2 -O (internal compiler error)
FAIL: gcc.dg/debug/debug-5.c -gdwarf-2 -O (test for excess errors)
FAIL: gcc.dg/debug/debug-5.c -gdwarf-2 -O3 (internal compiler error)
FAIL: gcc.dg/debug/debug-5.c -gdwarf-2 -O3 (test for excess errors)
FAIL: gcc.dg/debug/debug-5.c -gdwarf-23 (internal compiler error)
FAIL: gcc.dg/debug/debug-5.c -gdwarf-23 (test for excess errors)
FAIL: gcc.dg/debug/debug-5.c -gdwarf-23 -O (internal compiler error)
FAIL: gcc.dg/debug/debug-5.c -gdwarf-23 -O (test for excess errors)
FAIL: gcc.dg/debug/debug-5.c -gdwarf-23 -O3 (internal compiler error)
FAIL: gcc.dg/debug/debug-5.c -gdwarf-23 -O3 (test for excess errors)
FAIL: gcc.dg/debug/debug-5.c -gstabs1 (internal compiler error)
FAIL: gcc.dg/debug/debug-5.c -gstabs1 (test for excess errors)
FAIL: gcc.dg/debug/debug-5.c -gstabs1 -O (internal compiler error)
FAIL: gcc.dg/debug/debug-5.c -gstabs1 -O (test for excess errors)
FAIL: gcc.dg/debug/debug-5.c -gstabs1 -O3 (internal compiler error)
FAIL: gcc.dg/debug/debug-5.c -gstabs1 -O3 (test for excess errors)
FAIL: gcc.dg/debug/debug-5.c -gstabs (internal compiler error)
FAIL: gcc.dg/debug/debug-5.c -gstabs (test for excess errors)
FAIL: gcc.dg/debug/debug-5.c -gstabs -O (internal compiler error)
FAIL: gcc.dg/debug/debug-5.c -gstabs -O (test for excess errors)
FAIL: gcc.dg/debug/debug-5.c -gstabs -O3 (internal compiler error)
FAIL: gcc.dg/debug/debug-5.c -gstabs -O3 (test for excess errors)
FAIL: gcc.dg/debug/debug-5.c -gstabs3 (internal compiler error)
FAIL: gcc.dg/debug/debug-5.c -gstabs3 (test for excess errors)
FAIL: gcc.dg/debug/debug-5.c -gstabs3 -O (internal compiler error)
FAIL: gcc.dg/debug/debug-5.c -gstabs3 -O (test for excess errors)
FAIL: gcc.dg/debug/debug-5.c -gstabs3 -O3 (internal compiler error)
FAIL: gcc.dg/debug/debug-5.c -gstabs3 -O3 (test for excess errors)
FAIL: gcc.dg/debug/debug-5.c -gstabs+1 (internal compiler error)
FAIL: gcc.dg/debug/debug-5.c -gstabs+1 (test for excess errors)
FAIL: gcc.dg/debug/debug-5.c -gstabs+1 -O (internal compiler error)
FAIL: gcc.dg/debug/debug-5.c -gstabs+1 -O (test for excess errors)
FAIL: gcc.dg/debug/debug-5.c -gstabs+1 -O3 (internal compiler error)
FAIL: gcc.dg/debug/debug-5.c -gstabs+1 -O3 (test for excess errors)
FAIL: gcc.dg/debug/debug-5.c -gstabs+ (internal compiler error)
FAIL: gcc.dg/debug/debug-5.c -gstabs+ (test for excess errors)
FAIL: gcc.dg/debug/debug-5.c -gstabs+ -O (internal compiler error)
FAIL: gcc.dg/debug/debug-5.c -gstabs+ -O (test for excess errors)
FAIL: gcc.dg/debug/debug-5.c -gstabs+ -O3 (internal compiler error)
FAIL: gcc.dg/debug/debug-5.c -gstabs+ -O3 (test for excess errors)
FAIL: gcc.dg/debug/debug-5.c -gstabs+3 (internal compiler error)
FAIL: gcc.dg/debug/debug-5.c -gstabs+3 (test for excess errors)
FAIL: gcc.dg/debug/debug-5.c -gstabs+3 -O (internal compiler error)
FAIL: gcc.dg/debug/debug-5.c -gstabs+3 -O (test for excess errors)
FAIL: gcc.dg/debug/debug-5.c -gstabs+3 -O3 (internal compiler error)
FAIL: gcc.dg/debug/debug-5.c -gstabs+3 -O3 (test for excess errors)
FAIL: gcc.dg/20000906-1.c (test for excess errors)
UNRESOLVED: gcc.dg/20000906-1.c compilation failed to produce executable
FAIL: gcc.dg/20011214-1.c (test for excess errors)
UNRESOLVED: gcc.dg/20011214-1.c compilation failed to produce executable
FAIL: gcc.dg/20020607-1.c (test for excess errors)
UNRESOLVED: gcc.dg/20020607-1.c compilation failed to produce executable
FAIL: gcc.dg/20030323-1.c (test for excess errors)
UNRESOLVED: gcc.dg/20030323-1.c compilation failed to produce executable
FAIL: gcc.dg/20040305-2.c (test for excess errors)
UNRESOLVED: gcc.dg/20040305-2.c compilation failed to produce executable
FAIL: gcc.dg/20040309-1.c (test for excess errors)
UNRESOLVED: gcc.dg/20040309-1.c compilation failed to produce executable
FAIL: gcc.dg/20041219-1.c (test for excess errors)
UNRESOLVED: gcc.dg/20041219-1.c compilation failed to produce executable
FAIL: gcc.dg/20050607-1.c (internal compiler error)
FAIL: gcc.dg/20050607-1.c (test for excess errors)
FAIL: gcc.dg/20050922-1.c (test for excess errors)
UNRESOLVED: gcc.dg/20050922-1.c compilation failed to produce executable
FAIL: gcc.dg/20050922-2.c (test for excess errors)
UNRESOLVED: gcc.dg/20050922-2.c compilation failed to produce executable
FAIL: gcc.dg/Wconversion-5.c  (test for warnings, line 22)
FAIL: gcc.dg/Wconversion-real-integer.c  (test for warnings, line 34)
FAIL: gcc.dg/Wconversion-real-integer.c  (test for warnings, line 35)
FAIL: gcc.dg/Wconversion-real-integer.c  (test for warnings, line 38)
FAIL: gcc.dg/Wconversion-real-integer.c  (test for warnings, line 39)
FAIL: gcc.dg/Wconversion-real-integer.c  (test for warnings, line 40)
FAIL: gcc.dg/Wconversion-real-integer.c  (test for warnings, line 41)
FAIL: gcc.dg/Wconversion-real-integer.c (test for excess errors)
FAIL: gcc.dg/Wconversion-real.c  (test for warnings, line 20)
FAIL: gcc.dg/Wconversion-real.c  (test for warnings, line 21)
FAIL: gcc.dg/Wconversion-real.c  (test for warnings, line 22)
FAIL: gcc.dg/Wconversion-real.c  (test for warnings, line 23)
FAIL: gcc.dg/Wconversion-real.c  (test for warnings, line 26)
FAIL: gcc.dg/Wconversion-real.c  (test for warnings, line 27)
FAIL: gcc.dg/Wconversion-real.c  (test for warnings, line 28)
FAIL: gcc.dg/Wconversion-real.c  (test for warnings, line 29)
FAIL: gcc.dg/Wdeclaration-after-statement-2.c (test for excess errors)
UNRESOLVED: gcc.dg/Wdeclaration-after-statement-2.c compilation failed to produce executable
FAIL: gcc.dg/Wtype-limits-Wextra.c  (test for warnings, line 25)
FAIL: gcc.dg/Wtype-limits-Wextra.c  (test for warnings, line 26)
FAIL: gcc.dg/Wtype-limits-Wextra.c  (test for warnings, line 27)
FAIL: gcc.dg/Wtype-limits-Wextra.c  (test for warnings, line 28)
FAIL: gcc.dg/Wtype-limits-Wextra.c (test for excess errors)
FAIL: gcc.dg/Wtype-limits.c  (test for warnings, line 25)
FAIL: gcc.dg/Wtype-limits.c  (test for warnings, line 26)
FAIL: gcc.dg/Wtype-limits.c  (test for warnings, line 27)
FAIL: gcc.dg/Wtype-limits.c  (test for warnings, line 28)
FAIL: gcc.dg/Wtype-limits.c (test for excess errors)
FAIL: gcc.dg/alias-11.c (test for excess errors)
UNRESOLVED: gcc.dg/alias-11.c compilation failed to produce executable
FAIL: gcc.dg/array-quals-1.c scan-assembler-not \\\\.data(?!\\\\.rel\\\\.ro)
FAIL: gcc.dg/builtin-apply2.c (test for excess errors)
UNRESOLVED: gcc.dg/builtin-apply2.c compilation failed to produce executable
FAIL: gcc.dg/builtin-apply3.c (test for excess errors)
UNRESOLVED: gcc.dg/builtin-apply3.c compilation failed to produce executable
FAIL: gcc.dg/builtin-prefetch-1.c (test for excess errors)
UNRESOLVED: gcc.dg/builtin-prefetch-1.c compilation failed to produce executable
FAIL: gcc.dg/builtin-return-1.c (test for excess errors)
UNRESOLVED: gcc.dg/builtin-return-1.c compilation failed to produce executable
FAIL: gcc.dg/builtins-13.c (test for excess errors)
FAIL: gcc.dg/builtins-18.c (test for excess errors)
FAIL: gcc.dg/builtins-20.c (test for excess errors)
FAIL: gcc.dg/builtins-53.c (test for excess errors)
FAIL: gcc.dg/builtins-55.c (test for excess errors)
FAIL: gcc.dg/builtins-57.c (test for excess errors)
FAIL: gcc.dg/builtins-58.c (test for excess errors)
ERROR: gcc.dg/builtins-58.c: error executing dg-final: couldn't open "builtins-58.s": no such file or directory
UNRESOLVED: gcc.dg/builtins-58.c: error executing dg-final: couldn't open "builtins-58.s": no such file or directory
FAIL: gcc.dg/builtins-64.c (test for excess errors)
UNRESOLVED: gcc.dg/builtins-64.c compilation failed to produce executable
FAIL: gcc.dg/builtins-8.c (test for excess errors)
UNRESOLVED: gcc.dg/builtins-8.c compilation failed to produce executable
FAIL: gcc.dg/c90-digraph-1.c (test for excess errors)
UNRESOLVED: gcc.dg/c90-digraph-1.c compilation failed to produce executable
FAIL: gcc.dg/c90-hexfloat-2.c (test for excess errors)
UNRESOLVED: gcc.dg/c90-hexfloat-2.c compilation failed to produce executable
FAIL: gcc.dg/c90-scope-1.c (test for excess errors)
UNRESOLVED: gcc.dg/c90-scope-1.c compilation failed to produce executable
FAIL: gcc.dg/c94-digraph-1.c (test for excess errors)
UNRESOLVED: gcc.dg/c94-digraph-1.c compilation failed to produce executable
FAIL: gcc.dg/c99-bool-1.c (test for excess errors)
UNRESOLVED: gcc.dg/c99-bool-1.c compilation failed to produce executable
FAIL: gcc.dg/c99-bool-3.c (test for excess errors)
UNRESOLVED: gcc.dg/c99-bool-3.c compilation failed to produce executable
FAIL: gcc.dg/c99-complit-1.c (test for excess errors)
UNRESOLVED: gcc.dg/c99-complit-1.c compilation failed to produce executable
FAIL: gcc.dg/c99-digraph-1.c (test for excess errors)
UNRESOLVED: gcc.dg/c99-digraph-1.c compilation failed to produce executable
FAIL: gcc.dg/c99-fordecl-1.c (test for excess errors)
UNRESOLVED: gcc.dg/c99-fordecl-1.c compilation failed to produce executable
FAIL: gcc.dg/c99-func-1.c (test for excess errors)
UNRESOLVED: gcc.dg/c99-func-1.c compilation failed to produce executable
FAIL: gcc.dg/c99-func-3.c (test for excess errors)
UNRESOLVED: gcc.dg/c99-func-3.c compilation failed to produce executable
FAIL: gcc.dg/c99-hexfloat-2.c (test for excess errors)
UNRESOLVED: gcc.dg/c99-hexfloat-2.c compilation failed to produce executable
FAIL: gcc.dg/c99-init-1.c (test for excess errors)
UNRESOLVED: gcc.dg/c99-init-1.c compilation failed to produce executable
FAIL: gcc.dg/c99-main-1.c (test for excess errors)
UNRESOLVED: gcc.dg/c99-main-1.c compilation failed to produce executable
FAIL: gcc.dg/c99-mixdecl-1.c (test for excess errors)
UNRESOLVED: gcc.dg/c99-mixdecl-1.c compilation failed to produce executable
FAIL: gcc.dg/c99-scope-1.c (test for excess errors)
UNRESOLVED: gcc.dg/c99-scope-1.c compilation failed to produce executable
FAIL: gcc.dg/c99-scope-2.c (test for excess errors)
UNRESOLVED: gcc.dg/c99-scope-2.c compilation failed to produce executable
FAIL: gcc.dg/cleanup-12.c (test for excess errors)
UNRESOLVED: gcc.dg/cleanup-12.c compilation failed to produce executable
FAIL: gcc.dg/cleanup-5.c (test for excess errors)
UNRESOLVED: gcc.dg/cleanup-5.c compilation failed to produce executable
FAIL: gcc.dg/complete-port.c (test for excess errors)
FAIL: gcc.dg/div-compare-1.c (test for excess errors)
UNRESOLVED: gcc.dg/div-compare-1.c compilation failed to produce executable
FAIL: gcc.dg/fixuns-trunc-1.c (test for excess errors)
UNRESOLVED: gcc.dg/fixuns-trunc-1.c compilation failed to produce executable
FAIL: gcc.dg/fold-bitand-1.c (test for excess errors)
FAIL: gcc.dg/fold-eqandshift-3.c scan-tree-dump-times original "\\(a & 1073741824\\) != 0" 1
FAIL: gcc.dg/fold-eqandshift-3.c scan-tree-dump-times original "\\(b & 1073741824\\) != 0" 1
FAIL: gcc.dg/fold-overflow-1.c scan-assembler-times 2139095040 2
FAIL: gcc.dg/ftrapv-1.c (test for excess errors)
UNRESOLVED: gcc.dg/ftrapv-1.c compilation failed to produce executable
FAIL: gcc.dg/ftrapv-2.c (test for excess errors)
UNRESOLVED: gcc.dg/ftrapv-2.c compilation failed to produce executable
FAIL: gcc.dg/gcc-have-sync-compare-and-swap.c (test for excess errors)
FAIL: gcc.dg/initpri1.c (test for excess errors)
UNRESOLVED: gcc.dg/initpri1.c compilation failed to produce executable
FAIL: gcc.dg/inline-16.c (test for excess errors)
FAIL: gcc.dg/inline-32.c (test for excess errors)
FAIL: gcc.dg/loop-2.c (test for excess errors)
UNRESOLVED: gcc.dg/loop-2.c compilation failed to produce executable
FAIL: gcc.dg/max-1.c (test for excess errors)
FAIL: gcc.dg/memcpy-1.c scan-tree-dump-times optimized "nasty_local" 0
FAIL: gcc.dg/multiple-overflow-warn-3.c  (test for warnings, line 8)
FAIL: gcc.dg/multiple-overflow-warn-3.c (test for excess errors)
FAIL: gcc.dg/nested-calls-1.c (test for excess errors)
UNRESOLVED: gcc.dg/nested-calls-1.c compilation failed to produce executable
FAIL: gcc.dg/nested-func-4.c (test for excess errors)
UNRESOLVED: gcc.dg/nested-func-4.c compilation failed to produce executable
FAIL: gcc.dg/nested-func-5.c (internal compiler error)
FAIL: gcc.dg/nested-func-5.c (test for excess errors)
FAIL: gcc.dg/nrv1.c (test for excess errors)
UNRESOLVED: gcc.dg/nrv1.c compilation failed to produce executable
FAIL: gcc.dg/pack-test-5.c (test for excess errors)
UNRESOLVED: gcc.dg/pack-test-5.c compilation failed to produce executable
FAIL: gcc.dg/postincr-1.c (test for excess errors)
UNRESOLVED: gcc.dg/postincr-1.c compilation failed to produce executable
FAIL: gcc.dg/pr15785-1.c (test for excess errors)
FAIL: gcc.dg/pr19340.c (test for excess errors)
FAIL: gcc.dg/pr26719.c execution test
FAIL: gcc.dg/pr26983.c (test for excess errors)
FAIL: gcc.dg/pr27639.c (test for excess errors)
FAIL: gcc.dg/pr28755.c (test for excess errors)
FAIL: gcc.dg/pr28755.c scan-assembler-times 2112543726|7deadbee 2
FAIL: gcc.dg/pr30951.c (test for excess errors)
FAIL: gcc.dg/pr32912-2.c execution test
FAIL: gcc.dg/pr33676.c (test for excess errors)
UNRESOLVED: gcc.dg/pr33676.c compilation failed to produce executable
FAIL: gcc.dg/pr34457-1.c (internal compiler error)
FAIL: gcc.dg/pr34457-1.c (test for excess errors)
FAIL: gcc.dg/pr35065.c (test for excess errors)
FAIL: gcc.dg/pr36194.c execution test
FAIL: gcc.dg/pr36227.c (test for excess errors)
FAIL: gcc.dg/pr36300-1.c (test for excess errors)
FAIL: gcc.dg/pr36300-2.c (test for excess errors)
FAIL: gcc.dg/pr36998.c (test for excess errors)
FAIL: gcc.dg/pragma-pack-4.c  (test for warnings, line 4)
FAIL: gcc.dg/pragma-pack-4.c  (test for warnings, line 5)
FAIL: gcc.dg/pragma-pack-4.c  (test for warnings, line 6)
FAIL: gcc.dg/pragma-pack-4.c (test for excess errors)
FAIL: gcc.dg/section1.c scan-assembler-not .bss
FAIL: gcc.dg/single-precision-constant.c (test for excess errors)
UNRESOLVED: gcc.dg/single-precision-constant.c compilation failed to produce executable
FAIL: gcc.dg/smod-1.c (test for excess errors)
UNRESOLVED: gcc.dg/smod-1.c compilation failed to produce executable
FAIL: gcc.dg/struct-by-value-1.c execution test
FAIL: gcc.dg/struct-ret-libc.c (test for excess errors)
UNRESOLVED: gcc.dg/struct-ret-libc.c compilation failed to produce executable
FAIL: gcc.dg/switch-8.c (test for excess errors)
FAIL: gcc.dg/titype-1.c (test for excess errors)
UNRESOLVED: gcc.dg/titype-1.c compilation failed to produce executable
FAIL: gcc.dg/trampoline-1.c (internal compiler error)
FAIL: gcc.dg/trampoline-1.c (test for excess errors)
UNRESOLVED: gcc.dg/trampoline-1.c compilation failed to produce executable
FAIL: gcc.dg/ucnid-1.c (test for excess errors)
UNRESOLVED: gcc.dg/ucnid-1.c compilation failed to produce executable
FAIL: gcc.dg/ucnid-2.c (test for excess errors)
UNRESOLVED: gcc.dg/ucnid-2.c compilation failed to produce executable
FAIL: gcc.dg/ucnid-3.c (test for excess errors)
UNRESOLVED: gcc.dg/ucnid-3.c compilation failed to produce executable
FAIL: gcc.dg/ucnid-4.c (test for excess errors)
UNRESOLVED: gcc.dg/ucnid-4.c compilation failed to produce executable
FAIL: gcc.dg/ucnid-5.c (test for excess errors)
UNRESOLVED: gcc.dg/ucnid-5.c compilation failed to produce executable
FAIL: gcc.dg/unaligned-1.c (test for excess errors)
UNRESOLVED: gcc.dg/unaligned-1.c compilation failed to produce executable
FAIL: gcc.dg/union-2.c (test for excess errors)
UNRESOLVED: gcc.dg/union-2.c compilation failed to produce executable
FAIL: gcc.dg/unordered-2.c (test for excess errors)
FAIL: gcc.dg/vla-4.c (test for excess errors)
UNRESOLVED: gcc.dg/vla-4.c compilation failed to produce executable
FAIL: gcc.dg/wtr-conversion-1.c (test for excess errors)
FAIL: gcc.dg/matrix/transpose-1.c compilation,  -fprofile-generate -O3
UNRESOLVED: gcc.dg/matrix/transpose-1.c execution,    -fprofile-generate -O3
UNRESOLVED: gcc.dg/matrix/transpose-1.c compilation,  -fprofile-use -fipa-matrix-reorg -fdump-ipa-matrix-reorg -O3 -fwhole-program -combine
UNRESOLVED: gcc.dg/matrix/transpose-1.c execution,    -fprofile-use -fipa-matrix-reorg -fdump-ipa-matrix-reorg -O3 -fwhole-program -combine
FAIL: gcc.dg/matrix/transpose-2.c compilation,  -fprofile-generate -O3
UNRESOLVED: gcc.dg/matrix/transpose-2.c execution,    -fprofile-generate -O3
UNRESOLVED: gcc.dg/matrix/transpose-2.c compilation,  -fprofile-use -fipa-matrix-reorg -fdump-ipa-matrix-reorg -O3 -fwhole-program -combine
UNRESOLVED: gcc.dg/matrix/transpose-2.c execution,    -fprofile-use -fipa-matrix-reorg -fdump-ipa-matrix-reorg -O3 -fwhole-program -combine
FAIL: gcc.dg/matrix/transpose-3.c compilation,  -fprofile-generate -O3
UNRESOLVED: gcc.dg/matrix/transpose-3.c execution,    -fprofile-generate -O3
UNRESOLVED: gcc.dg/matrix/transpose-3.c compilation,  -fprofile-use -fipa-matrix-reorg -fdump-ipa-matrix-reorg -O3 -fwhole-program -combine
UNRESOLVED: gcc.dg/matrix/transpose-3.c execution,    -fprofile-use -fipa-matrix-reorg -fdump-ipa-matrix-reorg -O3 -fwhole-program -combine
FAIL: gcc.dg/matrix/transpose-4.c compilation,  -fprofile-generate -O3
UNRESOLVED: gcc.dg/matrix/transpose-4.c execution,    -fprofile-generate -O3
UNRESOLVED: gcc.dg/matrix/transpose-4.c compilation,  -fprofile-use -fipa-matrix-reorg -fdump-ipa-matrix-reorg -O3 -fwhole-program -combine
UNRESOLVED: gcc.dg/matrix/transpose-4.c execution,    -fprofile-use -fipa-matrix-reorg -fdump-ipa-matrix-reorg -O3 -fwhole-program -combine
FAIL: gcc.dg/matrix/transpose-5.c compilation,  -fprofile-generate -O3
UNRESOLVED: gcc.dg/matrix/transpose-5.c execution,    -fprofile-generate -O3
UNRESOLVED: gcc.dg/matrix/transpose-5.c compilation,  -fprofile-use -fipa-matrix-reorg -fdump-ipa-matrix-reorg -O3 -fwhole-program -combine
UNRESOLVED: gcc.dg/matrix/transpose-5.c execution,    -fprofile-use -fipa-matrix-reorg -fdump-ipa-matrix-reorg -O3 -fwhole-program -combine
FAIL: gcc.dg/matrix/transpose-6.c compilation,  -fprofile-generate -O3
UNRESOLVED: gcc.dg/matrix/transpose-6.c execution,    -fprofile-generate -O3
UNRESOLVED: gcc.dg/matrix/transpose-6.c compilation,  -fprofile-use -fipa-matrix-reorg -fdump-ipa-matrix-reorg -O3 -fwhole-program -combine
UNRESOLVED: gcc.dg/matrix/transpose-6.c execution,    -fprofile-use -fipa-matrix-reorg -fdump-ipa-matrix-reorg -O3 -fwhole-program -combine
FAIL: gcc.dg/struct/wo_prof_array_field.c scan-ipa-dump ipa_struct_reorg "Number of structures to transform is 1"
FAIL: gcc.dg/struct/wo_prof_array_through_pointer.c execution test
XPASS: gcc.dg/struct/wo_prof_array_through_pointer.c scan-ipa-dump ipa_struct_reorg "Number of structures to transform is 1"
ERROR: tcl error sourcing /home/mstein/svn/gcc-4_3-branch/gcc/testsuite/gcc.dg/struct/struct-reorg.exp.
ERROR: child killed: kill signal
FAIL: gcc.dg/tls/alias-1.c (test for excess errors)
FAIL: gcc.dg/tls/opt-11.c (test for excess errors)
UNRESOLVED: gcc.dg/tls/opt-11.c compilation failed to produce executable
FAIL: gcc.dg/torture/builtin-convert-1.c  -O0  (test for excess errors)
FAIL: gcc.dg/torture/builtin-convert-1.c  -O1  (test for excess errors)
FAIL: gcc.dg/torture/builtin-convert-1.c  -O2  (test for excess errors)
FAIL: gcc.dg/torture/builtin-convert-1.c  -O3 -fomit-frame-pointer  (test for excess errors)
FAIL: gcc.dg/torture/builtin-convert-1.c  -O3 -g  (test for excess errors)
FAIL: gcc.dg/torture/builtin-convert-1.c  -Os  (test for excess errors)
FAIL: gcc.dg/torture/builtin-convert-2.c  -O0  (test for excess errors)
FAIL: gcc.dg/torture/builtin-convert-2.c  -O1  (test for excess errors)
FAIL: gcc.dg/torture/builtin-convert-2.c  -O2  (test for excess errors)
FAIL: gcc.dg/torture/builtin-convert-2.c  -O3 -fomit-frame-pointer  (test for excess errors)
FAIL: gcc.dg/torture/builtin-convert-2.c  -O3 -g  (test for excess errors)
FAIL: gcc.dg/torture/builtin-convert-2.c  -Os  (test for excess errors)
FAIL: gcc.dg/torture/builtin-convert-3.c  -O0  (test for excess errors)
FAIL: gcc.dg/torture/builtin-convert-3.c  -O1  (test for excess errors)
FAIL: gcc.dg/torture/builtin-convert-3.c  -O2  (test for excess errors)
FAIL: gcc.dg/torture/builtin-convert-3.c  -O3 -fomit-frame-pointer  (test for excess errors)
FAIL: gcc.dg/torture/builtin-convert-3.c  -O3 -g  (test for excess errors)
FAIL: gcc.dg/torture/builtin-convert-3.c  -Os  (test for excess errors)
FAIL: gcc.dg/torture/builtin-convert-4.c  -O0  (test for excess errors)
FAIL: gcc.dg/torture/builtin-convert-4.c  -O1  (test for excess errors)
FAIL: gcc.dg/torture/builtin-convert-4.c  -O2  (test for excess errors)
FAIL: gcc.dg/torture/builtin-convert-4.c  -O3 -fomit-frame-pointer  (test for excess errors)
FAIL: gcc.dg/torture/builtin-convert-4.c  -O3 -fomit-frame-pointer -funroll-loops  (test for excess errors)
FAIL: gcc.dg/torture/builtin-convert-4.c  -O3 -fomit-frame-pointer -funroll-all-loops -finline-functions  (test for excess errors)
FAIL: gcc.dg/torture/builtin-convert-4.c  -O3 -g  (test for excess errors)
FAIL: gcc.dg/torture/builtin-convert-4.c  -Os  (test for excess errors)
FAIL: gcc.dg/torture/builtin-frexp-1.c  -O0  (test for excess errors)
FAIL: gcc.dg/torture/builtin-frexp-1.c  -O1  (test for excess errors)
FAIL: gcc.dg/torture/builtin-frexp-1.c  -O2  (test for excess errors)
FAIL: gcc.dg/torture/builtin-frexp-1.c  -O3 -fomit-frame-pointer  (test for excess errors)
FAIL: gcc.dg/torture/builtin-frexp-1.c  -O3 -fomit-frame-pointer -funroll-loops  (test for excess errors)
FAIL: gcc.dg/torture/builtin-frexp-1.c  -O3 -fomit-frame-pointer -funroll-all-loops -finline-functions  (test for excess errors)
FAIL: gcc.dg/torture/builtin-frexp-1.c  -O3 -g  (test for excess errors)
FAIL: gcc.dg/torture/builtin-frexp-1.c  -Os  (test for excess errors)
FAIL: gcc.dg/torture/builtin-power-1.c  -O0  (test for excess errors)
FAIL: gcc.dg/torture/builtin-power-1.c  -O1  (test for excess errors)
FAIL: gcc.dg/torture/builtin-power-1.c  -O2  (test for excess errors)
FAIL: gcc.dg/torture/builtin-power-1.c  -O3 -fomit-frame-pointer  (test for excess errors)
FAIL: gcc.dg/torture/builtin-power-1.c  -O3 -g  (test for excess errors)
FAIL: gcc.dg/torture/builtin-power-1.c  -Os  (test for excess errors)
FAIL: gcc.dg/torture/complex-alias-1.c  -O0  (test for excess errors)
UNRESOLVED: gcc.dg/torture/complex-alias-1.c  -O0  compilation failed to produce executable
FAIL: gcc.dg/torture/complex-alias-1.c  -O1  (test for excess errors)
UNRESOLVED: gcc.dg/torture/complex-alias-1.c  -O1  compilation failed to produce executable
FAIL: gcc.dg/torture/complex-alias-1.c  -O2  (test for excess errors)
UNRESOLVED: gcc.dg/torture/complex-alias-1.c  -O2  compilation failed to produce executable
FAIL: gcc.dg/torture/complex-alias-1.c  -O3 -fomit-frame-pointer  (test for excess errors)
UNRESOLVED: gcc.dg/torture/complex-alias-1.c  -O3 -fomit-frame-pointer  compilation failed to produce executable
FAIL: gcc.dg/torture/complex-alias-1.c  -O3 -g  (test for excess errors)
UNRESOLVED: gcc.dg/torture/complex-alias-1.c  -O3 -g  compilation failed to produce executable
FAIL: gcc.dg/torture/complex-alias-1.c  -Os  (test for excess errors)
UNRESOLVED: gcc.dg/torture/complex-alias-1.c  -Os  compilation failed to produce executable
FAIL: gcc.dg/torture/nested-fn-1.c  -O0  (internal compiler error)
FAIL: gcc.dg/torture/nested-fn-1.c  -O0  (test for excess errors)
ERROR: gcc.dg/torture/nested-fn-1.c  -O0 : error executing dg-final: couldn't open "nested-fn-1.s": no such file or directory
UNRESOLVED: gcc.dg/torture/nested-fn-1.c  -O0 : error executing dg-final: couldn't open "nested-fn-1.s": no such file or directory
FAIL: gcc.dg/torture/nested-fn-1.c  -O1  (internal compiler error)
FAIL: gcc.dg/torture/nested-fn-1.c  -O1  (test for excess errors)
ERROR: gcc.dg/torture/nested-fn-1.c  -O1 : error executing dg-final: couldn't open "nested-fn-1.s": no such file or directory
UNRESOLVED: gcc.dg/torture/nested-fn-1.c  -O1 : error executing dg-final: couldn't open "nested-fn-1.s": no such file or directory
FAIL: gcc.dg/torture/nested-fn-1.c  -O2  (internal compiler error)
FAIL: gcc.dg/torture/nested-fn-1.c  -O2  (test for excess errors)
ERROR: gcc.dg/torture/nested-fn-1.c  -O2 : error executing dg-final: couldn't open "nested-fn-1.s": no such file or directory
UNRESOLVED: gcc.dg/torture/nested-fn-1.c  -O2 : error executing dg-final: couldn't open "nested-fn-1.s": no such file or directory
FAIL: gcc.dg/torture/nested-fn-1.c  -O3 -fomit-frame-pointer  (internal compiler error)
FAIL: gcc.dg/torture/nested-fn-1.c  -O3 -fomit-frame-pointer  (test for excess errors)
ERROR: gcc.dg/torture/nested-fn-1.c  -O3 -fomit-frame-pointer : error executing dg-final: couldn't open "nested-fn-1.s": no such file or directory
UNRESOLVED: gcc.dg/torture/nested-fn-1.c  -O3 -fomit-frame-pointer : error executing dg-final: couldn't open "nested-fn-1.s": no such file or directory
FAIL: gcc.dg/torture/nested-fn-1.c  -O3 -g  (internal compiler error)
FAIL: gcc.dg/torture/nested-fn-1.c  -O3 -g  (test for excess errors)
ERROR: gcc.dg/torture/nested-fn-1.c  -O3 -g : error executing dg-final: couldn't open "nested-fn-1.s": no such file or directory
UNRESOLVED: gcc.dg/torture/nested-fn-1.c  -O3 -g : error executing dg-final: couldn't open "nested-fn-1.s": no such file or directory
FAIL: gcc.dg/torture/nested-fn-1.c  -Os  (internal compiler error)
FAIL: gcc.dg/torture/nested-fn-1.c  -Os  (test for excess errors)
ERROR: gcc.dg/torture/nested-fn-1.c  -Os : error executing dg-final: couldn't open "nested-fn-1.s": no such file or directory
UNRESOLVED: gcc.dg/torture/nested-fn-1.c  -Os : error executing dg-final: couldn't open "nested-fn-1.s": no such file or directory
FAIL: gcc.dg/tree-prof/bb-reorg.c compilation,  -fprofile-generate -D_PROFILE_GENERATE
UNRESOLVED: gcc.dg/tree-prof/bb-reorg.c execution,    -fprofile-generate -D_PROFILE_GENERATE
UNRESOLVED: gcc.dg/tree-prof/bb-reorg.c compilation,  -fprofile-use -D_PROFILE_USE
UNRESOLVED: gcc.dg/tree-prof/bb-reorg.c execution,    -fprofile-use -D_PROFILE_USE
FAIL: gcc.dg/tree-prof/indir-call-prof.c compilation,  -fprofile-generate -D_PROFILE_GENERATE
UNRESOLVED: gcc.dg/tree-prof/indir-call-prof.c execution,    -fprofile-generate -D_PROFILE_GENERATE
UNRESOLVED: gcc.dg/tree-prof/indir-call-prof.c compilation,  -fprofile-use -D_PROFILE_USE
UNRESOLVED: gcc.dg/tree-prof/indir-call-prof.c execution,    -fprofile-use -D_PROFILE_USE
FAIL: gcc.dg/tree-prof/inliner-1.c compilation,  -fprofile-generate -D_PROFILE_GENERATE
UNRESOLVED: gcc.dg/tree-prof/inliner-1.c execution,    -fprofile-generate -D_PROFILE_GENERATE
UNRESOLVED: gcc.dg/tree-prof/inliner-1.c compilation,  -fprofile-use -D_PROFILE_USE
UNRESOLVED: gcc.dg/tree-prof/inliner-1.c execution,    -fprofile-use -D_PROFILE_USE
FAIL: gcc.dg/tree-prof/stringop-1.c compilation,  -fprofile-generate -D_PROFILE_GENERATE
UNRESOLVED: gcc.dg/tree-prof/stringop-1.c execution,    -fprofile-generate -D_PROFILE_GENERATE
UNRESOLVED: gcc.dg/tree-prof/stringop-1.c compilation,  -fprofile-use -D_PROFILE_USE
UNRESOLVED: gcc.dg/tree-prof/stringop-1.c execution,    -fprofile-use -D_PROFILE_USE
FAIL: gcc.dg/tree-prof/stringop-2.c compilation,  -fprofile-generate -D_PROFILE_GENERATE
UNRESOLVED: gcc.dg/tree-prof/stringop-2.c execution,    -fprofile-generate -D_PROFILE_GENERATE
UNRESOLVED: gcc.dg/tree-prof/stringop-2.c compilation,  -fprofile-use -D_PROFILE_USE
UNRESOLVED: gcc.dg/tree-prof/stringop-2.c execution,    -fprofile-use -D_PROFILE_USE
FAIL: gcc.dg/tree-prof/tracer-1.c compilation,  -fprofile-generate -D_PROFILE_GENERATE
UNRESOLVED: gcc.dg/tree-prof/tracer-1.c execution,    -fprofile-generate -D_PROFILE_GENERATE
UNRESOLVED: gcc.dg/tree-prof/tracer-1.c compilation,  -fprofile-use -D_PROFILE_USE
UNRESOLVED: gcc.dg/tree-prof/tracer-1.c execution,    -fprofile-use -D_PROFILE_USE
FAIL: gcc.dg/tree-prof/update-cunroll-2.c compilation,  -fprofile-generate -D_PROFILE_GENERATE
UNRESOLVED: gcc.dg/tree-prof/update-cunroll-2.c execution,    -fprofile-generate -D_PROFILE_GENERATE
UNRESOLVED: gcc.dg/tree-prof/update-cunroll-2.c compilation,  -fprofile-use -D_PROFILE_USE
UNRESOLVED: gcc.dg/tree-prof/update-cunroll-2.c execution,    -fprofile-use -D_PROFILE_USE
FAIL: gcc.dg/tree-prof/update-loopch.c compilation,  -fprofile-generate -D_PROFILE_GENERATE
UNRESOLVED: gcc.dg/tree-prof/update-loopch.c execution,    -fprofile-generate -D_PROFILE_GENERATE
UNRESOLVED: gcc.dg/tree-prof/update-loopch.c compilation,  -fprofile-use -D_PROFILE_USE
UNRESOLVED: gcc.dg/tree-prof/update-loopch.c execution,    -fprofile-use -D_PROFILE_USE
FAIL: gcc.dg/tree-prof/update-tailcall.c compilation,  -fprofile-generate -D_PROFILE_GENERATE
UNRESOLVED: gcc.dg/tree-prof/update-tailcall.c execution,    -fprofile-generate -D_PROFILE_GENERATE
UNRESOLVED: gcc.dg/tree-prof/update-tailcall.c compilation,  -fprofile-use -D_PROFILE_USE
UNRESOLVED: gcc.dg/tree-prof/update-tailcall.c execution,    -fprofile-use -D_PROFILE_USE
FAIL: gcc.dg/tree-prof/val-prof-1.c compilation,  -fprofile-generate -D_PROFILE_GENERATE
UNRESOLVED: gcc.dg/tree-prof/val-prof-1.c execution,    -fprofile-generate -D_PROFILE_GENERATE
UNRESOLVED: gcc.dg/tree-prof/val-prof-1.c compilation,  -fprofile-use -D_PROFILE_USE
UNRESOLVED: gcc.dg/tree-prof/val-prof-1.c execution,    -fprofile-use -D_PROFILE_USE
FAIL: gcc.dg/tree-prof/val-prof-2.c compilation,  -fprofile-generate -D_PROFILE_GENERATE
UNRESOLVED: gcc.dg/tree-prof/val-prof-2.c execution,    -fprofile-generate -D_PROFILE_GENERATE
UNRESOLVED: gcc.dg/tree-prof/val-prof-2.c compilation,  -fprofile-use -D_PROFILE_USE
UNRESOLVED: gcc.dg/tree-prof/val-prof-2.c execution,    -fprofile-use -D_PROFILE_USE
FAIL: gcc.dg/tree-prof/val-prof-3.c compilation,  -fprofile-generate -D_PROFILE_GENERATE
UNRESOLVED: gcc.dg/tree-prof/val-prof-3.c execution,    -fprofile-generate -D_PROFILE_GENERATE
UNRESOLVED: gcc.dg/tree-prof/val-prof-3.c compilation,  -fprofile-use -D_PROFILE_USE
UNRESOLVED: gcc.dg/tree-prof/val-prof-3.c execution,    -fprofile-use -D_PROFILE_USE
FAIL: gcc.dg/tree-prof/val-prof-4.c compilation,  -fprofile-generate -D_PROFILE_GENERATE
UNRESOLVED: gcc.dg/tree-prof/val-prof-4.c execution,    -fprofile-generate -D_PROFILE_GENERATE
UNRESOLVED: gcc.dg/tree-prof/val-prof-4.c compilation,  -fprofile-use -D_PROFILE_USE
UNRESOLVED: gcc.dg/tree-prof/val-prof-4.c execution,    -fprofile-use -D_PROFILE_USE
FAIL: gcc.dg/tree-prof/val-prof-5.c compilation,  -fprofile-generate -D_PROFILE_GENERATE
UNRESOLVED: gcc.dg/tree-prof/val-prof-5.c execution,    -fprofile-generate -D_PROFILE_GENERATE
UNRESOLVED: gcc.dg/tree-prof/val-prof-5.c compilation,  -fprofile-use -D_PROFILE_USE
UNRESOLVED: gcc.dg/tree-prof/val-prof-5.c execution,    -fprofile-use -D_PROFILE_USE
FAIL: gcc.dg/tree-prof/val-prof-6.c compilation,  -fprofile-generate -D_PROFILE_GENERATE
UNRESOLVED: gcc.dg/tree-prof/val-prof-6.c execution,    -fprofile-generate -D_PROFILE_GENERATE
UNRESOLVED: gcc.dg/tree-prof/val-prof-6.c compilation,  -fprofile-use -D_PROFILE_USE
UNRESOLVED: gcc.dg/tree-prof/val-prof-6.c execution,    -fprofile-use -D_PROFILE_USE
FAIL: gcc.dg/tree-prof/wcoverage-mismatch.c compilation,  -fprofile-generate -D_PROFILE_GENERATE
UNRESOLVED: gcc.dg/tree-prof/wcoverage-mismatch.c execution,    -fprofile-generate -D_PROFILE_GENERATE
UNRESOLVED: gcc.dg/tree-prof/wcoverage-mismatch.c compilation,  -fprofile-use -D_PROFILE_USE
UNRESOLVED: gcc.dg/tree-prof/wcoverage-mismatch.c execution,    -fprofile-use -D_PROFILE_USE
FAIL: gcc.dg/tree-ssa/20030730-1.c scan-tree-dump-times dom3 "if " 0
FAIL: gcc.dg/tree-ssa/20030730-2.c scan-tree-dump-times dom3 "if " 0
XPASS: gcc.dg/tree-ssa/20040204-1.c scan-tree-dump-times optimized "link_error" 0
FAIL: gcc.dg/tree-ssa/gen-vect-11.c scan-tree-dump-times vect "vectorized 1 loops" 1
FAIL: gcc.dg/tree-ssa/gen-vect-11a.c scan-tree-dump-times vect "vectorized 1 loops" 1
FAIL: gcc.dg/tree-ssa/gen-vect-2.c scan-tree-dump-times vect "vectorized 1 loops" 1
FAIL: gcc.dg/tree-ssa/gen-vect-25.c scan-tree-dump-times vect "vectorized 2 loops" 1
FAIL: gcc.dg/tree-ssa/gen-vect-26.c scan-tree-dump-times vect "vectorized 1 loops" 1
FAIL: gcc.dg/tree-ssa/gen-vect-26.c scan-tree-dump-times vect "Alignment of access forced using peeling" 1
FAIL: gcc.dg/tree-ssa/gen-vect-28.c scan-tree-dump-times vect "vectorized 1 loops" 1
FAIL: gcc.dg/tree-ssa/gen-vect-28.c scan-tree-dump-times vect "Alignment of access forced using peeling" 1
FAIL: gcc.dg/tree-ssa/gen-vect-32.c scan-tree-dump-times vect "vectorized 1 loops" 1
FAIL: gcc.dg/tree-ssa/ifc-20040816-1.c (test for excess errors)
ERROR: gcc.dg/tree-ssa/ifc-20040816-1.c: error executing dg-final: no files matched glob pattern "ifc-20040816-1.c.[0-9][0-9][0-9]t.ifcvt"
UNRESOLVED: gcc.dg/tree-ssa/ifc-20040816-1.c: error executing dg-final: no files matched glob pattern "ifc-20040816-1.c.[0-9][0-9][0-9]t.ifcvt"
FAIL: gcc.dg/tree-ssa/ifc-20040816-2.c (test for excess errors)
FAIL: gcc.dg/tree-ssa/ifc-20040816-2.c scan-tree-dump-times ifcvt "Applying if-conversion" 1
FAIL: gcc.dg/tree-ssa/pr15791-1.c (test for excess errors)
FAIL: gcc.dg/tree-ssa/pr20701.c scan-tree-dump-times vrp2 "Folding predicate.*to 0" 1
FAIL: gcc.dg/tree-ssa/pr20702.c scan-tree-dump-times vrp1 "Folding predicate" 1
FAIL: gcc.dg/tree-ssa/pr21086.c scan-tree-dump-times vrp1 "Folding predicate " 2
FAIL: gcc.dg/tree-ssa/pr23115.c (test for excess errors)
FAIL: gcc.dg/tree-ssa/pr32540-1.c (test for excess errors)
FAIL: gcc.dg/tree-ssa/pr32540-2.c (test for excess errors)
FAIL: gcc.dg/tree-ssa/pr33920.c (test for excess errors)
FAIL: gcc.dg/tree-ssa/predcom-2.c execution test
FAIL: gcc.dg/tree-ssa/predcom-4.c execution test
FAIL: gcc.dg/tree-ssa/predcom-5.c execution test
FAIL: gcc.dg/tree-ssa/vrp02.c scan-tree-dump-times vrp1 "Folding predicate p_.*to 1" 1
FAIL: gcc.dg/tree-ssa/vrp07.c scan-tree-dump-times vrp1 "Folding predicate p_.*to 0" 1
FAIL: gcc.dg/tree-ssa/vrp07.c scan-tree-dump-times vrp1 "PREDICATE: p_[0-9]" 2
FAIL: gcc.dg/tree-ssa/vrp08.c scan-tree-dump-times vrp1 "Folding predicate p_.*to 1" 1
FAIL: gcc.dg/tree-ssa/vrp08.c scan-tree-dump-times vrp1 "PREDICATE: p_.* ne_expr 0" 1
FAIL: gcc.misc-tests/bprob-1.c compilation,  -fprofile-arcs
UNRESOLVED: gcc.misc-tests/bprob-1.c execution,    -fprofile-arcs
UNRESOLVED: gcc.misc-tests/bprob-1.c compilation,  -fbranch-probabilities
UNRESOLVED: gcc.misc-tests/bprob-1.c execution,    -fbranch-probabilities
FAIL: gcc.misc-tests/bprob-2.c execution: file bprob-2.gcda does not exist,  -fprofile-arcs
UNRESOLVED: gcc.misc-tests/bprob-2.c compilation,  -fbranch-probabilities
UNRESOLVED: gcc.misc-tests/bprob-2.c execution,    -fbranch-probabilities
FAIL: compiler driver --coverage option(s) (linker options)

		=== gcc Summary ===

# of expected passes		43144
# of unexpected failures	772
# of unexpected successes	2
# of expected failures		90
# of unresolved testcases	395
# of untested testcases		42
# of unsupported tests		1228
/home/mstein/sim/gcc-4_3-branch/avr/build/gcc/xgcc  version 4.3.3 20081010 (prerelease) [gcc-4_3-branch revision 141048] (GCC) 


Compiler version: 4.3.3 20081010 (prerelease) [gcc-4_3-branch revision 141048] (GCC) gcc 
Platform: avr-unknown-none
configure flags: --target=avr --prefix=/home/mstein/cross-local/avr --enable-languages=c --disable-nls --disable-build-warnings --with-sysroot=/home/mstein/cross-local/avr --with-build-sysroot=/home/mstein/cross-local/avr --with-ld=/home/mstein/cross-local/avr/usr/bin/ld --with-as=/home/mstein/cross-local/avr/usr/bin/as --disable-libssp --with-mpfr=/opt/cfarm/mpfr-2.3.1


Index Nav: [Date Index] [Subject Index] [Author Index] [Thread Index]
Message Nav: [Date Prev] [Date Next] [Thread Prev] [Thread Next]