This is the mail archive of the gcc-testresults@gcc.gnu.org mailing list for the GCC project.


Index Nav: [Date Index] [Subject Index] [Author Index] [Thread Index]
Message Nav: [Date Prev] [Date Next] [Thread Prev] [Thread Next]
Other format: [Raw text]

Results for 4.4.0 20080925 (experimental) (GCC) testsuite on mips64octeon-unknown-linux-gnu


Native configuration is mips64octeon-unknown-linux-gnu

		=== g++ tests ===


Running target unix
FAIL: tmpdir-g++.dg-struct-layout-1/t003 cp_compat_x_tst.o-cp_compat_y_tst.o execute 
FAIL: g++.dg/cdce3.C execution test
FAIL: g++.dg/ipa/iinline-1.C scan-ipa-dump inline "String::funcOne[^\\n]*inline copy in int main"
FAIL: g++.dg/other/PR23205.C scan-assembler .stabs.*foobar:c=i

		=== g++ Summary ===

# of expected passes		18405
# of unexpected failures	4
# of expected failures		81
# of unsupported tests		146
/mnt/src/gcc-clean/mips64octeon-unknown-linux-gnu/gcc/testsuite/g++/../../g++  version 4.4.0 20080925 (experimental) (GCC) 

		=== gcc tests ===


Running target unix
FAIL: gcc.c-torture/execute/loop-2f.c execution,  -O0 
FAIL: gcc.c-torture/execute/loop-2f.c execution,  -O1 
FAIL: gcc.c-torture/execute/loop-2f.c execution,  -O2 
FAIL: gcc.c-torture/execute/loop-2f.c execution,  -O3 -fomit-frame-pointer 
FAIL: gcc.c-torture/execute/loop-2f.c execution,  -O3 -fomit-frame-pointer -funroll-loops 
FAIL: gcc.c-torture/execute/loop-2f.c execution,  -O3 -fomit-frame-pointer -funroll-all-loops -finline-functions 
FAIL: gcc.c-torture/execute/loop-2f.c execution,  -O3 -g 
FAIL: gcc.c-torture/execute/loop-2f.c execution,  -Os 
FAIL: gcc.c-torture/execute/loop-2g.c execution,  -O0 
FAIL: gcc.c-torture/execute/loop-2g.c execution,  -O1 
FAIL: gcc.c-torture/execute/loop-2g.c execution,  -O2 
FAIL: gcc.c-torture/execute/loop-2g.c execution,  -O3 -fomit-frame-pointer 
FAIL: gcc.c-torture/execute/loop-2g.c execution,  -O3 -fomit-frame-pointer -funroll-loops 
FAIL: gcc.c-torture/execute/loop-2g.c execution,  -O3 -fomit-frame-pointer -funroll-all-loops -finline-functions 
FAIL: gcc.c-torture/execute/loop-2g.c execution,  -O3 -g 
FAIL: gcc.c-torture/execute/loop-2g.c execution,  -Os 
FAIL: tmpdir-gcc.dg-struct-layout-1/t001 c_compat_x_tst.o-c_compat_y_tst.o execute 
FAIL: tmpdir-gcc.dg-struct-layout-1/t008 c_compat_x_tst.o-c_compat_y_tst.o execute 
FAIL: tmpdir-gcc.dg-struct-layout-1/t018 c_compat_x_tst.o-c_compat_y_tst.o execute 
FAIL: tmpdir-gcc.dg-struct-layout-1/t027 c_compat_x_tst.o-c_compat_y_tst.o execute 
FAIL: gcc.dg/cpp/direct2s.c -fno-show-column (test for excess errors)
FAIL: gcc.dg/debug/dwarf2/dwarf-die3.c scan-assembler-not DW_AT_inline
FAIL: gcc.dg/pr33645-3.c scan-assembler-not var1_t
FAIL: gcc.dg/pr35729.c scan-rtl-dump-times loop2_invariant "Decided to move invariant" 0
FAIL: gcc.dg/fixed-point/allop.c (internal compiler error)
FAIL: gcc.dg/fixed-point/allop.c (test for excess errors)
FAIL: gcc.dg/fixed-point/binary.c (internal compiler error)
FAIL: gcc.dg/fixed-point/binary.c (test for excess errors)
UNRESOLVED: gcc.dg/fixed-point/binary.c compilation failed to produce executable
FAIL: gcc.dg/fixed-point/composite-type.c (test for excess errors)
FAIL: gcc.dg/fixed-point/func-struct.c execution test
FAIL: gcc.dg/pch/valid-1b.c -O0 -g -I. (test for excess errors)
FAIL: gcc.dg/pch/valid-1b.c -O0 -g assembly comparison
FAIL: gcc.dg/pch/valid-1b.c  -O0  -I. (test for excess errors)
FAIL: gcc.dg/pch/valid-1b.c  -O0  assembly comparison
FAIL: gcc.dg/pch/valid-1b.c  -O1  -I. (test for excess errors)
FAIL: gcc.dg/pch/valid-1b.c  -O1  assembly comparison
FAIL: gcc.dg/pch/valid-1b.c  -O2  -I. (test for excess errors)
FAIL: gcc.dg/pch/valid-1b.c  -O2  assembly comparison
FAIL: gcc.dg/pch/valid-1b.c  -O3 -fomit-frame-pointer  -I. (test for excess errors)
FAIL: gcc.dg/pch/valid-1b.c  -O3 -fomit-frame-pointer  assembly comparison
FAIL: gcc.dg/pch/valid-1b.c  -O3 -g  -I. (test for excess errors)
FAIL: gcc.dg/pch/valid-1b.c  -O3 -g  assembly comparison
FAIL: gcc.dg/pch/valid-1b.c  -Os  -I. (test for excess errors)
FAIL: gcc.dg/pch/valid-1b.c  -Os  assembly comparison
FAIL: gcc.dg/torture/pr19683-1.c  -O2  execution test
FAIL: gcc.dg/torture/pr19683-1.c  -O3 -fomit-frame-pointer  execution test
FAIL: gcc.dg/torture/pr19683-1.c  -O3 -g  execution test
FAIL: gcc.dg/torture/pr19683-1.c  -Os  execution test
FAIL: gcc.dg/tree-ssa/ssa-store-ccp-3.c scan-tree-dump-times optimized "conststaticvariable" 1
FAIL: gcc.dg/tree-ssa/vrp47.c scan-tree-dump-times vrp1 "[xy][^ ]* !=" 0
FAIL: gcc.dg/tree-ssa/vrp47.c scan-tree-dump-times dom1 "x[^ ]* & y" 1
FAIL: gcc.dg/tree-ssa/vrp47.c scan-tree-dump-times vrp1 "x[^ ]* [|] y" 1
FAIL: gcc.target/mips/branch-1.c scan-assembler \\tandi\\t.*\\tandi\\t.*\\tandi\\t.*\\tandi\\t
FAIL: gcc.target/mips/fpr-moves-5.c (internal compiler error)
FAIL: gcc.target/mips/fpr-moves-5.c (test for excess errors)
ERROR: gcc.target/mips/fpr-moves-5.c: error executing dg-final: couldn't open "fpr-moves-5.s": no such file or directory
UNRESOLVED: gcc.target/mips/fpr-moves-5.c: error executing dg-final: couldn't open "fpr-moves-5.s": no such file or directory
FAIL: gcc.target/mips/fpr-moves-6.c (internal compiler error)
FAIL: gcc.target/mips/fpr-moves-6.c (test for excess errors)
ERROR: gcc.target/mips/fpr-moves-6.c: error executing dg-final: couldn't open "fpr-moves-6.s": no such file or directory
UNRESOLVED: gcc.target/mips/fpr-moves-6.c: error executing dg-final: couldn't open "fpr-moves-6.s": no such file or directory

		=== gcc Summary ===

# of expected passes		49308
# of unexpected failures	57
# of expected failures		125
# of unresolved testcases	3
# of unsupported tests		483
/mnt/src/gcc-clean/mips64octeon-unknown-linux-gnu/gcc/xgcc  version 4.4.0 20080925 (experimental) (GCC) 

		=== gfortran tests ===


Running target unix
FAIL: gfortran.dg/achar_2.f90  -O0  execution test
FAIL: gfortran.dg/achar_2.f90  -O1  execution test
FAIL: gfortran.dg/achar_2.f90  -O2  execution test
FAIL: gfortran.dg/achar_2.f90  -O3 -fomit-frame-pointer  execution test
FAIL: gfortran.dg/achar_2.f90  -O3 -fomit-frame-pointer -funroll-loops  execution test
FAIL: gfortran.dg/achar_2.f90  -O3 -fomit-frame-pointer -funroll-all-loops -finline-functions  execution test
FAIL: gfortran.dg/achar_2.f90  -O3 -g  execution test
FAIL: gfortran.dg/achar_2.f90  -Os  execution test
FAIL: gfortran.dg/actual_array_constructor_2.f90  -O0  execution test
FAIL: gfortran.dg/actual_array_constructor_2.f90  -O1  execution test
FAIL: gfortran.dg/actual_array_constructor_2.f90  -O2  execution test
FAIL: gfortran.dg/actual_array_constructor_2.f90  -O3 -fomit-frame-pointer  execution test
FAIL: gfortran.dg/actual_array_constructor_2.f90  -O3 -fomit-frame-pointer -funroll-loops  execution test
FAIL: gfortran.dg/actual_array_constructor_2.f90  -O3 -fomit-frame-pointer -funroll-all-loops -finline-functions  execution test
FAIL: gfortran.dg/actual_array_constructor_2.f90  -O3 -g  execution test
FAIL: gfortran.dg/actual_array_constructor_2.f90  -Os  execution test
FAIL: gfortran.dg/actual_array_result_1.f90  -O0  (test for excess errors)
UNRESOLVED: gfortran.dg/actual_array_result_1.f90  -O0  compilation failed to produce executable
FAIL: gfortran.dg/actual_array_result_1.f90  -O1  (test for excess errors)
UNRESOLVED: gfortran.dg/actual_array_result_1.f90  -O1  compilation failed to produce executable
FAIL: gfortran.dg/actual_array_result_1.f90  -O2  (test for excess errors)
UNRESOLVED: gfortran.dg/actual_array_result_1.f90  -O2  compilation failed to produce executable
FAIL: gfortran.dg/actual_array_result_1.f90  -O3 -fomit-frame-pointer  (test for excess errors)
UNRESOLVED: gfortran.dg/actual_array_result_1.f90  -O3 -fomit-frame-pointer  compilation failed to produce executable
FAIL: gfortran.dg/actual_array_result_1.f90  -O3 -fomit-frame-pointer -funroll-loops  (test for excess errors)
UNRESOLVED: gfortran.dg/actual_array_result_1.f90  -O3 -fomit-frame-pointer -funroll-loops  compilation failed to produce executable
FAIL: gfortran.dg/actual_array_result_1.f90  -O3 -fomit-frame-pointer -funroll-all-loops -finline-functions  (test for excess errors)
UNRESOLVED: gfortran.dg/actual_array_result_1.f90  -O3 -fomit-frame-pointer -funroll-all-loops -finline-functions  compilation failed to produce executable
FAIL: gfortran.dg/actual_array_result_1.f90  -O3 -g  (test for excess errors)
UNRESOLVED: gfortran.dg/actual_array_result_1.f90  -O3 -g  compilation failed to produce executable
FAIL: gfortran.dg/actual_array_result_1.f90  -Os  (test for excess errors)
UNRESOLVED: gfortran.dg/actual_array_result_1.f90  -Os  compilation failed to produce executable
FAIL: gfortran.dg/advance_6.f90  -O0  execution test
FAIL: gfortran.dg/advance_6.f90  -O1  execution test
FAIL: gfortran.dg/advance_6.f90  -O2  execution test
FAIL: gfortran.dg/advance_6.f90  -O3 -fomit-frame-pointer  execution test
FAIL: gfortran.dg/advance_6.f90  -O3 -fomit-frame-pointer -funroll-loops  execution test
FAIL: gfortran.dg/advance_6.f90  -O3 -fomit-frame-pointer -funroll-all-loops -finline-functions  execution test
FAIL: gfortran.dg/advance_6.f90  -O3 -g  execution test
FAIL: gfortran.dg/advance_6.f90  -Os  execution test
FAIL: gfortran.dg/aliasing_dummy_1.f90  -O0  (test for excess errors)
UNRESOLVED: gfortran.dg/aliasing_dummy_1.f90  -O0  compilation failed to produce executable
FAIL: gfortran.dg/aliasing_dummy_1.f90  -O1  (test for excess errors)
UNRESOLVED: gfortran.dg/aliasing_dummy_1.f90  -O1  compilation failed to produce executable
FAIL: gfortran.dg/aliasing_dummy_1.f90  -O2  (test for excess errors)
UNRESOLVED: gfortran.dg/aliasing_dummy_1.f90  -O2  compilation failed to produce executable
FAIL: gfortran.dg/aliasing_dummy_1.f90  -O3 -fomit-frame-pointer  (test for excess errors)
UNRESOLVED: gfortran.dg/aliasing_dummy_1.f90  -O3 -fomit-frame-pointer  compilation failed to produce executable
FAIL: gfortran.dg/aliasing_dummy_1.f90  -O3 -fomit-frame-pointer -funroll-loops  (test for excess errors)
UNRESOLVED: gfortran.dg/aliasing_dummy_1.f90  -O3 -fomit-frame-pointer -funroll-loops  compilation failed to produce executable
FAIL: gfortran.dg/aliasing_dummy_1.f90  -O3 -fomit-frame-pointer -funroll-all-loops -finline-functions  (test for excess errors)
UNRESOLVED: gfortran.dg/aliasing_dummy_1.f90  -O3 -fomit-frame-pointer -funroll-all-loops -finline-functions  compilation failed to produce executable
FAIL: gfortran.dg/aliasing_dummy_1.f90  -O3 -g  (test for excess errors)
UNRESOLVED: gfortran.dg/aliasing_dummy_1.f90  -O3 -g  compilation failed to produce executable
FAIL: gfortran.dg/aliasing_dummy_1.f90  -Os  (test for excess errors)
UNRESOLVED: gfortran.dg/aliasing_dummy_1.f90  -Os  compilation failed to produce executable
FAIL: gfortran.dg/aliasing_dummy_4.f90  -O0  (test for excess errors)
UNRESOLVED: gfortran.dg/aliasing_dummy_4.f90  -O0  compilation failed to produce executable
FAIL: gfortran.dg/aliasing_dummy_4.f90  -O1  (test for excess errors)
UNRESOLVED: gfortran.dg/aliasing_dummy_4.f90  -O1  compilation failed to produce executable
FAIL: gfortran.dg/aliasing_dummy_4.f90  -O2  (test for excess errors)
UNRESOLVED: gfortran.dg/aliasing_dummy_4.f90  -O2  compilation failed to produce executable
FAIL: gfortran.dg/aliasing_dummy_4.f90  -O3 -fomit-frame-pointer  (test for excess errors)
UNRESOLVED: gfortran.dg/aliasing_dummy_4.f90  -O3 -fomit-frame-pointer  compilation failed to produce executable
FAIL: gfortran.dg/aliasing_dummy_4.f90  -O3 -fomit-frame-pointer -funroll-loops  (test for excess errors)
UNRESOLVED: gfortran.dg/aliasing_dummy_4.f90  -O3 -fomit-frame-pointer -funroll-loops  compilation failed to produce executable
FAIL: gfortran.dg/aliasing_dummy_4.f90  -O3 -fomit-frame-pointer -funroll-all-loops -finline-functions  (test for excess errors)
UNRESOLVED: gfortran.dg/aliasing_dummy_4.f90  -O3 -fomit-frame-pointer -funroll-all-loops -finline-functions  compilation failed to produce executable
FAIL: gfortran.dg/aliasing_dummy_4.f90  -O3 -g  (test for excess errors)
UNRESOLVED: gfortran.dg/aliasing_dummy_4.f90  -O3 -g  compilation failed to produce executable
FAIL: gfortran.dg/aliasing_dummy_4.f90  -Os  (test for excess errors)
UNRESOLVED: gfortran.dg/aliasing_dummy_4.f90  -Os  compilation failed to produce executable
FAIL: gfortran.dg/alloc_comp_constructor_1.f90  -O0  (test for excess errors)
UNRESOLVED: gfortran.dg/alloc_comp_constructor_1.f90  -O0  compilation failed to produce executable
FAIL: gfortran.dg/alloc_comp_constructor_1.f90  -O0  scan-tree-dump-times original "builtin_free" 21: dump file does not exist
FAIL: gfortran.dg/alloc_comp_constructor_1.f90  -O1  (test for excess errors)
UNRESOLVED: gfortran.dg/alloc_comp_constructor_1.f90  -O1  compilation failed to produce executable
FAIL: gfortran.dg/alloc_comp_constructor_1.f90  -O1  scan-tree-dump-times original "builtin_free" 21: dump file does not exist
FAIL: gfortran.dg/alloc_comp_constructor_1.f90  -O2  (test for excess errors)
UNRESOLVED: gfortran.dg/alloc_comp_constructor_1.f90  -O2  compilation failed to produce executable
FAIL: gfortran.dg/alloc_comp_constructor_1.f90  -O2  scan-tree-dump-times original "builtin_free" 21: dump file does not exist
FAIL: gfortran.dg/alloc_comp_constructor_1.f90  -O3 -fomit-frame-pointer  (test for excess errors)
UNRESOLVED: gfortran.dg/alloc_comp_constructor_1.f90  -O3 -fomit-frame-pointer  compilation failed to produce executable
FAIL: gfortran.dg/alloc_comp_constructor_1.f90  -O3 -fomit-frame-pointer  scan-tree-dump-times original "builtin_free" 21: dump file does not exist
FAIL: gfortran.dg/alloc_comp_constructor_1.f90  -O3 -fomit-frame-pointer -funroll-loops  (test for excess errors)
UNRESOLVED: gfortran.dg/alloc_comp_constructor_1.f90  -O3 -fomit-frame-pointer -funroll-loops  compilation failed to produce executable
FAIL: gfortran.dg/alloc_comp_constructor_1.f90  -O3 -fomit-frame-pointer -funroll-loops  scan-tree-dump-times original "builtin_free" 21: dump file does not exist
FAIL: gfortran.dg/alloc_comp_constructor_1.f90  -O3 -fomit-frame-pointer -funroll-all-loops -finline-functions  (test for excess errors)
UNRESOLVED: gfortran.dg/alloc_comp_constructor_1.f90  -O3 -fomit-frame-pointer -funroll-all-loops -finline-functions  compilation failed to produce executable
FAIL: gfortran.dg/alloc_comp_constructor_1.f90  -O3 -fomit-frame-pointer -funroll-all-loops -finline-functions  scan-tree-dump-times original "builtin_free" 21: dump file does not exist
FAIL: gfortran.dg/alloc_comp_constructor_1.f90  -O3 -g  (test for excess errors)
UNRESOLVED: gfortran.dg/alloc_comp_constructor_1.f90  -O3 -g  compilation failed to produce executable
FAIL: gfortran.dg/alloc_comp_constructor_1.f90  -O3 -g  scan-tree-dump-times original "builtin_free" 21: dump file does not exist
FAIL: gfortran.dg/alloc_comp_constructor_1.f90  -Os  (test for excess errors)
UNRESOLVED: gfortran.dg/alloc_comp_constructor_1.f90  -Os  compilation failed to produce executable
FAIL: gfortran.dg/alloc_comp_constructor_1.f90  -Os  scan-tree-dump-times original "builtin_free" 21: dump file does not exist
FAIL: gfortran.dg/argument_checking_10.f90  -O   (test for warnings, line 11)
FAIL: gfortran.dg/argument_checking_13.f90  -O   (test for warnings, line 56)
FAIL: gfortran.dg/argument_checking_13.f90  -O   (test for warnings, line 57)
FAIL: gfortran.dg/argument_checking_13.f90  -O   (test for warnings, line 75)
FAIL: gfortran.dg/argument_checking_13.f90  -O   (test for warnings, line 76)
FAIL: gfortran.dg/argument_checking_13.f90  -O   (test for warnings, line 77)
FAIL: gfortran.dg/argument_checking_13.f90  -O   (test for warnings, line 80)
FAIL: gfortran.dg/argument_checking_13.f90  -O   (test for warnings, line 81)
FAIL: gfortran.dg/argument_checking_13.f90  -O   (test for warnings, line 82)
FAIL: gfortran.dg/argument_checking_15.f90  -O   (test for warnings, line 17)
FAIL: gfortran.dg/argument_checking_15.f90  -O   (test for warnings, line 19)
FAIL: gfortran.dg/argument_checking_15.f90  -O   (test for warnings, line 20)
FAIL: gfortran.dg/argument_checking_15.f90  -O   (test for warnings, line 24)
FAIL: gfortran.dg/argument_checking_15.f90  -O   (test for warnings, line 25)
FAIL: gfortran.dg/argument_checking_15.f90  -O   (test for warnings, line 26)
FAIL: gfortran.dg/argument_checking_15.f90  -O   (test for warnings, line 30)
FAIL: gfortran.dg/argument_checking_3.f90  -O   (test for warnings, line 28)
FAIL: gfortran.dg/argument_checking_3.f90  -O   (test for warnings, line 30)
FAIL: gfortran.dg/argument_checking_3.f90  -O   (test for warnings, line 32)
FAIL: gfortran.dg/argument_checking_3.f90  -O   (test for warnings, line 34)
FAIL: gfortran.dg/argument_checking_4.f90  -O   (test for warnings, line 15)
FAIL: gfortran.dg/argument_checking_4.f90  -O   (test for warnings, line 17)
FAIL: gfortran.dg/argument_checking_4.f90  -O   (test for warnings, line 19)
FAIL: gfortran.dg/argument_checking_4.f90  -O   (test for warnings, line 20)
FAIL: gfortran.dg/argument_checking_4.f90  -O  (test for excess errors)
FAIL: gfortran.dg/argument_checking_5.f90  -O   (test for warnings, line 16)
FAIL: gfortran.dg/argument_checking_5.f90  -O   (test for warnings, line 18)
FAIL: gfortran.dg/argument_checking_5.f90  -O   (test for warnings, line 20)
FAIL: gfortran.dg/argument_checking_5.f90  -O   (test for warnings, line 22)
FAIL: gfortran.dg/argument_checking_5.f90  -O   (test for warnings, line 23)
FAIL: gfortran.dg/argument_checking_5.f90  -O   (test for warnings, line 26)
FAIL: gfortran.dg/argument_checking_5.f90  -O   (test for warnings, line 28)
FAIL: gfortran.dg/argument_checking_5.f90  -O   (test for warnings, line 30)
FAIL: gfortran.dg/argument_checking_5.f90  -O   (test for warnings, line 32)
FAIL: gfortran.dg/argument_checking_5.f90  -O   (test for warnings, line 33)
FAIL: gfortran.dg/argument_checking_6.f90  -O   (test for errors, line 17)
FAIL: gfortran.dg/array_alloc_2.f90  -O0  (test for excess errors)
UNRESOLVED: gfortran.dg/array_alloc_2.f90  -O0  compilation failed to produce executable
FAIL: gfortran.dg/array_alloc_2.f90  -O1  (test for excess errors)
UNRESOLVED: gfortran.dg/array_alloc_2.f90  -O1  compilation failed to produce executable
FAIL: gfortran.dg/array_alloc_2.f90  -O2  (test for excess errors)
UNRESOLVED: gfortran.dg/array_alloc_2.f90  -O2  compilation failed to produce executable
FAIL: gfortran.dg/array_alloc_2.f90  -O3 -fomit-frame-pointer  (test for excess errors)
UNRESOLVED: gfortran.dg/array_alloc_2.f90  -O3 -fomit-frame-pointer  compilation failed to produce executable
FAIL: gfortran.dg/array_alloc_2.f90  -O3 -fomit-frame-pointer -funroll-loops  (test for excess errors)
UNRESOLVED: gfortran.dg/array_alloc_2.f90  -O3 -fomit-frame-pointer -funroll-loops  compilation failed to produce executable
FAIL: gfortran.dg/array_alloc_2.f90  -O3 -fomit-frame-pointer -funroll-all-loops -finline-functions  (test for excess errors)
UNRESOLVED: gfortran.dg/array_alloc_2.f90  -O3 -fomit-frame-pointer -funroll-all-loops -finline-functions  compilation failed to produce executable
FAIL: gfortran.dg/array_alloc_2.f90  -O3 -g  (test for excess errors)
UNRESOLVED: gfortran.dg/array_alloc_2.f90  -O3 -g  compilation failed to produce executable
FAIL: gfortran.dg/array_alloc_2.f90  -Os  (test for excess errors)
UNRESOLVED: gfortran.dg/array_alloc_2.f90  -Os  compilation failed to produce executable
FAIL: gfortran.dg/array_constructor_10.f90  -O0  (test for excess errors)
UNRESOLVED: gfortran.dg/array_constructor_10.f90  -O0  compilation failed to produce executable
FAIL: gfortran.dg/array_constructor_10.f90  -O1  (test for excess errors)
UNRESOLVED: gfortran.dg/array_constructor_10.f90  -O1  compilation failed to produce executable
FAIL: gfortran.dg/array_constructor_10.f90  -O2  (test for excess errors)
UNRESOLVED: gfortran.dg/array_constructor_10.f90  -O2  compilation failed to produce executable
FAIL: gfortran.dg/array_constructor_10.f90  -O3 -fomit-frame-pointer  (test for excess errors)
UNRESOLVED: gfortran.dg/array_constructor_10.f90  -O3 -fomit-frame-pointer  compilation failed to produce executable
FAIL: gfortran.dg/array_constructor_10.f90  -O3 -fomit-frame-pointer -funroll-loops  (test for excess errors)
UNRESOLVED: gfortran.dg/array_constructor_10.f90  -O3 -fomit-frame-pointer -funroll-loops  compilation failed to produce executable
FAIL: gfortran.dg/array_constructor_10.f90  -O3 -fomit-frame-pointer -funroll-all-loops -finline-functions  (test for excess errors)
UNRESOLVED: gfortran.dg/array_constructor_10.f90  -O3 -fomit-frame-pointer -funroll-all-loops -finline-functions  compilation failed to produce executable
FAIL: gfortran.dg/array_constructor_10.f90  -O3 -g  (test for excess errors)
UNRESOLVED: gfortran.dg/array_constructor_10.f90  -O3 -g  compilation failed to produce executable
FAIL: gfortran.dg/array_constructor_10.f90  -Os  (test for excess errors)
UNRESOLVED: gfortran.dg/array_constructor_10.f90  -Os  compilation failed to produce executable
FAIL: gfortran.dg/array_constructor_11.f90  -O0  (test for excess errors)
UNRESOLVED: gfortran.dg/array_constructor_11.f90  -O0  compilation failed to produce executable
FAIL: gfortran.dg/array_constructor_11.f90  -O1  (test for excess errors)
UNRESOLVED: gfortran.dg/array_constructor_11.f90  -O1  compilation failed to produce executable
FAIL: gfortran.dg/array_constructor_11.f90  -O2  (test for excess errors)
UNRESOLVED: gfortran.dg/array_constructor_11.f90  -O2  compilation failed to produce executable
FAIL: gfortran.dg/array_constructor_11.f90  -O3 -fomit-frame-pointer  (test for excess errors)
UNRESOLVED: gfortran.dg/array_constructor_11.f90  -O3 -fomit-frame-pointer  compilation failed to produce executable
FAIL: gfortran.dg/array_constructor_11.f90  -O3 -fomit-frame-pointer -funroll-loops  (test for excess errors)
UNRESOLVED: gfortran.dg/array_constructor_11.f90  -O3 -fomit-frame-pointer -funroll-loops  compilation failed to produce executable
FAIL: gfortran.dg/array_constructor_11.f90  -O3 -fomit-frame-pointer -funroll-all-loops -finline-functions  (test for excess errors)
UNRESOLVED: gfortran.dg/array_constructor_11.f90  -O3 -fomit-frame-pointer -funroll-all-loops -finline-functions  compilation failed to produce executable
FAIL: gfortran.dg/array_constructor_11.f90  -O3 -g  (test for excess errors)
UNRESOLVED: gfortran.dg/array_constructor_11.f90  -O3 -g  compilation failed to produce executable
FAIL: gfortran.dg/array_constructor_11.f90  -Os  (test for excess errors)
UNRESOLVED: gfortran.dg/array_constructor_11.f90  -Os  compilation failed to produce executable
FAIL: gfortran.dg/array_constructor_12.f90  -O0  (test for excess errors)
UNRESOLVED: gfortran.dg/array_constructor_12.f90  -O0  compilation failed to produce executable
FAIL: gfortran.dg/array_constructor_12.f90  -O1  (test for excess errors)
UNRESOLVED: gfortran.dg/array_constructor_12.f90  -O1  compilation failed to produce executable
FAIL: gfortran.dg/array_constructor_12.f90  -O2  (test for excess errors)
UNRESOLVED: gfortran.dg/array_constructor_12.f90  -O2  compilation failed to produce executable
FAIL: gfortran.dg/array_constructor_12.f90  -O3 -fomit-frame-pointer  (test for excess errors)
UNRESOLVED: gfortran.dg/array_constructor_12.f90  -O3 -fomit-frame-pointer  compilation failed to produce executable
FAIL: gfortran.dg/array_constructor_12.f90  -O3 -fomit-frame-pointer -funroll-loops  (test for excess errors)
UNRESOLVED: gfortran.dg/array_constructor_12.f90  -O3 -fomit-frame-pointer -funroll-loops  compilation failed to produce executable
FAIL: gfortran.dg/array_constructor_12.f90  -O3 -fomit-frame-pointer -funroll-all-loops -finline-functions  (test for excess errors)
UNRESOLVED: gfortran.dg/array_constructor_12.f90  -O3 -fomit-frame-pointer -funroll-all-loops -finline-functions  compilation failed to produce executable
FAIL: gfortran.dg/array_constructor_12.f90  -O3 -g  (test for excess errors)
UNRESOLVED: gfortran.dg/array_constructor_12.f90  -O3 -g  compilation failed to produce executable
FAIL: gfortran.dg/array_constructor_12.f90  -Os  (test for excess errors)
UNRESOLVED: gfortran.dg/array_constructor_12.f90  -Os  compilation failed to produce executable
FAIL: gfortran.dg/array_constructor_15.f90  -O  (test for excess errors)
FAIL: gfortran.dg/array_constructor_15.f90  -O  scan-tree-dump-times original "atmp" 0: dump file does not exist
FAIL: gfortran.dg/array_constructor_22.f90  -O  (test for excess errors)
FAIL: gfortran.dg/array_constructor_6.f90  -O0  (test for excess errors)
UNRESOLVED: gfortran.dg/array_constructor_6.f90  -O0  compilation failed to produce executable
FAIL: gfortran.dg/array_constructor_6.f90  -O1  (test for excess errors)
UNRESOLVED: gfortran.dg/array_constructor_6.f90  -O1  compilation failed to produce executable
FAIL: gfortran.dg/array_constructor_6.f90  -O2  (test for excess errors)
UNRESOLVED: gfortran.dg/array_constructor_6.f90  -O2  compilation failed to produce executable
FAIL: gfortran.dg/array_constructor_6.f90  -O3 -fomit-frame-pointer  (test for excess errors)
UNRESOLVED: gfortran.dg/array_constructor_6.f90  -O3 -fomit-frame-pointer  compilation failed to produce executable
FAIL: gfortran.dg/array_constructor_6.f90  -O3 -fomit-frame-pointer -funroll-loops  (test for excess errors)
UNRESOLVED: gfortran.dg/array_constructor_6.f90  -O3 -fomit-frame-pointer -funroll-loops  compilation failed to produce executable
FAIL: gfortran.dg/array_constructor_6.f90  -O3 -fomit-frame-pointer -funroll-all-loops -finline-functions  (test for excess errors)
UNRESOLVED: gfortran.dg/array_constructor_6.f90  -O3 -fomit-frame-pointer -funroll-all-loops -finline-functions  compilation failed to produce executable
FAIL: gfortran.dg/array_constructor_6.f90  -O3 -g  (test for excess errors)
UNRESOLVED: gfortran.dg/array_constructor_6.f90  -O3 -g  compilation failed to produce executable
FAIL: gfortran.dg/array_constructor_6.f90  -Os  (test for excess errors)
UNRESOLVED: gfortran.dg/array_constructor_6.f90  -Os  compilation failed to produce executable
FAIL: gfortran.dg/array_constructor_7.f90  -O0  (test for excess errors)
UNRESOLVED: gfortran.dg/array_constructor_7.f90  -O0  compilation failed to produce executable
FAIL: gfortran.dg/array_constructor_7.f90  -O1  (test for excess errors)
UNRESOLVED: gfortran.dg/array_constructor_7.f90  -O1  compilation failed to produce executable
FAIL: gfortran.dg/array_constructor_7.f90  -O2  (test for excess errors)
UNRESOLVED: gfortran.dg/array_constructor_7.f90  -O2  compilation failed to produce executable
FAIL: gfortran.dg/array_constructor_7.f90  -O3 -fomit-frame-pointer  (test for excess errors)
UNRESOLVED: gfortran.dg/array_constructor_7.f90  -O3 -fomit-frame-pointer  compilation failed to produce executable
FAIL: gfortran.dg/array_constructor_7.f90  -O3 -fomit-frame-pointer -funroll-loops  (test for excess errors)
UNRESOLVED: gfortran.dg/array_constructor_7.f90  -O3 -fomit-frame-pointer -funroll-loops  compilation failed to produce executable
FAIL: gfortran.dg/array_constructor_7.f90  -O3 -fomit-frame-pointer -funroll-all-loops -finline-functions  (test for excess errors)
UNRESOLVED: gfortran.dg/array_constructor_7.f90  -O3 -fomit-frame-pointer -funroll-all-loops -finline-functions  compilation failed to produce executable
FAIL: gfortran.dg/array_constructor_7.f90  -O3 -g  (test for excess errors)
UNRESOLVED: gfortran.dg/array_constructor_7.f90  -O3 -g  compilation failed to produce executable
FAIL: gfortran.dg/array_constructor_7.f90  -Os  (test for excess errors)
UNRESOLVED: gfortran.dg/array_constructor_7.f90  -Os  compilation failed to produce executable
FAIL: gfortran.dg/array_constructor_8.f90  -O0  (test for excess errors)
UNRESOLVED: gfortran.dg/array_constructor_8.f90  -O0  compilation failed to produce executable
FAIL: gfortran.dg/array_constructor_8.f90  -O1  (test for excess errors)
UNRESOLVED: gfortran.dg/array_constructor_8.f90  -O1  compilation failed to produce executable
FAIL: gfortran.dg/array_constructor_8.f90  -O2  (test for excess errors)
UNRESOLVED: gfortran.dg/array_constructor_8.f90  -O2  compilation failed to produce executable
FAIL: gfortran.dg/array_constructor_8.f90  -O3 -fomit-frame-pointer  (test for excess errors)
UNRESOLVED: gfortran.dg/array_constructor_8.f90  -O3 -fomit-frame-pointer  compilation failed to produce executable
FAIL: gfortran.dg/array_constructor_8.f90  -O3 -fomit-frame-pointer -funroll-loops  (test for excess errors)
UNRESOLVED: gfortran.dg/array_constructor_8.f90  -O3 -fomit-frame-pointer -funroll-loops  compilation failed to produce executable
FAIL: gfortran.dg/array_constructor_8.f90  -O3 -fomit-frame-pointer -funroll-all-loops -finline-functions  (test for excess errors)
UNRESOLVED: gfortran.dg/array_constructor_8.f90  -O3 -fomit-frame-pointer -funroll-all-loops -finline-functions  compilation failed to produce executable
FAIL: gfortran.dg/array_constructor_8.f90  -O3 -g  (test for excess errors)
UNRESOLVED: gfortran.dg/array_constructor_8.f90  -O3 -g  compilation failed to produce executable
FAIL: gfortran.dg/array_constructor_8.f90  -Os  (test for excess errors)
UNRESOLVED: gfortran.dg/array_constructor_8.f90  -Os  compilation failed to produce executable
FAIL: gfortran.dg/array_constructor_9.f90  -O0  (test for excess errors)
UNRESOLVED: gfortran.dg/array_constructor_9.f90  -O0  compilation failed to produce executable
FAIL: gfortran.dg/array_constructor_9.f90  -O1  (test for excess errors)
UNRESOLVED: gfortran.dg/array_constructor_9.f90  -O1  compilation failed to produce executable
FAIL: gfortran.dg/array_constructor_9.f90  -O2  (test for excess errors)
UNRESOLVED: gfortran.dg/array_constructor_9.f90  -O2  compilation failed to produce executable
FAIL: gfortran.dg/array_constructor_9.f90  -O3 -fomit-frame-pointer  (test for excess errors)
UNRESOLVED: gfortran.dg/array_constructor_9.f90  -O3 -fomit-frame-pointer  compilation failed to produce executable
FAIL: gfortran.dg/array_constructor_9.f90  -O3 -fomit-frame-pointer -funroll-loops  (test for excess errors)
UNRESOLVED: gfortran.dg/array_constructor_9.f90  -O3 -fomit-frame-pointer -funroll-loops  compilation failed to produce executable
FAIL: gfortran.dg/array_constructor_9.f90  -O3 -fomit-frame-pointer -funroll-all-loops -finline-functions  (test for excess errors)
UNRESOLVED: gfortran.dg/array_constructor_9.f90  -O3 -fomit-frame-pointer -funroll-all-loops -finline-functions  compilation failed to produce executable
FAIL: gfortran.dg/array_constructor_9.f90  -O3 -g  (test for excess errors)
UNRESOLVED: gfortran.dg/array_constructor_9.f90  -O3 -g  compilation failed to produce executable
FAIL: gfortran.dg/array_constructor_9.f90  -Os  (test for excess errors)
UNRESOLVED: gfortran.dg/array_constructor_9.f90  -Os  compilation failed to produce executable
FAIL: gfortran.dg/array_constructor_type_2.f03  -O0  execution test
FAIL: gfortran.dg/array_constructor_type_2.f03  -O1  execution test
FAIL: gfortran.dg/array_constructor_type_2.f03  -O2  execution test
FAIL: gfortran.dg/array_constructor_type_2.f03  -O3 -fomit-frame-pointer  execution test
FAIL: gfortran.dg/array_constructor_type_2.f03  -O3 -fomit-frame-pointer -funroll-loops  execution test
FAIL: gfortran.dg/array_constructor_type_2.f03  -O3 -fomit-frame-pointer -funroll-all-loops -finline-functions  execution test
FAIL: gfortran.dg/array_constructor_type_2.f03  -O3 -g  execution test
FAIL: gfortran.dg/array_constructor_type_2.f03  -Os  execution test
FAIL: gfortran.dg/array_constructor_type_5.f03  -O0  execution test
FAIL: gfortran.dg/array_constructor_type_5.f03  -O1  execution test
FAIL: gfortran.dg/array_constructor_type_5.f03  -O2  execution test
FAIL: gfortran.dg/array_constructor_type_5.f03  -O3 -fomit-frame-pointer  execution test
FAIL: gfortran.dg/array_constructor_type_5.f03  -O3 -fomit-frame-pointer -funroll-loops  execution test
FAIL: gfortran.dg/array_constructor_type_5.f03  -O3 -fomit-frame-pointer -funroll-all-loops -finline-functions  execution test
FAIL: gfortran.dg/array_constructor_type_5.f03  -O3 -g  execution test
FAIL: gfortran.dg/array_constructor_type_5.f03  -Os  execution test
FAIL: gfortran.dg/array_initializer_1.f90  -O0  (test for excess errors)
UNRESOLVED: gfortran.dg/array_initializer_1.f90  -O0  compilation failed to produce executable
FAIL: gfortran.dg/array_initializer_1.f90  -O1  (test for excess errors)
UNRESOLVED: gfortran.dg/array_initializer_1.f90  -O1  compilation failed to produce executable
FAIL: gfortran.dg/array_initializer_1.f90  -O2  (test for excess errors)
UNRESOLVED: gfortran.dg/array_initializer_1.f90  -O2  compilation failed to produce executable
FAIL: gfortran.dg/array_initializer_1.f90  -O3 -fomit-frame-pointer  (test for excess errors)
UNRESOLVED: gfortran.dg/array_initializer_1.f90  -O3 -fomit-frame-pointer  compilation failed to produce executable
FAIL: gfortran.dg/array_initializer_1.f90  -O3 -fomit-frame-pointer -funroll-loops  (test for excess errors)
UNRESOLVED: gfortran.dg/array_initializer_1.f90  -O3 -fomit-frame-pointer -funroll-loops  compilation failed to produce executable
FAIL: gfortran.dg/array_initializer_1.f90  -O3 -fomit-frame-pointer -funroll-all-loops -finline-functions  (test for excess errors)
UNRESOLVED: gfortran.dg/array_initializer_1.f90  -O3 -fomit-frame-pointer -funroll-all-loops -finline-functions  compilation failed to produce executable
FAIL: gfortran.dg/array_initializer_1.f90  -O3 -g  (test for excess errors)
UNRESOLVED: gfortran.dg/array_initializer_1.f90  -O3 -g  compilation failed to produce executable
FAIL: gfortran.dg/array_initializer_1.f90  -Os  (test for excess errors)
UNRESOLVED: gfortran.dg/array_initializer_1.f90  -Os  compilation failed to produce executable
FAIL: gfortran.dg/array_initializer_2.f90  -O0  (test for excess errors)
UNRESOLVED: gfortran.dg/array_initializer_2.f90  -O0  compilation failed to produce executable
FAIL: gfortran.dg/array_initializer_2.f90  -O1  (test for excess errors)
UNRESOLVED: gfortran.dg/array_initializer_2.f90  -O1  compilation failed to produce executable
FAIL: gfortran.dg/array_initializer_2.f90  -O2  (test for excess errors)
UNRESOLVED: gfortran.dg/array_initializer_2.f90  -O2  compilation failed to produce executable
FAIL: gfortran.dg/array_initializer_2.f90  -O3 -fomit-frame-pointer  (test for excess errors)
UNRESOLVED: gfortran.dg/array_initializer_2.f90  -O3 -fomit-frame-pointer  compilation failed to produce executable
FAIL: gfortran.dg/array_initializer_2.f90  -O3 -fomit-frame-pointer -funroll-loops  (test for excess errors)
UNRESOLVED: gfortran.dg/array_initializer_2.f90  -O3 -fomit-frame-pointer -funroll-loops  compilation failed to produce executable
FAIL: gfortran.dg/array_initializer_2.f90  -O3 -fomit-frame-pointer -funroll-all-loops -finline-functions  (test for excess errors)
UNRESOLVED: gfortran.dg/array_initializer_2.f90  -O3 -fomit-frame-pointer -funroll-all-loops -finline-functions  compilation failed to produce executable
FAIL: gfortran.dg/array_initializer_2.f90  -O3 -g  (test for excess errors)
UNRESOLVED: gfortran.dg/array_initializer_2.f90  -O3 -g  compilation failed to produce executable
FAIL: gfortran.dg/array_initializer_2.f90  -Os  (test for excess errors)
UNRESOLVED: gfortran.dg/array_initializer_2.f90  -Os  compilation failed to produce executable
FAIL: gfortran.dg/array_initializer_3.f90  -O   (test for errors, line 9)
FAIL: gfortran.dg/array_initializer_3.f90  -O  (test for excess errors)
FAIL: gfortran.dg/array_memset_2.f90  -O0  (test for excess errors)
UNRESOLVED: gfortran.dg/array_memset_2.f90  -O0  compilation failed to produce executable
FAIL: gfortran.dg/array_memset_2.f90  -O0  scan-tree-dump-times original "memset" 2
FAIL: gfortran.dg/array_memset_2.f90  -O1  (test for excess errors)
UNRESOLVED: gfortran.dg/array_memset_2.f90  -O1  compilation failed to produce executable
FAIL: gfortran.dg/array_memset_2.f90  -O1  scan-tree-dump-times original "memset" 2
FAIL: gfortran.dg/array_memset_2.f90  -O2  (test for excess errors)
UNRESOLVED: gfortran.dg/array_memset_2.f90  -O2  compilation failed to produce executable
FAIL: gfortran.dg/array_memset_2.f90  -O2  scan-tree-dump-times original "memset" 2
FAIL: gfortran.dg/array_memset_2.f90  -O3 -fomit-frame-pointer  (test for excess errors)
UNRESOLVED: gfortran.dg/array_memset_2.f90  -O3 -fomit-frame-pointer  compilation failed to produce executable
FAIL: gfortran.dg/array_memset_2.f90  -O3 -fomit-frame-pointer  scan-tree-dump-times original "memset" 2
FAIL: gfortran.dg/array_memset_2.f90  -O3 -fomit-frame-pointer -funroll-loops  (test for excess errors)
UNRESOLVED: gfortran.dg/array_memset_2.f90  -O3 -fomit-frame-pointer -funroll-loops  compilation failed to produce executable
FAIL: gfortran.dg/array_memset_2.f90  -O3 -fomit-frame-pointer -funroll-loops  scan-tree-dump-times original "memset" 2
FAIL: gfortran.dg/array_memset_2.f90  -O3 -fomit-frame-pointer -funroll-all-loops -finline-functions  (test for excess errors)
UNRESOLVED: gfortran.dg/array_memset_2.f90  -O3 -fomit-frame-pointer -funroll-all-loops -finline-functions  compilation failed to produce executable
FAIL: gfortran.dg/array_memset_2.f90  -O3 -fomit-frame-pointer -funroll-all-loops -finline-functions  scan-tree-dump-times original "memset" 2
FAIL: gfortran.dg/array_memset_2.f90  -O3 -g  (test for excess errors)
UNRESOLVED: gfortran.dg/array_memset_2.f90  -O3 -g  compilation failed to produce executable
FAIL: gfortran.dg/array_memset_2.f90  -O3 -g  scan-tree-dump-times original "memset" 2
FAIL: gfortran.dg/array_memset_2.f90  -Os  (test for excess errors)
UNRESOLVED: gfortran.dg/array_memset_2.f90  -Os  compilation failed to produce executable
FAIL: gfortran.dg/array_memset_2.f90  -Os  scan-tree-dump-times original "memset" 2
FAIL: gfortran.dg/array_reference_1.f90  -O0  (test for excess errors)
UNRESOLVED: gfortran.dg/array_reference_1.f90  -O0  compilation failed to produce executable
FAIL: gfortran.dg/array_reference_1.f90  -O1  (test for excess errors)
UNRESOLVED: gfortran.dg/array_reference_1.f90  -O1  compilation failed to produce executable
FAIL: gfortran.dg/array_reference_1.f90  -O2  (test for excess errors)
UNRESOLVED: gfortran.dg/array_reference_1.f90  -O2  compilation failed to produce executable
FAIL: gfortran.dg/array_reference_1.f90  -O3 -fomit-frame-pointer  (test for excess errors)
UNRESOLVED: gfortran.dg/array_reference_1.f90  -O3 -fomit-frame-pointer  compilation failed to produce executable
FAIL: gfortran.dg/array_reference_1.f90  -O3 -fomit-frame-pointer -funroll-loops  (test for excess errors)
UNRESOLVED: gfortran.dg/array_reference_1.f90  -O3 -fomit-frame-pointer -funroll-loops  compilation failed to produce executable
FAIL: gfortran.dg/array_reference_1.f90  -O3 -fomit-frame-pointer -funroll-all-loops -finline-functions  (test for excess errors)
UNRESOLVED: gfortran.dg/array_reference_1.f90  -O3 -fomit-frame-pointer -funroll-all-loops -finline-functions  compilation failed to produce executable
FAIL: gfortran.dg/array_reference_1.f90  -O3 -g  (test for excess errors)
UNRESOLVED: gfortran.dg/array_reference_1.f90  -O3 -g  compilation failed to produce executable
FAIL: gfortran.dg/array_reference_1.f90  -Os  (test for excess errors)
UNRESOLVED: gfortran.dg/array_reference_1.f90  -Os  compilation failed to produce executable
FAIL: gfortran.dg/array_return_value_1.f90  -O0  (test for excess errors)
UNRESOLVED: gfortran.dg/array_return_value_1.f90  -O0  compilation failed to produce executable
FAIL: gfortran.dg/array_return_value_1.f90  -O1  (test for excess errors)
UNRESOLVED: gfortran.dg/array_return_value_1.f90  -O1  compilation failed to produce executable
FAIL: gfortran.dg/array_return_value_1.f90  -O2  (test for excess errors)
UNRESOLVED: gfortran.dg/array_return_value_1.f90  -O2  compilation failed to produce executable
FAIL: gfortran.dg/array_return_value_1.f90  -O3 -fomit-frame-pointer  (test for excess errors)
UNRESOLVED: gfortran.dg/array_return_value_1.f90  -O3 -fomit-frame-pointer  compilation failed to produce executable
FAIL: gfortran.dg/array_return_value_1.f90  -O3 -fomit-frame-pointer -funroll-loops  (test for excess errors)
UNRESOLVED: gfortran.dg/array_return_value_1.f90  -O3 -fomit-frame-pointer -funroll-loops  compilation failed to produce executable
FAIL: gfortran.dg/array_return_value_1.f90  -O3 -fomit-frame-pointer -funroll-all-loops -finline-functions  (test for excess errors)
UNRESOLVED: gfortran.dg/array_return_value_1.f90  -O3 -fomit-frame-pointer -funroll-all-loops -finline-functions  compilation failed to produce executable
FAIL: gfortran.dg/array_return_value_1.f90  -O3 -g  (test for excess errors)
UNRESOLVED: gfortran.dg/array_return_value_1.f90  -O3 -g  compilation failed to produce executable
FAIL: gfortran.dg/array_return_value_1.f90  -Os  (test for excess errors)
UNRESOLVED: gfortran.dg/array_return_value_1.f90  -Os  compilation failed to produce executable
FAIL: gfortran.dg/associated_target_2.f90  -O0  (test for excess errors)
UNRESOLVED: gfortran.dg/associated_target_2.f90  -O0  compilation failed to produce executable
FAIL: gfortran.dg/associated_target_2.f90  -O1  (test for excess errors)
UNRESOLVED: gfortran.dg/associated_target_2.f90  -O1  compilation failed to produce executable
FAIL: gfortran.dg/associated_target_2.f90  -O2  (test for excess errors)
UNRESOLVED: gfortran.dg/associated_target_2.f90  -O2  compilation failed to produce executable
FAIL: gfortran.dg/associated_target_2.f90  -O3 -fomit-frame-pointer  (test for excess errors)
UNRESOLVED: gfortran.dg/associated_target_2.f90  -O3 -fomit-frame-pointer  compilation failed to produce executable
FAIL: gfortran.dg/associated_target_2.f90  -O3 -fomit-frame-pointer -funroll-loops  (test for excess errors)
UNRESOLVED: gfortran.dg/associated_target_2.f90  -O3 -fomit-frame-pointer -funroll-loops  compilation failed to produce executable
FAIL: gfortran.dg/associated_target_2.f90  -O3 -fomit-frame-pointer -funroll-all-loops -finline-functions  (test for excess errors)
UNRESOLVED: gfortran.dg/associated_target_2.f90  -O3 -fomit-frame-pointer -funroll-all-loops -finline-functions  compilation failed to produce executable
FAIL: gfortran.dg/associated_target_2.f90  -O3 -g  (test for excess errors)
UNRESOLVED: gfortran.dg/associated_target_2.f90  -O3 -g  compilation failed to produce executable
FAIL: gfortran.dg/associated_target_2.f90  -Os  (test for excess errors)
UNRESOLVED: gfortran.dg/associated_target_2.f90  -Os  compilation failed to produce executable
FAIL: gfortran.dg/assumed_shape_ranks_1.f90  -O  (test for excess errors)
FAIL: gfortran.dg/assumed_size_refs_4.f90  -O   (test for errors, line 13)
FAIL: gfortran.dg/assumed_size_refs_4.f90  -O   (test for errors, line 14)
FAIL: gfortran.dg/assumed_size_refs_4.f90  -O  (test for excess errors)
FAIL: gfortran.dg/auto_array_1.f90  -O0  (test for excess errors)
UNRESOLVED: gfortran.dg/auto_array_1.f90  -O0  compilation failed to produce executable
FAIL: gfortran.dg/auto_array_1.f90  -O1  (test for excess errors)
UNRESOLVED: gfortran.dg/auto_array_1.f90  -O1  compilation failed to produce executable
FAIL: gfortran.dg/auto_array_1.f90  -O2  (test for excess errors)
UNRESOLVED: gfortran.dg/auto_array_1.f90  -O2  compilation failed to produce executable
FAIL: gfortran.dg/auto_array_1.f90  -O3 -fomit-frame-pointer  (test for excess errors)
UNRESOLVED: gfortran.dg/auto_array_1.f90  -O3 -fomit-frame-pointer  compilation failed to produce executable
FAIL: gfortran.dg/auto_array_1.f90  -O3 -fomit-frame-pointer -funroll-loops  (test for excess errors)
UNRESOLVED: gfortran.dg/auto_array_1.f90  -O3 -fomit-frame-pointer -funroll-loops  compilation failed to produce executable
FAIL: gfortran.dg/auto_array_1.f90  -O3 -fomit-frame-pointer -funroll-all-loops -finline-functions  (test for excess errors)
UNRESOLVED: gfortran.dg/auto_array_1.f90  -O3 -fomit-frame-pointer -funroll-all-loops -finline-functions  compilation failed to produce executable
FAIL: gfortran.dg/auto_array_1.f90  -O3 -g  (test for excess errors)
UNRESOLVED: gfortran.dg/auto_array_1.f90  -O3 -g  compilation failed to produce executable
FAIL: gfortran.dg/auto_array_1.f90  -Os  (test for excess errors)
UNRESOLVED: gfortran.dg/auto_array_1.f90  -Os  compilation failed to produce executable
FAIL: gfortran.dg/auto_char_dummy_array_1.f90  -O0  (test for excess errors)
UNRESOLVED: gfortran.dg/auto_char_dummy_array_1.f90  -O0  compilation failed to produce executable
FAIL: gfortran.dg/auto_char_dummy_array_1.f90  -O1  (test for excess errors)
UNRESOLVED: gfortran.dg/auto_char_dummy_array_1.f90  -O1  compilation failed to produce executable
FAIL: gfortran.dg/auto_char_dummy_array_1.f90  -O2  (test for excess errors)
UNRESOLVED: gfortran.dg/auto_char_dummy_array_1.f90  -O2  compilation failed to produce executable
FAIL: gfortran.dg/auto_char_dummy_array_1.f90  -O3 -fomit-frame-pointer  (test for excess errors)
UNRESOLVED: gfortran.dg/auto_char_dummy_array_1.f90  -O3 -fomit-frame-pointer  compilation failed to produce executable
FAIL: gfortran.dg/auto_char_dummy_array_1.f90  -O3 -fomit-frame-pointer -funroll-loops  (test for excess errors)
UNRESOLVED: gfortran.dg/auto_char_dummy_array_1.f90  -O3 -fomit-frame-pointer -funroll-loops  compilation failed to produce executable
FAIL: gfortran.dg/auto_char_dummy_array_1.f90  -O3 -fomit-frame-pointer -funroll-all-loops -finline-functions  (test for excess errors)
UNRESOLVED: gfortran.dg/auto_char_dummy_array_1.f90  -O3 -fomit-frame-pointer -funroll-all-loops -finline-functions  compilation failed to produce executable
FAIL: gfortran.dg/auto_char_dummy_array_1.f90  -O3 -g  (test for excess errors)
UNRESOLVED: gfortran.dg/auto_char_dummy_array_1.f90  -O3 -g  compilation failed to produce executable
FAIL: gfortran.dg/auto_char_dummy_array_1.f90  -Os  (test for excess errors)
UNRESOLVED: gfortran.dg/auto_char_dummy_array_1.f90  -Os  compilation failed to produce executable
FAIL: gfortran.dg/auto_char_len_3.f90  -O0  (test for excess errors)
UNRESOLVED: gfortran.dg/auto_char_len_3.f90  -O0  compilation failed to produce executable
FAIL: gfortran.dg/auto_char_len_3.f90  -O1  (test for excess errors)
UNRESOLVED: gfortran.dg/auto_char_len_3.f90  -O1  compilation failed to produce executable
FAIL: gfortran.dg/auto_char_len_3.f90  -O2  (test for excess errors)
UNRESOLVED: gfortran.dg/auto_char_len_3.f90  -O2  compilation failed to produce executable
FAIL: gfortran.dg/auto_char_len_3.f90  -O3 -fomit-frame-pointer  (test for excess errors)
UNRESOLVED: gfortran.dg/auto_char_len_3.f90  -O3 -fomit-frame-pointer  compilation failed to produce executable
FAIL: gfortran.dg/auto_char_len_3.f90  -O3 -fomit-frame-pointer -funroll-loops  (test for excess errors)
UNRESOLVED: gfortran.dg/auto_char_len_3.f90  -O3 -fomit-frame-pointer -funroll-loops  compilation failed to produce executable
FAIL: gfortran.dg/auto_char_len_3.f90  -O3 -fomit-frame-pointer -funroll-all-loops -finline-functions  (test for excess errors)
UNRESOLVED: gfortran.dg/auto_char_len_3.f90  -O3 -fomit-frame-pointer -funroll-all-loops -finline-functions  compilation failed to produce executable
FAIL: gfortran.dg/auto_char_len_3.f90  -O3 -g  (test for excess errors)
UNRESOLVED: gfortran.dg/auto_char_len_3.f90  -O3 -g  compilation failed to produce executable
FAIL: gfortran.dg/auto_char_len_3.f90  -Os  (test for excess errors)
UNRESOLVED: gfortran.dg/auto_char_len_3.f90  -Os  compilation failed to produce executable
FAIL: gfortran.dg/auto_char_pointer_array_result_1.f90  -O0  (test for excess errors)
UNRESOLVED: gfortran.dg/auto_char_pointer_array_result_1.f90  -O0  compilation failed to produce executable
FAIL: gfortran.dg/auto_char_pointer_array_result_1.f90  -O1  (test for excess errors)
UNRESOLVED: gfortran.dg/auto_char_pointer_array_result_1.f90  -O1  compilation failed to produce executable
FAIL: gfortran.dg/auto_char_pointer_array_result_1.f90  -O2  (test for excess errors)
UNRESOLVED: gfortran.dg/auto_char_pointer_array_result_1.f90  -O2  compilation failed to produce executable
FAIL: gfortran.dg/auto_char_pointer_array_result_1.f90  -O3 -fomit-frame-pointer  (test for excess errors)
UNRESOLVED: gfortran.dg/auto_char_pointer_array_result_1.f90  -O3 -fomit-frame-pointer  compilation failed to produce executable
FAIL: gfortran.dg/auto_char_pointer_array_result_1.f90  -O3 -fomit-frame-pointer -funroll-loops  (test for excess errors)
UNRESOLVED: gfortran.dg/auto_char_pointer_array_result_1.f90  -O3 -fomit-frame-pointer -funroll-loops  compilation failed to produce executable
FAIL: gfortran.dg/auto_char_pointer_array_result_1.f90  -O3 -fomit-frame-pointer -funroll-all-loops -finline-functions  (test for excess errors)
UNRESOLVED: gfortran.dg/auto_char_pointer_array_result_1.f90  -O3 -fomit-frame-pointer -funroll-all-loops -finline-functions  compilation failed to produce executable
FAIL: gfortran.dg/auto_char_pointer_array_result_1.f90  -O3 -g  (test for excess errors)
UNRESOLVED: gfortran.dg/auto_char_pointer_array_result_1.f90  -O3 -g  compilation failed to produce executable
FAIL: gfortran.dg/auto_char_pointer_array_result_1.f90  -Os  (test for excess errors)
UNRESOLVED: gfortran.dg/auto_char_pointer_array_result_1.f90  -Os  compilation failed to produce executable
FAIL: gfortran.dg/auto_pointer_array_result_1.f90  -O0  (test for excess errors)
UNRESOLVED: gfortran.dg/auto_pointer_array_result_1.f90  -O0  compilation failed to produce executable
FAIL: gfortran.dg/auto_pointer_array_result_1.f90  -O1  (test for excess errors)
UNRESOLVED: gfortran.dg/auto_pointer_array_result_1.f90  -O1  compilation failed to produce executable
FAIL: gfortran.dg/auto_pointer_array_result_1.f90  -O2  (test for excess errors)
UNRESOLVED: gfortran.dg/auto_pointer_array_result_1.f90  -O2  compilation failed to produce executable
FAIL: gfortran.dg/auto_pointer_array_result_1.f90  -O3 -fomit-frame-pointer  (test for excess errors)
UNRESOLVED: gfortran.dg/auto_pointer_array_result_1.f90  -O3 -fomit-frame-pointer  compilation failed to produce executable
FAIL: gfortran.dg/auto_pointer_array_result_1.f90  -O3 -fomit-frame-pointer -funroll-loops  (test for excess errors)
UNRESOLVED: gfortran.dg/auto_pointer_array_result_1.f90  -O3 -fomit-frame-pointer -funroll-loops  compilation failed to produce executable
FAIL: gfortran.dg/auto_pointer_array_result_1.f90  -O3 -fomit-frame-pointer -funroll-all-loops -finline-functions  (test for excess errors)
UNRESOLVED: gfortran.dg/auto_pointer_array_result_1.f90  -O3 -fomit-frame-pointer -funroll-all-loops -finline-functions  compilation failed to produce executable
FAIL: gfortran.dg/auto_pointer_array_result_1.f90  -O3 -g  (test for excess errors)
UNRESOLVED: gfortran.dg/auto_pointer_array_result_1.f90  -O3 -g  compilation failed to produce executable
FAIL: gfortran.dg/auto_pointer_array_result_1.f90  -Os  (test for excess errors)
UNRESOLVED: gfortran.dg/auto_pointer_array_result_1.f90  -Os  compilation failed to produce executable
FAIL: gfortran.dg/backslash_3.f  -O0  execution test
FAIL: gfortran.dg/backslash_3.f  -O1  execution test
FAIL: gfortran.dg/backslash_3.f  -O2  execution test
FAIL: gfortran.dg/backslash_3.f  -O3 -fomit-frame-pointer  execution test
FAIL: gfortran.dg/backslash_3.f  -O3 -fomit-frame-pointer -funroll-loops  execution test
FAIL: gfortran.dg/backslash_3.f  -O3 -fomit-frame-pointer -funroll-all-loops -finline-functions  execution test
FAIL: gfortran.dg/backslash_3.f  -O3 -g  execution test
FAIL: gfortran.dg/backslash_3.f  -Os  execution test
FAIL: gfortran.dg/binding_c_table_15_1.f03  -O0  execution test
FAIL: gfortran.dg/binding_c_table_15_1.f03  -O1  execution test
FAIL: gfortran.dg/binding_c_table_15_1.f03  -O2  execution test
FAIL: gfortran.dg/binding_c_table_15_1.f03  -O3 -fomit-frame-pointer  execution test
FAIL: gfortran.dg/binding_c_table_15_1.f03  -O3 -fomit-frame-pointer -funroll-loops  execution test
FAIL: gfortran.dg/binding_c_table_15_1.f03  -O3 -fomit-frame-pointer -funroll-all-loops -finline-functions  execution test
FAIL: gfortran.dg/binding_c_table_15_1.f03  -O3 -g  execution test
FAIL: gfortran.dg/binding_c_table_15_1.f03  -Os  execution test
FAIL: gfortran.dg/bound_2.f90  -O0  (internal compiler error)
FAIL: gfortran.dg/bound_2.f90  -O0  (test for excess errors)
UNRESOLVED: gfortran.dg/bound_2.f90  -O0  compilation failed to produce executable
FAIL: gfortran.dg/bound_2.f90  -O1  (internal compiler error)
FAIL: gfortran.dg/bound_2.f90  -O1  (test for excess errors)
UNRESOLVED: gfortran.dg/bound_2.f90  -O1  compilation failed to produce executable
FAIL: gfortran.dg/bound_2.f90  -O2  (internal compiler error)
FAIL: gfortran.dg/bound_2.f90  -O2  (test for excess errors)
UNRESOLVED: gfortran.dg/bound_2.f90  -O2  compilation failed to produce executable
FAIL: gfortran.dg/bound_2.f90  -O3 -fomit-frame-pointer  (internal compiler error)
FAIL: gfortran.dg/bound_2.f90  -O3 -fomit-frame-pointer  (test for excess errors)
UNRESOLVED: gfortran.dg/bound_2.f90  -O3 -fomit-frame-pointer  compilation failed to produce executable
FAIL: gfortran.dg/bound_2.f90  -O3 -fomit-frame-pointer -funroll-loops  (internal compiler error)
FAIL: gfortran.dg/bound_2.f90  -O3 -fomit-frame-pointer -funroll-loops  (test for excess errors)
UNRESOLVED: gfortran.dg/bound_2.f90  -O3 -fomit-frame-pointer -funroll-loops  compilation failed to produce executable
FAIL: gfortran.dg/bound_2.f90  -O3 -fomit-frame-pointer -funroll-all-loops -finline-functions  (internal compiler error)
FAIL: gfortran.dg/bound_2.f90  -O3 -fomit-frame-pointer -funroll-all-loops -finline-functions  (test for excess errors)
UNRESOLVED: gfortran.dg/bound_2.f90  -O3 -fomit-frame-pointer -funroll-all-loops -finline-functions  compilation failed to produce executable
FAIL: gfortran.dg/bound_2.f90  -O3 -g  (internal compiler error)
FAIL: gfortran.dg/bound_2.f90  -O3 -g  (test for excess errors)
UNRESOLVED: gfortran.dg/bound_2.f90  -O3 -g  compilation failed to produce executable
FAIL: gfortran.dg/bound_2.f90  -Os  (internal compiler error)
FAIL: gfortran.dg/bound_2.f90  -Os  (test for excess errors)
UNRESOLVED: gfortran.dg/bound_2.f90  -Os  compilation failed to produce executable
FAIL: gfortran.dg/bound_4.f90  -O0  (test for excess errors)
UNRESOLVED: gfortran.dg/bound_4.f90  -O0  compilation failed to produce executable
FAIL: gfortran.dg/bound_4.f90  -O1  (test for excess errors)
UNRESOLVED: gfortran.dg/bound_4.f90  -O1  compilation failed to produce executable
FAIL: gfortran.dg/bound_4.f90  -O2  (test for excess errors)
UNRESOLVED: gfortran.dg/bound_4.f90  -O2  compilation failed to produce executable
FAIL: gfortran.dg/bound_4.f90  -O3 -fomit-frame-pointer  (test for excess errors)
UNRESOLVED: gfortran.dg/bound_4.f90  -O3 -fomit-frame-pointer  compilation failed to produce executable
FAIL: gfortran.dg/bound_4.f90  -O3 -fomit-frame-pointer -funroll-loops  (test for excess errors)
UNRESOLVED: gfortran.dg/bound_4.f90  -O3 -fomit-frame-pointer -funroll-loops  compilation failed to produce executable
FAIL: gfortran.dg/bound_4.f90  -O3 -fomit-frame-pointer -funroll-all-loops -finline-functions  (test for excess errors)
UNRESOLVED: gfortran.dg/bound_4.f90  -O3 -fomit-frame-pointer -funroll-all-loops -finline-functions  compilation failed to produce executable
FAIL: gfortran.dg/bound_4.f90  -O3 -g  (test for excess errors)
UNRESOLVED: gfortran.dg/bound_4.f90  -O3 -g  compilation failed to produce executable
FAIL: gfortran.dg/bound_4.f90  -Os  (test for excess errors)
UNRESOLVED: gfortran.dg/bound_4.f90  -Os  compilation failed to produce executable
FAIL: gfortran.dg/bounds_check_14.f90  -O0  (test for excess errors)
UNRESOLVED: gfortran.dg/bounds_check_14.f90  -O0  compilation failed to produce executable
FAIL: gfortran.dg/bounds_check_14.f90  -O1  (test for excess errors)
UNRESOLVED: gfortran.dg/bounds_check_14.f90  -O1  compilation failed to produce executable
FAIL: gfortran.dg/bounds_check_14.f90  -O2  (test for excess errors)
UNRESOLVED: gfortran.dg/bounds_check_14.f90  -O2  compilation failed to produce executable
FAIL: gfortran.dg/bounds_check_14.f90  -O3 -fomit-frame-pointer  (test for excess errors)
UNRESOLVED: gfortran.dg/bounds_check_14.f90  -O3 -fomit-frame-pointer  compilation failed to produce executable
FAIL: gfortran.dg/bounds_check_14.f90  -O3 -fomit-frame-pointer -funroll-loops  (test for excess errors)
UNRESOLVED: gfortran.dg/bounds_check_14.f90  -O3 -fomit-frame-pointer -funroll-loops  compilation failed to produce executable
FAIL: gfortran.dg/bounds_check_14.f90  -O3 -fomit-frame-pointer -funroll-all-loops -finline-functions  (test for excess errors)
UNRESOLVED: gfortran.dg/bounds_check_14.f90  -O3 -fomit-frame-pointer -funroll-all-loops -finline-functions  compilation failed to produce executable
FAIL: gfortran.dg/bounds_check_14.f90  -O3 -g  (test for excess errors)
UNRESOLVED: gfortran.dg/bounds_check_14.f90  -O3 -g  compilation failed to produce executable
FAIL: gfortran.dg/bounds_check_14.f90  -Os  (test for excess errors)
UNRESOLVED: gfortran.dg/bounds_check_14.f90  -Os  compilation failed to produce executable
FAIL: gfortran.dg/change_symbol_attributes_1.f90  -O  (test for excess errors)
FAIL: gfortran.dg/char_comparison_1.f  -O0  execution test
FAIL: gfortran.dg/char_comparison_1.f  -O1  execution test
FAIL: gfortran.dg/char_comparison_1.f  -O2  execution test
FAIL: gfortran.dg/char_comparison_1.f  -O3 -fomit-frame-pointer  execution test
FAIL: gfortran.dg/char_comparison_1.f  -O3 -fomit-frame-pointer -funroll-loops  execution test
FAIL: gfortran.dg/char_comparison_1.f  -O3 -fomit-frame-pointer -funroll-all-loops -finline-functions  execution test
FAIL: gfortran.dg/char_comparison_1.f  -O3 -g  execution test
FAIL: gfortran.dg/char_comparison_1.f  -Os  execution test
FAIL: gfortran.dg/char_length_12.f90  -O0  (internal compiler error)
FAIL: gfortran.dg/char_length_12.f90  -O0  (test for excess errors)
UNRESOLVED: gfortran.dg/char_length_12.f90  -O0  compilation failed to produce executable
FAIL: gfortran.dg/char_length_12.f90  -O1  (internal compiler error)
FAIL: gfortran.dg/char_length_12.f90  -O1  (test for excess errors)
UNRESOLVED: gfortran.dg/char_length_12.f90  -O1  compilation failed to produce executable
FAIL: gfortran.dg/char_length_12.f90  -O2  (internal compiler error)
FAIL: gfortran.dg/char_length_12.f90  -O2  (test for excess errors)
UNRESOLVED: gfortran.dg/char_length_12.f90  -O2  compilation failed to produce executable
FAIL: gfortran.dg/char_length_12.f90  -O3 -fomit-frame-pointer  (internal compiler error)
FAIL: gfortran.dg/char_length_12.f90  -O3 -fomit-frame-pointer  (test for excess errors)
UNRESOLVED: gfortran.dg/char_length_12.f90  -O3 -fomit-frame-pointer  compilation failed to produce executable
FAIL: gfortran.dg/char_length_12.f90  -O3 -fomit-frame-pointer -funroll-loops  (internal compiler error)
FAIL: gfortran.dg/char_length_12.f90  -O3 -fomit-frame-pointer -funroll-loops  (test for excess errors)
UNRESOLVED: gfortran.dg/char_length_12.f90  -O3 -fomit-frame-pointer -funroll-loops  compilation failed to produce executable
FAIL: gfortran.dg/char_length_12.f90  -O3 -fomit-frame-pointer -funroll-all-loops -finline-functions  (internal compiler error)
FAIL: gfortran.dg/char_length_12.f90  -O3 -fomit-frame-pointer -funroll-all-loops -finline-functions  (test for excess errors)
UNRESOLVED: gfortran.dg/char_length_12.f90  -O3 -fomit-frame-pointer -funroll-all-loops -finline-functions  compilation failed to produce executable
FAIL: gfortran.dg/char_length_12.f90  -O3 -g  (internal compiler error)
FAIL: gfortran.dg/char_length_12.f90  -O3 -g  (test for excess errors)
UNRESOLVED: gfortran.dg/char_length_12.f90  -O3 -g  compilation failed to produce executable
FAIL: gfortran.dg/char_length_12.f90  -Os  (internal compiler error)
FAIL: gfortran.dg/char_length_12.f90  -Os  (test for excess errors)
UNRESOLVED: gfortran.dg/char_length_12.f90  -Os  compilation failed to produce executable
FAIL: gfortran.dg/char_length_3.f90  -O   (test for warnings, line 17)
FAIL: gfortran.dg/char_length_3.f90  -O   (test for warnings, line 18)
FAIL: gfortran.dg/char_length_3.f90  -O   (test for warnings, line 22)
FAIL: gfortran.dg/char_length_8.f90  -O0  (internal compiler error)
FAIL: gfortran.dg/char_length_8.f90  -O0  (test for excess errors)
UNRESOLVED: gfortran.dg/char_length_8.f90  -O0  compilation failed to produce executable
FAIL: gfortran.dg/char_length_8.f90  -O1  (internal compiler error)
FAIL: gfortran.dg/char_length_8.f90  -O1  (test for excess errors)
UNRESOLVED: gfortran.dg/char_length_8.f90  -O1  compilation failed to produce executable
FAIL: gfortran.dg/char_length_8.f90  -O2  (internal compiler error)
FAIL: gfortran.dg/char_length_8.f90  -O2  (test for excess errors)
UNRESOLVED: gfortran.dg/char_length_8.f90  -O2  compilation failed to produce executable
FAIL: gfortran.dg/char_length_8.f90  -O3 -fomit-frame-pointer  (internal compiler error)
FAIL: gfortran.dg/char_length_8.f90  -O3 -fomit-frame-pointer  (test for excess errors)
UNRESOLVED: gfortran.dg/char_length_8.f90  -O3 -fomit-frame-pointer  compilation failed to produce executable
FAIL: gfortran.dg/char_length_8.f90  -O3 -fomit-frame-pointer -funroll-loops  (internal compiler error)
FAIL: gfortran.dg/char_length_8.f90  -O3 -fomit-frame-pointer -funroll-loops  (test for excess errors)
UNRESOLVED: gfortran.dg/char_length_8.f90  -O3 -fomit-frame-pointer -funroll-loops  compilation failed to produce executable
FAIL: gfortran.dg/char_length_8.f90  -O3 -fomit-frame-pointer -funroll-all-loops -finline-functions  (internal compiler error)
FAIL: gfortran.dg/char_length_8.f90  -O3 -fomit-frame-pointer -funroll-all-loops -finline-functions  (test for excess errors)
UNRESOLVED: gfortran.dg/char_length_8.f90  -O3 -fomit-frame-pointer -funroll-all-loops -finline-functions  compilation failed to produce executable
FAIL: gfortran.dg/char_length_8.f90  -O3 -g  (internal compiler error)
FAIL: gfortran.dg/char_length_8.f90  -O3 -g  (test for excess errors)
UNRESOLVED: gfortran.dg/char_length_8.f90  -O3 -g  compilation failed to produce executable
FAIL: gfortran.dg/char_length_8.f90  -Os  (internal compiler error)
FAIL: gfortran.dg/char_length_8.f90  -Os  (test for excess errors)
UNRESOLVED: gfortran.dg/char_length_8.f90  -Os  compilation failed to produce executable
FAIL: gfortran.dg/char_pack_1.f90  -O0  (test for excess errors)
UNRESOLVED: gfortran.dg/char_pack_1.f90  -O0  compilation failed to produce executable
FAIL: gfortran.dg/char_pack_1.f90  -O1  (test for excess errors)
UNRESOLVED: gfortran.dg/char_pack_1.f90  -O1  compilation failed to produce executable
FAIL: gfortran.dg/char_pack_1.f90  -O2  (test for excess errors)
UNRESOLVED: gfortran.dg/char_pack_1.f90  -O2  compilation failed to produce executable
FAIL: gfortran.dg/char_pack_1.f90  -O3 -fomit-frame-pointer  (test for excess errors)
UNRESOLVED: gfortran.dg/char_pack_1.f90  -O3 -fomit-frame-pointer  compilation failed to produce executable
FAIL: gfortran.dg/char_pack_1.f90  -O3 -fomit-frame-pointer -funroll-loops  (test for excess errors)
UNRESOLVED: gfortran.dg/char_pack_1.f90  -O3 -fomit-frame-pointer -funroll-loops  compilation failed to produce executable
FAIL: gfortran.dg/char_pack_1.f90  -O3 -fomit-frame-pointer -funroll-all-loops -finline-functions  (test for excess errors)
UNRESOLVED: gfortran.dg/char_pack_1.f90  -O3 -fomit-frame-pointer -funroll-all-loops -finline-functions  compilation failed to produce executable
FAIL: gfortran.dg/char_pack_1.f90  -O3 -g  (test for excess errors)
UNRESOLVED: gfortran.dg/char_pack_1.f90  -O3 -g  compilation failed to produce executable
FAIL: gfortran.dg/char_pack_1.f90  -Os  (test for excess errors)
UNRESOLVED: gfortran.dg/char_pack_1.f90  -Os  compilation failed to produce executable
FAIL: gfortran.dg/char_pack_2.f90  -O0  (test for excess errors)
UNRESOLVED: gfortran.dg/char_pack_2.f90  -O0  compilation failed to produce executable
FAIL: gfortran.dg/char_pack_2.f90  -O1  (test for excess errors)
UNRESOLVED: gfortran.dg/char_pack_2.f90  -O1  compilation failed to produce executable
FAIL: gfortran.dg/char_pack_2.f90  -O2  (test for excess errors)
UNRESOLVED: gfortran.dg/char_pack_2.f90  -O2  compilation failed to produce executable
FAIL: gfortran.dg/char_pack_2.f90  -O3 -fomit-frame-pointer  (test for excess errors)
UNRESOLVED: gfortran.dg/char_pack_2.f90  -O3 -fomit-frame-pointer  compilation failed to produce executable
FAIL: gfortran.dg/char_pack_2.f90  -O3 -fomit-frame-pointer -funroll-loops  (test for excess errors)
UNRESOLVED: gfortran.dg/char_pack_2.f90  -O3 -fomit-frame-pointer -funroll-loops  compilation failed to produce executable
FAIL: gfortran.dg/char_pack_2.f90  -O3 -fomit-frame-pointer -funroll-all-loops -finline-functions  (test for excess errors)
UNRESOLVED: gfortran.dg/char_pack_2.f90  -O3 -fomit-frame-pointer -funroll-all-loops -finline-functions  compilation failed to produce executable
FAIL: gfortran.dg/char_pack_2.f90  -O3 -g  (test for excess errors)
UNRESOLVED: gfortran.dg/char_pack_2.f90  -O3 -g  compilation failed to produce executable
FAIL: gfortran.dg/char_pack_2.f90  -Os  (test for excess errors)
UNRESOLVED: gfortran.dg/char_pack_2.f90  -Os  compilation failed to produce executable
FAIL: gfortran.dg/char_spread_1.f90  -O0  (test for excess errors)
UNRESOLVED: gfortran.dg/char_spread_1.f90  -O0  compilation failed to produce executable
FAIL: gfortran.dg/char_spread_1.f90  -O1  (test for excess errors)
UNRESOLVED: gfortran.dg/char_spread_1.f90  -O1  compilation failed to produce executable
FAIL: gfortran.dg/char_spread_1.f90  -O2  (test for excess errors)
UNRESOLVED: gfortran.dg/char_spread_1.f90  -O2  compilation failed to produce executable
FAIL: gfortran.dg/char_spread_1.f90  -O3 -fomit-frame-pointer  (test for excess errors)
UNRESOLVED: gfortran.dg/char_spread_1.f90  -O3 -fomit-frame-pointer  compilation failed to produce executable
FAIL: gfortran.dg/char_spread_1.f90  -O3 -fomit-frame-pointer -funroll-loops  (test for excess errors)
UNRESOLVED: gfortran.dg/char_spread_1.f90  -O3 -fomit-frame-pointer -funroll-loops  compilation failed to produce executable
FAIL: gfortran.dg/char_spread_1.f90  -O3 -fomit-frame-pointer -funroll-all-loops -finline-functions  (test for excess errors)
UNRESOLVED: gfortran.dg/char_spread_1.f90  -O3 -fomit-frame-pointer -funroll-all-loops -finline-functions  compilation failed to produce executable
FAIL: gfortran.dg/char_spread_1.f90  -O3 -g  (test for excess errors)
UNRESOLVED: gfortran.dg/char_spread_1.f90  -O3 -g  compilation failed to produce executable
FAIL: gfortran.dg/char_spread_1.f90  -Os  (test for excess errors)
UNRESOLVED: gfortran.dg/char_spread_1.f90  -Os  compilation failed to produce executable
FAIL: gfortran.dg/char_transpose_1.f90  -O0  (test for excess errors)
UNRESOLVED: gfortran.dg/char_transpose_1.f90  -O0  compilation failed to produce executable
FAIL: gfortran.dg/char_transpose_1.f90  -O1  (test for excess errors)
UNRESOLVED: gfortran.dg/char_transpose_1.f90  -O1  compilation failed to produce executable
FAIL: gfortran.dg/char_transpose_1.f90  -O2  (test for excess errors)
UNRESOLVED: gfortran.dg/char_transpose_1.f90  -O2  compilation failed to produce executable
FAIL: gfortran.dg/char_transpose_1.f90  -O3 -fomit-frame-pointer  (test for excess errors)
UNRESOLVED: gfortran.dg/char_transpose_1.f90  -O3 -fomit-frame-pointer  compilation failed to produce executable
FAIL: gfortran.dg/char_transpose_1.f90  -O3 -fomit-frame-pointer -funroll-loops  (test for excess errors)
UNRESOLVED: gfortran.dg/char_transpose_1.f90  -O3 -fomit-frame-pointer -funroll-loops  compilation failed to produce executable
FAIL: gfortran.dg/char_transpose_1.f90  -O3 -fomit-frame-pointer -funroll-all-loops -finline-functions  (test for excess errors)
UNRESOLVED: gfortran.dg/char_transpose_1.f90  -O3 -fomit-frame-pointer -funroll-all-loops -finline-functions  compilation failed to produce executable
FAIL: gfortran.dg/char_transpose_1.f90  -O3 -g  (test for excess errors)
UNRESOLVED: gfortran.dg/char_transpose_1.f90  -O3 -g  compilation failed to produce executable
FAIL: gfortran.dg/char_transpose_1.f90  -Os  (test for excess errors)
UNRESOLVED: gfortran.dg/char_transpose_1.f90  -Os  compilation failed to produce executable
FAIL: gfortran.dg/char_unpack_1.f90  -O0  (test for excess errors)
UNRESOLVED: gfortran.dg/char_unpack_1.f90  -O0  compilation failed to produce executable
FAIL: gfortran.dg/char_unpack_1.f90  -O1  (test for excess errors)
UNRESOLVED: gfortran.dg/char_unpack_1.f90  -O1  compilation failed to produce executable
FAIL: gfortran.dg/char_unpack_1.f90  -O2  (test for excess errors)
UNRESOLVED: gfortran.dg/char_unpack_1.f90  -O2  compilation failed to produce executable
FAIL: gfortran.dg/char_unpack_1.f90  -O3 -fomit-frame-pointer  (test for excess errors)
UNRESOLVED: gfortran.dg/char_unpack_1.f90  -O3 -fomit-frame-pointer  compilation failed to produce executable
FAIL: gfortran.dg/char_unpack_1.f90  -O3 -fomit-frame-pointer -funroll-loops  (test for excess errors)
UNRESOLVED: gfortran.dg/char_unpack_1.f90  -O3 -fomit-frame-pointer -funroll-loops  compilation failed to produce executable
FAIL: gfortran.dg/char_unpack_1.f90  -O3 -fomit-frame-pointer -funroll-all-loops -finline-functions  (test for excess errors)
UNRESOLVED: gfortran.dg/char_unpack_1.f90  -O3 -fomit-frame-pointer -funroll-all-loops -finline-functions  compilation failed to produce executable
FAIL: gfortran.dg/char_unpack_1.f90  -O3 -g  (test for excess errors)
UNRESOLVED: gfortran.dg/char_unpack_1.f90  -O3 -g  compilation failed to produce executable
FAIL: gfortran.dg/char_unpack_1.f90  -Os  (test for excess errors)
UNRESOLVED: gfortran.dg/char_unpack_1.f90  -Os  compilation failed to produce executable
FAIL: gfortran.dg/char_unpack_2.f90  -O0  (test for excess errors)
UNRESOLVED: gfortran.dg/char_unpack_2.f90  -O0  compilation failed to produce executable
FAIL: gfortran.dg/char_unpack_2.f90  -O1  (test for excess errors)
UNRESOLVED: gfortran.dg/char_unpack_2.f90  -O1  compilation failed to produce executable
FAIL: gfortran.dg/char_unpack_2.f90  -O2  (test for excess errors)
UNRESOLVED: gfortran.dg/char_unpack_2.f90  -O2  compilation failed to produce executable
FAIL: gfortran.dg/char_unpack_2.f90  -O3 -fomit-frame-pointer  (test for excess errors)
UNRESOLVED: gfortran.dg/char_unpack_2.f90  -O3 -fomit-frame-pointer  compilation failed to produce executable
FAIL: gfortran.dg/char_unpack_2.f90  -O3 -fomit-frame-pointer -funroll-loops  (test for excess errors)
UNRESOLVED: gfortran.dg/char_unpack_2.f90  -O3 -fomit-frame-pointer -funroll-loops  compilation failed to produce executable
FAIL: gfortran.dg/char_unpack_2.f90  -O3 -fomit-frame-pointer -funroll-all-loops -finline-functions  (test for excess errors)
UNRESOLVED: gfortran.dg/char_unpack_2.f90  -O3 -fomit-frame-pointer -funroll-all-loops -finline-functions  compilation failed to produce executable
FAIL: gfortran.dg/char_unpack_2.f90  -O3 -g  (test for excess errors)
UNRESOLVED: gfortran.dg/char_unpack_2.f90  -O3 -g  compilation failed to produce executable
FAIL: gfortran.dg/char_unpack_2.f90  -Os  (test for excess errors)
UNRESOLVED: gfortran.dg/char_unpack_2.f90  -Os  compilation failed to produce executable
FAIL: gfortran.dg/character_array_constructor_1.f90  -O0  (test for excess errors)
UNRESOLVED: gfortran.dg/character_array_constructor_1.f90  -O0  compilation failed to produce executable
FAIL: gfortran.dg/character_array_constructor_1.f90  -O1  (test for excess errors)
UNRESOLVED: gfortran.dg/character_array_constructor_1.f90  -O1  compilation failed to produce executable
FAIL: gfortran.dg/character_array_constructor_1.f90  -O2  (test for excess errors)
UNRESOLVED: gfortran.dg/character_array_constructor_1.f90  -O2  compilation failed to produce executable
FAIL: gfortran.dg/character_array_constructor_1.f90  -O3 -fomit-frame-pointer  (test for excess errors)
UNRESOLVED: gfortran.dg/character_array_constructor_1.f90  -O3 -fomit-frame-pointer  compilation failed to produce executable
FAIL: gfortran.dg/character_array_constructor_1.f90  -O3 -fomit-frame-pointer -funroll-loops  (test for excess errors)
UNRESOLVED: gfortran.dg/character_array_constructor_1.f90  -O3 -fomit-frame-pointer -funroll-loops  compilation failed to produce executable
FAIL: gfortran.dg/character_array_constructor_1.f90  -O3 -fomit-frame-pointer -funroll-all-loops -finline-functions  (test for excess errors)
UNRESOLVED: gfortran.dg/character_array_constructor_1.f90  -O3 -fomit-frame-pointer -funroll-all-loops -finline-functions  compilation failed to produce executable
FAIL: gfortran.dg/character_array_constructor_1.f90  -O3 -g  (test for excess errors)
UNRESOLVED: gfortran.dg/character_array_constructor_1.f90  -O3 -g  compilation failed to produce executable
FAIL: gfortran.dg/character_array_constructor_1.f90  -Os  (test for excess errors)
UNRESOLVED: gfortran.dg/character_array_constructor_1.f90  -Os  compilation failed to produce executable
FAIL: gfortran.dg/common_2.f90  -O0  (test for excess errors)
UNRESOLVED: gfortran.dg/common_2.f90  -O0  compilation failed to produce executable
FAIL: gfortran.dg/common_2.f90  -O1  (test for excess errors)
UNRESOLVED: gfortran.dg/common_2.f90  -O1  compilation failed to produce executable
FAIL: gfortran.dg/common_2.f90  -O2  (test for excess errors)
UNRESOLVED: gfortran.dg/common_2.f90  -O2  compilation failed to produce executable
FAIL: gfortran.dg/common_2.f90  -O3 -fomit-frame-pointer  (test for excess errors)
UNRESOLVED: gfortran.dg/common_2.f90  -O3 -fomit-frame-pointer  compilation failed to produce executable
FAIL: gfortran.dg/common_2.f90  -O3 -fomit-frame-pointer -funroll-loops  (test for excess errors)
UNRESOLVED: gfortran.dg/common_2.f90  -O3 -fomit-frame-pointer -funroll-loops  compilation failed to produce executable
FAIL: gfortran.dg/common_2.f90  -O3 -fomit-frame-pointer -funroll-all-loops -finline-functions  (test for excess errors)
UNRESOLVED: gfortran.dg/common_2.f90  -O3 -fomit-frame-pointer -funroll-all-loops -finline-functions  compilation failed to produce executable
FAIL: gfortran.dg/common_2.f90  -O3 -g  (test for excess errors)
UNRESOLVED: gfortran.dg/common_2.f90  -O3 -g  compilation failed to produce executable
FAIL: gfortran.dg/common_2.f90  -Os  (test for excess errors)
UNRESOLVED: gfortran.dg/common_2.f90  -Os  compilation failed to produce executable
FAIL: gfortran.dg/common_equivalence_1.f  -O0  execution test
FAIL: gfortran.dg/common_equivalence_1.f  -O1  execution test
FAIL: gfortran.dg/common_equivalence_1.f  -O2  execution test
FAIL: gfortran.dg/common_equivalence_1.f  -O3 -fomit-frame-pointer  execution test
FAIL: gfortran.dg/common_equivalence_1.f  -O3 -fomit-frame-pointer -funroll-loops  execution test
FAIL: gfortran.dg/common_equivalence_1.f  -O3 -fomit-frame-pointer -funroll-all-loops -finline-functions  execution test
FAIL: gfortran.dg/common_equivalence_1.f  -O3 -g  execution test
FAIL: gfortran.dg/common_equivalence_1.f  -Os  execution test
FAIL: gfortran.dg/compliant_elemental_intrinsics_1.f90  -O   (test for errors, line 24)
FAIL: gfortran.dg/compliant_elemental_intrinsics_1.f90  -O  (test for excess errors)
FAIL: gfortran.dg/cshift_large_1.f90  -O0  (test for excess errors)
UNRESOLVED: gfortran.dg/cshift_large_1.f90  -O0  compilation failed to produce executable
FAIL: gfortran.dg/cshift_large_1.f90  -O1  (test for excess errors)
UNRESOLVED: gfortran.dg/cshift_large_1.f90  -O1  compilation failed to produce executable
FAIL: gfortran.dg/cshift_large_1.f90  -O2  (test for excess errors)
UNRESOLVED: gfortran.dg/cshift_large_1.f90  -O2  compilation failed to produce executable
FAIL: gfortran.dg/cshift_large_1.f90  -O3 -fomit-frame-pointer  (test for excess errors)
UNRESOLVED: gfortran.dg/cshift_large_1.f90  -O3 -fomit-frame-pointer  compilation failed to produce executable
FAIL: gfortran.dg/cshift_large_1.f90  -O3 -fomit-frame-pointer -funroll-loops  (test for excess errors)
UNRESOLVED: gfortran.dg/cshift_large_1.f90  -O3 -fomit-frame-pointer -funroll-loops  compilation failed to produce executable
FAIL: gfortran.dg/cshift_large_1.f90  -O3 -fomit-frame-pointer -funroll-all-loops -finline-functions  (test for excess errors)
UNRESOLVED: gfortran.dg/cshift_large_1.f90  -O3 -fomit-frame-pointer -funroll-all-loops -finline-functions  compilation failed to produce executable
FAIL: gfortran.dg/cshift_large_1.f90  -O3 -g  (test for excess errors)
UNRESOLVED: gfortran.dg/cshift_large_1.f90  -O3 -g  compilation failed to produce executable
FAIL: gfortran.dg/cshift_large_1.f90  -Os  (test for excess errors)
UNRESOLVED: gfortran.dg/cshift_large_1.f90  -Os  compilation failed to produce executable
FAIL: gfortran.dg/data_array_1.f90  -O0  execution test
FAIL: gfortran.dg/data_array_1.f90  -O1  execution test
FAIL: gfortran.dg/data_array_1.f90  -O2  execution test
FAIL: gfortran.dg/data_array_1.f90  -O3 -fomit-frame-pointer  execution test
FAIL: gfortran.dg/data_array_1.f90  -O3 -fomit-frame-pointer -funroll-loops  execution test
FAIL: gfortran.dg/data_array_1.f90  -O3 -fomit-frame-pointer -funroll-all-loops -finline-functions  execution test
FAIL: gfortran.dg/data_array_1.f90  -O3 -g  execution test
FAIL: gfortran.dg/data_array_1.f90  -Os  execution test
FAIL: gfortran.dg/dependency_2.f90  -O0  execution test
FAIL: gfortran.dg/dependency_2.f90  -O1  execution test
FAIL: gfortran.dg/dependency_2.f90  -O2  execution test
FAIL: gfortran.dg/dependency_2.f90  -O3 -fomit-frame-pointer  execution test
FAIL: gfortran.dg/dependency_2.f90  -O3 -fomit-frame-pointer -funroll-loops  execution test
FAIL: gfortran.dg/dependency_2.f90  -O3 -fomit-frame-pointer -funroll-all-loops -finline-functions  execution test
FAIL: gfortran.dg/dependency_2.f90  -O3 -g  execution test
FAIL: gfortran.dg/dependency_2.f90  -Os  execution test
FAIL: gfortran.dg/der_array_1.f90  -O0  (test for excess errors)
UNRESOLVED: gfortran.dg/der_array_1.f90  -O0  compilation failed to produce executable
FAIL: gfortran.dg/der_array_1.f90  -O1  (test for excess errors)
UNRESOLVED: gfortran.dg/der_array_1.f90  -O1  compilation failed to produce executable
FAIL: gfortran.dg/der_array_1.f90  -O2  (test for excess errors)
UNRESOLVED: gfortran.dg/der_array_1.f90  -O2  compilation failed to produce executable
FAIL: gfortran.dg/der_array_1.f90  -O3 -fomit-frame-pointer  (test for excess errors)
UNRESOLVED: gfortran.dg/der_array_1.f90  -O3 -fomit-frame-pointer  compilation failed to produce executable
FAIL: gfortran.dg/der_array_1.f90  -O3 -fomit-frame-pointer -funroll-loops  (test for excess errors)
UNRESOLVED: gfortran.dg/der_array_1.f90  -O3 -fomit-frame-pointer -funroll-loops  compilation failed to produce executable
FAIL: gfortran.dg/der_array_1.f90  -O3 -fomit-frame-pointer -funroll-all-loops -finline-functions  (test for excess errors)
UNRESOLVED: gfortran.dg/der_array_1.f90  -O3 -fomit-frame-pointer -funroll-all-loops -finline-functions  compilation failed to produce executable
FAIL: gfortran.dg/der_array_1.f90  -O3 -g  (test for excess errors)
UNRESOLVED: gfortran.dg/der_array_1.f90  -O3 -g  compilation failed to produce executable
FAIL: gfortran.dg/der_array_1.f90  -Os  (test for excess errors)
UNRESOLVED: gfortran.dg/der_array_1.f90  -Os  compilation failed to produce executable
FAIL: gfortran.dg/derived_comp_array_ref_7.f90  -O0  (test for excess errors)
UNRESOLVED: gfortran.dg/derived_comp_array_ref_7.f90  -O0  compilation failed to produce executable
FAIL: gfortran.dg/derived_comp_array_ref_7.f90  -O1  (test for excess errors)
UNRESOLVED: gfortran.dg/derived_comp_array_ref_7.f90  -O1  compilation failed to produce executable
FAIL: gfortran.dg/derived_comp_array_ref_7.f90  -O2  (test for excess errors)
UNRESOLVED: gfortran.dg/derived_comp_array_ref_7.f90  -O2  compilation failed to produce executable
FAIL: gfortran.dg/derived_comp_array_ref_7.f90  -O3 -fomit-frame-pointer  (test for excess errors)
UNRESOLVED: gfortran.dg/derived_comp_array_ref_7.f90  -O3 -fomit-frame-pointer  compilation failed to produce executable
FAIL: gfortran.dg/derived_comp_array_ref_7.f90  -O3 -fomit-frame-pointer -funroll-loops  (test for excess errors)
UNRESOLVED: gfortran.dg/derived_comp_array_ref_7.f90  -O3 -fomit-frame-pointer -funroll-loops  compilation failed to produce executable
FAIL: gfortran.dg/derived_comp_array_ref_7.f90  -O3 -fomit-frame-pointer -funroll-all-loops -finline-functions  (test for excess errors)
UNRESOLVED: gfortran.dg/derived_comp_array_ref_7.f90  -O3 -fomit-frame-pointer -funroll-all-loops -finline-functions  compilation failed to produce executable
FAIL: gfortran.dg/derived_comp_array_ref_7.f90  -O3 -g  (test for excess errors)
UNRESOLVED: gfortran.dg/derived_comp_array_ref_7.f90  -O3 -g  compilation failed to produce executable
FAIL: gfortran.dg/derived_comp_array_ref_7.f90  -Os  (test for excess errors)
UNRESOLVED: gfortran.dg/derived_comp_array_ref_7.f90  -Os  compilation failed to produce executable
FAIL: gfortran.dg/dos_eol.f  -O0  execution test
FAIL: gfortran.dg/dos_eol.f  -O1  execution test
FAIL: gfortran.dg/dos_eol.f  -O2  execution test
FAIL: gfortran.dg/dos_eol.f  -O3 -fomit-frame-pointer  execution test
FAIL: gfortran.dg/dos_eol.f  -O3 -fomit-frame-pointer -funroll-loops  execution test
FAIL: gfortran.dg/dos_eol.f  -O3 -fomit-frame-pointer -funroll-all-loops -finline-functions  execution test
FAIL: gfortran.dg/dos_eol.f  -O3 -g  execution test
FAIL: gfortran.dg/dos_eol.f  -Os  execution test
FAIL: gfortran.dg/entry_array_specs_3.f90  -O  (test for excess errors)
FAIL: gfortran.dg/eoshift_large_1.f90  -O0  (test for excess errors)
UNRESOLVED: gfortran.dg/eoshift_large_1.f90  -O0  compilation failed to produce executable
FAIL: gfortran.dg/eoshift_large_1.f90  -O1  (test for excess errors)
UNRESOLVED: gfortran.dg/eoshift_large_1.f90  -O1  compilation failed to produce executable
FAIL: gfortran.dg/eoshift_large_1.f90  -O2  (test for excess errors)
UNRESOLVED: gfortran.dg/eoshift_large_1.f90  -O2  compilation failed to produce executable
FAIL: gfortran.dg/eoshift_large_1.f90  -O3 -fomit-frame-pointer  (test for excess errors)
UNRESOLVED: gfortran.dg/eoshift_large_1.f90  -O3 -fomit-frame-pointer  compilation failed to produce executable
FAIL: gfortran.dg/eoshift_large_1.f90  -O3 -fomit-frame-pointer -funroll-loops  (test for excess errors)
UNRESOLVED: gfortran.dg/eoshift_large_1.f90  -O3 -fomit-frame-pointer -funroll-loops  compilation failed to produce executable
FAIL: gfortran.dg/eoshift_large_1.f90  -O3 -fomit-frame-pointer -funroll-all-loops -finline-functions  (test for excess errors)
UNRESOLVED: gfortran.dg/eoshift_large_1.f90  -O3 -fomit-frame-pointer -funroll-all-loops -finline-functions  compilation failed to produce executable
FAIL: gfortran.dg/eoshift_large_1.f90  -O3 -g  (test for excess errors)
UNRESOLVED: gfortran.dg/eoshift_large_1.f90  -O3 -g  compilation failed to produce executable
FAIL: gfortran.dg/eoshift_large_1.f90  -Os  (test for excess errors)
UNRESOLVED: gfortran.dg/eoshift_large_1.f90  -Os  compilation failed to produce executable
FAIL: gfortran.dg/equiv_1.f90  -O  d (test for errors, line 2)
FAIL: gfortran.dg/equiv_1.f90  -O  e (test for errors, line 3)
FAIL: gfortran.dg/equiv_1.f90  -O  f (test for errors, line 6)
FAIL: gfortran.dg/equiv_1.f90  -O  g (test for errors, line 7)
FAIL: gfortran.dg/equiv_6.f90  -O0  execution test
FAIL: gfortran.dg/equiv_6.f90  -O1  execution test
FAIL: gfortran.dg/equiv_6.f90  -O2  execution test
FAIL: gfortran.dg/equiv_6.f90  -O3 -fomit-frame-pointer  execution test
FAIL: gfortran.dg/equiv_6.f90  -O3 -fomit-frame-pointer -funroll-loops  execution test
FAIL: gfortran.dg/equiv_6.f90  -O3 -fomit-frame-pointer -funroll-all-loops -finline-functions  execution test
FAIL: gfortran.dg/equiv_6.f90  -O3 -g  execution test
FAIL: gfortran.dg/equiv_6.f90  -Os  execution test
FAIL: gfortran.dg/equiv_7.f90  -O0  (test for excess errors)
UNRESOLVED: gfortran.dg/equiv_7.f90  -O0  compilation failed to produce executable
FAIL: gfortran.dg/equiv_7.f90  -O1  (test for excess errors)
UNRESOLVED: gfortran.dg/equiv_7.f90  -O1  compilation failed to produce executable
FAIL: gfortran.dg/equiv_7.f90  -O2  (test for excess errors)
UNRESOLVED: gfortran.dg/equiv_7.f90  -O2  compilation failed to produce executable
FAIL: gfortran.dg/equiv_7.f90  -O3 -fomit-frame-pointer  (test for excess errors)
UNRESOLVED: gfortran.dg/equiv_7.f90  -O3 -fomit-frame-pointer  compilation failed to produce executable
FAIL: gfortran.dg/equiv_7.f90  -O3 -fomit-frame-pointer -funroll-loops  (test for excess errors)
UNRESOLVED: gfortran.dg/equiv_7.f90  -O3 -fomit-frame-pointer -funroll-loops  compilation failed to produce executable
FAIL: gfortran.dg/equiv_7.f90  -O3 -fomit-frame-pointer -funroll-all-loops -finline-functions  (test for excess errors)
UNRESOLVED: gfortran.dg/equiv_7.f90  -O3 -fomit-frame-pointer -funroll-all-loops -finline-functions  compilation failed to produce executable
FAIL: gfortran.dg/equiv_7.f90  -O3 -g  (test for excess errors)
UNRESOLVED: gfortran.dg/equiv_7.f90  -O3 -g  compilation failed to produce executable
FAIL: gfortran.dg/equiv_7.f90  -Os  (test for excess errors)
UNRESOLVED: gfortran.dg/equiv_7.f90  -Os  compilation failed to produce executable
FAIL: gfortran.dg/f2003_io_1.f03  -O0  execution test
FAIL: gfortran.dg/f2003_io_1.f03  -O1  execution test
FAIL: gfortran.dg/f2003_io_1.f03  -O2  execution test
FAIL: gfortran.dg/f2003_io_1.f03  -O3 -fomit-frame-pointer  execution test
FAIL: gfortran.dg/f2003_io_1.f03  -O3 -fomit-frame-pointer -funroll-loops  execution test
FAIL: gfortran.dg/f2003_io_1.f03  -O3 -fomit-frame-pointer -funroll-all-loops -finline-functions  execution test
FAIL: gfortran.dg/f2003_io_1.f03  -O3 -g  execution test
FAIL: gfortran.dg/f2003_io_1.f03  -Os  execution test
FAIL: gfortran.dg/f2003_io_4.f03  -O0  execution test
FAIL: gfortran.dg/f2003_io_4.f03  -O1  execution test
FAIL: gfortran.dg/f2003_io_4.f03  -O2  execution test
FAIL: gfortran.dg/f2003_io_4.f03  -O3 -fomit-frame-pointer  execution test
FAIL: gfortran.dg/f2003_io_4.f03  -O3 -fomit-frame-pointer -funroll-loops  execution test
FAIL: gfortran.dg/f2003_io_4.f03  -O3 -fomit-frame-pointer -funroll-all-loops -finline-functions  execution test
FAIL: gfortran.dg/f2003_io_4.f03  -O3 -g  execution test
FAIL: gfortran.dg/f2003_io_4.f03  -Os  execution test
FAIL: gfortran.dg/f2003_io_5.f03  -O0  execution test
FAIL: gfortran.dg/f2003_io_5.f03  -O1  execution test
FAIL: gfortran.dg/f2003_io_5.f03  -O2  execution test
FAIL: gfortran.dg/f2003_io_5.f03  -O3 -fomit-frame-pointer  execution test
FAIL: gfortran.dg/f2003_io_5.f03  -O3 -fomit-frame-pointer -funroll-loops  execution test
FAIL: gfortran.dg/f2003_io_5.f03  -O3 -fomit-frame-pointer -funroll-all-loops -finline-functions  execution test
FAIL: gfortran.dg/f2003_io_5.f03  -O3 -g  execution test
FAIL: gfortran.dg/f2003_io_5.f03  -Os  execution test
FAIL: gfortran.dg/f2003_io_6.f03  -O0  execution test
FAIL: gfortran.dg/f2003_io_6.f03  -O1  execution test
FAIL: gfortran.dg/f2003_io_6.f03  -O2  execution test
FAIL: gfortran.dg/f2003_io_6.f03  -O3 -fomit-frame-pointer  execution test
FAIL: gfortran.dg/f2003_io_6.f03  -O3 -fomit-frame-pointer -funroll-loops  execution test
FAIL: gfortran.dg/f2003_io_6.f03  -O3 -fomit-frame-pointer -funroll-all-loops -finline-functions  execution test
FAIL: gfortran.dg/f2003_io_6.f03  -O3 -g  execution test
FAIL: gfortran.dg/f2003_io_6.f03  -Os  execution test
FAIL: gfortran.dg/f2003_io_7.f03  -O0  execution test
FAIL: gfortran.dg/f2003_io_7.f03  -O1  execution test
FAIL: gfortran.dg/f2003_io_7.f03  -O2  execution test
FAIL: gfortran.dg/f2003_io_7.f03  -O3 -fomit-frame-pointer  execution test
FAIL: gfortran.dg/f2003_io_7.f03  -O3 -fomit-frame-pointer -funroll-loops  execution test
FAIL: gfortran.dg/f2003_io_7.f03  -O3 -fomit-frame-pointer -funroll-all-loops -finline-functions  execution test
FAIL: gfortran.dg/f2003_io_7.f03  -O3 -g  execution test
FAIL: gfortran.dg/f2003_io_7.f03  -Os  execution test
FAIL: gfortran.dg/fmt_t_5.f90  -O0  execution test
FAIL: gfortran.dg/fmt_t_5.f90  -O1  execution test
FAIL: gfortran.dg/fmt_t_5.f90  -O2  execution test
FAIL: gfortran.dg/fmt_t_5.f90  -O3 -fomit-frame-pointer  execution test
FAIL: gfortran.dg/fmt_t_5.f90  -O3 -fomit-frame-pointer -funroll-loops  execution test
FAIL: gfortran.dg/fmt_t_5.f90  -O3 -fomit-frame-pointer -funroll-all-loops -finline-functions  execution test
FAIL: gfortran.dg/fmt_t_5.f90  -O3 -g  execution test
FAIL: gfortran.dg/fmt_t_5.f90  -Os  execution test
FAIL: gfortran.dg/fold_nearest.f90  -O0  execution test
FAIL: gfortran.dg/fold_nearest.f90  -O1  execution test
FAIL: gfortran.dg/fold_nearest.f90  -O2  execution test
FAIL: gfortran.dg/fold_nearest.f90  -O3 -fomit-frame-pointer  execution test
FAIL: gfortran.dg/fold_nearest.f90  -O3 -fomit-frame-pointer -funroll-loops  execution test
FAIL: gfortran.dg/fold_nearest.f90  -O3 -fomit-frame-pointer -funroll-all-loops -finline-functions  execution test
FAIL: gfortran.dg/fold_nearest.f90  -O3 -g  execution test
FAIL: gfortran.dg/fold_nearest.f90  -Os  execution test
FAIL: gfortran.dg/forall_6.f90  -O0  (test for excess errors)
UNRESOLVED: gfortran.dg/forall_6.f90  -O0  compilation failed to produce executable
FAIL: gfortran.dg/forall_6.f90  -O1  (test for excess errors)
UNRESOLVED: gfortran.dg/forall_6.f90  -O1  compilation failed to produce executable
FAIL: gfortran.dg/forall_6.f90  -O2  (test for excess errors)
UNRESOLVED: gfortran.dg/forall_6.f90  -O2  compilation failed to produce executable
FAIL: gfortran.dg/forall_6.f90  -O3 -fomit-frame-pointer  (test for excess errors)
UNRESOLVED: gfortran.dg/forall_6.f90  -O3 -fomit-frame-pointer  compilation failed to produce executable
FAIL: gfortran.dg/forall_6.f90  -O3 -fomit-frame-pointer -funroll-loops  (test for excess errors)
UNRESOLVED: gfortran.dg/forall_6.f90  -O3 -fomit-frame-pointer -funroll-loops  compilation failed to produce executable
FAIL: gfortran.dg/forall_6.f90  -O3 -fomit-frame-pointer -funroll-all-loops -finline-functions  (test for excess errors)
UNRESOLVED: gfortran.dg/forall_6.f90  -O3 -fomit-frame-pointer -funroll-all-loops -finline-functions  compilation failed to produce executable
FAIL: gfortran.dg/forall_6.f90  -O3 -g  (test for excess errors)
UNRESOLVED: gfortran.dg/forall_6.f90  -O3 -g  compilation failed to produce executable
FAIL: gfortran.dg/forall_6.f90  -Os  (test for excess errors)
UNRESOLVED: gfortran.dg/forall_6.f90  -Os  compilation failed to produce executable
FAIL: gfortran.dg/ichar_2.f90  -O0  execution test
FAIL: gfortran.dg/ichar_2.f90  -O1  execution test
FAIL: gfortran.dg/ichar_2.f90  -O2  execution test
FAIL: gfortran.dg/ichar_2.f90  -O3 -fomit-frame-pointer  execution test
FAIL: gfortran.dg/ichar_2.f90  -O3 -fomit-frame-pointer -funroll-loops  execution test
FAIL: gfortran.dg/ichar_2.f90  -O3 -fomit-frame-pointer -funroll-all-loops -finline-functions  execution test
FAIL: gfortran.dg/ichar_2.f90  -O3 -g  execution test
FAIL: gfortran.dg/ichar_2.f90  -Os  execution test
FAIL: gfortran.dg/initialization_1.f90  -O   (test for errors, line 30)
FAIL: gfortran.dg/initialization_1.f90  -O  (test for excess errors)
FAIL: gfortran.dg/initialization_10.f90  -O  (test for excess errors)
FAIL: gfortran.dg/initialization_2.f90  -O0  (test for excess errors)
UNRESOLVED: gfortran.dg/initialization_2.f90  -O0  compilation failed to produce executable
FAIL: gfortran.dg/initialization_2.f90  -O1  (test for excess errors)
UNRESOLVED: gfortran.dg/initialization_2.f90  -O1  compilation failed to produce executable
FAIL: gfortran.dg/initialization_2.f90  -O2  (test for excess errors)
UNRESOLVED: gfortran.dg/initialization_2.f90  -O2  compilation failed to produce executable
FAIL: gfortran.dg/initialization_2.f90  -O3 -fomit-frame-pointer  (test for excess errors)
UNRESOLVED: gfortran.dg/initialization_2.f90  -O3 -fomit-frame-pointer  compilation failed to produce executable
FAIL: gfortran.dg/initialization_2.f90  -O3 -fomit-frame-pointer -funroll-loops  (test for excess errors)
UNRESOLVED: gfortran.dg/initialization_2.f90  -O3 -fomit-frame-pointer -funroll-loops  compilation failed to produce executable
FAIL: gfortran.dg/initialization_2.f90  -O3 -fomit-frame-pointer -funroll-all-loops -finline-functions  (test for excess errors)
UNRESOLVED: gfortran.dg/initialization_2.f90  -O3 -fomit-frame-pointer -funroll-all-loops -finline-functions  compilation failed to produce executable
FAIL: gfortran.dg/initialization_2.f90  -O3 -g  (test for excess errors)
UNRESOLVED: gfortran.dg/initialization_2.f90  -O3 -g  compilation failed to produce executable
FAIL: gfortran.dg/initialization_2.f90  -Os  (test for excess errors)
UNRESOLVED: gfortran.dg/initialization_2.f90  -Os  compilation failed to produce executable
FAIL: gfortran.dg/initialization_3.f90  -O   (test for errors, line 11)
FAIL: gfortran.dg/initialization_3.f90  -O   (test for errors, line 12)
FAIL: gfortran.dg/initialization_3.f90  -O  (test for excess errors)
FAIL: gfortran.dg/initialization_6.f90  -O0  (test for excess errors)
UNRESOLVED: gfortran.dg/initialization_6.f90  -O0  compilation failed to produce executable
FAIL: gfortran.dg/initialization_6.f90  -O1  (test for excess errors)
UNRESOLVED: gfortran.dg/initialization_6.f90  -O1  compilation failed to produce executable
FAIL: gfortran.dg/initialization_6.f90  -O2  (test for excess errors)
UNRESOLVED: gfortran.dg/initialization_6.f90  -O2  compilation failed to produce executable
FAIL: gfortran.dg/initialization_6.f90  -O3 -fomit-frame-pointer  (test for excess errors)
UNRESOLVED: gfortran.dg/initialization_6.f90  -O3 -fomit-frame-pointer  compilation failed to produce executable
FAIL: gfortran.dg/initialization_6.f90  -O3 -fomit-frame-pointer -funroll-loops  (test for excess errors)
UNRESOLVED: gfortran.dg/initialization_6.f90  -O3 -fomit-frame-pointer -funroll-loops  compilation failed to produce executable
FAIL: gfortran.dg/initialization_6.f90  -O3 -fomit-frame-pointer -funroll-all-loops -finline-functions  (test for excess errors)
UNRESOLVED: gfortran.dg/initialization_6.f90  -O3 -fomit-frame-pointer -funroll-all-loops -finline-functions  compilation failed to produce executable
FAIL: gfortran.dg/initialization_6.f90  -O3 -g  (test for excess errors)
UNRESOLVED: gfortran.dg/initialization_6.f90  -O3 -g  compilation failed to produce executable
FAIL: gfortran.dg/initialization_6.f90  -Os  (test for excess errors)
UNRESOLVED: gfortran.dg/initialization_6.f90  -Os  compilation failed to produce executable
FAIL: gfortran.dg/initialization_7.f90  -O   (test for errors, line 9)
FAIL: gfortran.dg/initialization_7.f90  -O  (test for excess errors)
FAIL: gfortran.dg/intrinsic_argument_conformance_2.f90  -O   (test for errors, line 29)
FAIL: gfortran.dg/intrinsic_argument_conformance_2.f90  -O   (test for errors, line 33)
FAIL: gfortran.dg/intrinsic_argument_conformance_2.f90  -O  (test for excess errors)
FAIL: gfortran.dg/intrinsic_intkinds_1.f90  -O0  (test for excess errors)
UNRESOLVED: gfortran.dg/intrinsic_intkinds_1.f90  -O0  compilation failed to produce executable
FAIL: gfortran.dg/intrinsic_intkinds_1.f90  -O1  (test for excess errors)
UNRESOLVED: gfortran.dg/intrinsic_intkinds_1.f90  -O1  compilation failed to produce executable
FAIL: gfortran.dg/intrinsic_intkinds_1.f90  -O2  (test for excess errors)
UNRESOLVED: gfortran.dg/intrinsic_intkinds_1.f90  -O2  compilation failed to produce executable
FAIL: gfortran.dg/intrinsic_intkinds_1.f90  -O3 -fomit-frame-pointer  (test for excess errors)
UNRESOLVED: gfortran.dg/intrinsic_intkinds_1.f90  -O3 -fomit-frame-pointer  compilation failed to produce executable
FAIL: gfortran.dg/intrinsic_intkinds_1.f90  -O3 -fomit-frame-pointer -funroll-loops  (test for excess errors)
UNRESOLVED: gfortran.dg/intrinsic_intkinds_1.f90  -O3 -fomit-frame-pointer -funroll-loops  compilation failed to produce executable
FAIL: gfortran.dg/intrinsic_intkinds_1.f90  -O3 -fomit-frame-pointer -funroll-all-loops -finline-functions  (test for excess errors)
UNRESOLVED: gfortran.dg/intrinsic_intkinds_1.f90  -O3 -fomit-frame-pointer -funroll-all-loops -finline-functions  compilation failed to produce executable
FAIL: gfortran.dg/intrinsic_intkinds_1.f90  -O3 -g  (test for excess errors)
UNRESOLVED: gfortran.dg/intrinsic_intkinds_1.f90  -O3 -g  compilation failed to produce executable
FAIL: gfortran.dg/intrinsic_intkinds_1.f90  -Os  (test for excess errors)
UNRESOLVED: gfortran.dg/intrinsic_intkinds_1.f90  -Os  compilation failed to produce executable
FAIL: gfortran.dg/intrinsic_pack_1.f90  -O0  (test for excess errors)
UNRESOLVED: gfortran.dg/intrinsic_pack_1.f90  -O0  compilation failed to produce executable
FAIL: gfortran.dg/intrinsic_pack_1.f90  -O1  (test for excess errors)
UNRESOLVED: gfortran.dg/intrinsic_pack_1.f90  -O1  compilation failed to produce executable
FAIL: gfortran.dg/intrinsic_pack_1.f90  -O2  (test for excess errors)
UNRESOLVED: gfortran.dg/intrinsic_pack_1.f90  -O2  compilation failed to produce executable
FAIL: gfortran.dg/intrinsic_pack_1.f90  -O3 -fomit-frame-pointer  (test for excess errors)
UNRESOLVED: gfortran.dg/intrinsic_pack_1.f90  -O3 -fomit-frame-pointer  compilation failed to produce executable
FAIL: gfortran.dg/intrinsic_pack_1.f90  -O3 -fomit-frame-pointer -funroll-loops  (test for excess errors)
UNRESOLVED: gfortran.dg/intrinsic_pack_1.f90  -O3 -fomit-frame-pointer -funroll-loops  compilation failed to produce executable
FAIL: gfortran.dg/intrinsic_pack_1.f90  -O3 -fomit-frame-pointer -funroll-all-loops -finline-functions  (test for excess errors)
UNRESOLVED: gfortran.dg/intrinsic_pack_1.f90  -O3 -fomit-frame-pointer -funroll-all-loops -finline-functions  compilation failed to produce executable
FAIL: gfortran.dg/intrinsic_pack_1.f90  -O3 -g  (test for excess errors)
UNRESOLVED: gfortran.dg/intrinsic_pack_1.f90  -O3 -g  compilation failed to produce executable
FAIL: gfortran.dg/intrinsic_pack_1.f90  -Os  (test for excess errors)
UNRESOLVED: gfortran.dg/intrinsic_pack_1.f90  -Os  compilation failed to produce executable
FAIL: gfortran.dg/intrinsic_pack_2.f90  -O0  (test for excess errors)
UNRESOLVED: gfortran.dg/intrinsic_pack_2.f90  -O0  compilation failed to produce executable
FAIL: gfortran.dg/intrinsic_pack_2.f90  -O1  (test for excess errors)
UNRESOLVED: gfortran.dg/intrinsic_pack_2.f90  -O1  compilation failed to produce executable
FAIL: gfortran.dg/intrinsic_pack_2.f90  -O2  (test for excess errors)
UNRESOLVED: gfortran.dg/intrinsic_pack_2.f90  -O2  compilation failed to produce executable
FAIL: gfortran.dg/intrinsic_pack_2.f90  -O3 -fomit-frame-pointer  (test for excess errors)
UNRESOLVED: gfortran.dg/intrinsic_pack_2.f90  -O3 -fomit-frame-pointer  compilation failed to produce executable
FAIL: gfortran.dg/intrinsic_pack_2.f90  -O3 -fomit-frame-pointer -funroll-loops  (test for excess errors)
UNRESOLVED: gfortran.dg/intrinsic_pack_2.f90  -O3 -fomit-frame-pointer -funroll-loops  compilation failed to produce executable
FAIL: gfortran.dg/intrinsic_pack_2.f90  -O3 -fomit-frame-pointer -funroll-all-loops -finline-functions  (test for excess errors)
UNRESOLVED: gfortran.dg/intrinsic_pack_2.f90  -O3 -fomit-frame-pointer -funroll-all-loops -finline-functions  compilation failed to produce executable
FAIL: gfortran.dg/intrinsic_pack_2.f90  -O3 -g  (test for excess errors)
UNRESOLVED: gfortran.dg/intrinsic_pack_2.f90  -O3 -g  compilation failed to produce executable
FAIL: gfortran.dg/intrinsic_pack_2.f90  -Os  (test for excess errors)
UNRESOLVED: gfortran.dg/intrinsic_pack_2.f90  -Os  compilation failed to produce executable
FAIL: gfortran.dg/intrinsic_pack_3.f90  -O0  (test for excess errors)
UNRESOLVED: gfortran.dg/intrinsic_pack_3.f90  -O0  compilation failed to produce executable
FAIL: gfortran.dg/intrinsic_pack_3.f90  -O1  (test for excess errors)
UNRESOLVED: gfortran.dg/intrinsic_pack_3.f90  -O1  compilation failed to produce executable
FAIL: gfortran.dg/intrinsic_pack_3.f90  -O2  (test for excess errors)
UNRESOLVED: gfortran.dg/intrinsic_pack_3.f90  -O2  compilation failed to produce executable
FAIL: gfortran.dg/intrinsic_pack_3.f90  -O3 -fomit-frame-pointer  (test for excess errors)
UNRESOLVED: gfortran.dg/intrinsic_pack_3.f90  -O3 -fomit-frame-pointer  compilation failed to produce executable
FAIL: gfortran.dg/intrinsic_pack_3.f90  -O3 -fomit-frame-pointer -funroll-loops  (test for excess errors)
UNRESOLVED: gfortran.dg/intrinsic_pack_3.f90  -O3 -fomit-frame-pointer -funroll-loops  compilation failed to produce executable
FAIL: gfortran.dg/intrinsic_pack_3.f90  -O3 -fomit-frame-pointer -funroll-all-loops -finline-functions  (test for excess errors)
UNRESOLVED: gfortran.dg/intrinsic_pack_3.f90  -O3 -fomit-frame-pointer -funroll-all-loops -finline-functions  compilation failed to produce executable
FAIL: gfortran.dg/intrinsic_pack_3.f90  -O3 -g  (test for excess errors)
UNRESOLVED: gfortran.dg/intrinsic_pack_3.f90  -O3 -g  compilation failed to produce executable
FAIL: gfortran.dg/intrinsic_pack_3.f90  -Os  (test for excess errors)
UNRESOLVED: gfortran.dg/intrinsic_pack_3.f90  -Os  compilation failed to produce executable
FAIL: gfortran.dg/intrinsic_spread_1.f90  -O0  (internal compiler error)
FAIL: gfortran.dg/intrinsic_spread_1.f90  -O0  (test for excess errors)
UNRESOLVED: gfortran.dg/intrinsic_spread_1.f90  -O0  compilation failed to produce executable
FAIL: gfortran.dg/intrinsic_spread_1.f90  -O1  (internal compiler error)
FAIL: gfortran.dg/intrinsic_spread_1.f90  -O1  (test for excess errors)
UNRESOLVED: gfortran.dg/intrinsic_spread_1.f90  -O1  compilation failed to produce executable
FAIL: gfortran.dg/intrinsic_spread_1.f90  -O2  (internal compiler error)
FAIL: gfortran.dg/intrinsic_spread_1.f90  -O2  (test for excess errors)
UNRESOLVED: gfortran.dg/intrinsic_spread_1.f90  -O2  compilation failed to produce executable
FAIL: gfortran.dg/intrinsic_spread_1.f90  -O3 -fomit-frame-pointer  (internal compiler error)
FAIL: gfortran.dg/intrinsic_spread_1.f90  -O3 -fomit-frame-pointer  (test for excess errors)
UNRESOLVED: gfortran.dg/intrinsic_spread_1.f90  -O3 -fomit-frame-pointer  compilation failed to produce executable
FAIL: gfortran.dg/intrinsic_spread_1.f90  -O3 -fomit-frame-pointer -funroll-loops  (internal compiler error)
FAIL: gfortran.dg/intrinsic_spread_1.f90  -O3 -fomit-frame-pointer -funroll-loops  (test for excess errors)
UNRESOLVED: gfortran.dg/intrinsic_spread_1.f90  -O3 -fomit-frame-pointer -funroll-loops  compilation failed to produce executable
FAIL: gfortran.dg/intrinsic_spread_1.f90  -O3 -fomit-frame-pointer -funroll-all-loops -finline-functions  (internal compiler error)
FAIL: gfortran.dg/intrinsic_spread_1.f90  -O3 -fomit-frame-pointer -funroll-all-loops -finline-functions  (test for excess errors)
UNRESOLVED: gfortran.dg/intrinsic_spread_1.f90  -O3 -fomit-frame-pointer -funroll-all-loops -finline-functions  compilation failed to produce executable
FAIL: gfortran.dg/intrinsic_spread_1.f90  -O3 -g  (internal compiler error)
FAIL: gfortran.dg/intrinsic_spread_1.f90  -O3 -g  (test for excess errors)
UNRESOLVED: gfortran.dg/intrinsic_spread_1.f90  -O3 -g  compilation failed to produce executable
FAIL: gfortran.dg/intrinsic_spread_1.f90  -Os  (internal compiler error)
FAIL: gfortran.dg/intrinsic_spread_1.f90  -Os  (test for excess errors)
UNRESOLVED: gfortran.dg/intrinsic_spread_1.f90  -Os  compilation failed to produce executable
FAIL: gfortran.dg/intrinsic_spread_2.f90  -O0  (internal compiler error)
FAIL: gfortran.dg/intrinsic_spread_2.f90  -O0  (test for excess errors)
UNRESOLVED: gfortran.dg/intrinsic_spread_2.f90  -O0  compilation failed to produce executable
FAIL: gfortran.dg/intrinsic_spread_2.f90  -O1  (internal compiler error)
FAIL: gfortran.dg/intrinsic_spread_2.f90  -O1  (test for excess errors)
UNRESOLVED: gfortran.dg/intrinsic_spread_2.f90  -O1  compilation failed to produce executable
FAIL: gfortran.dg/intrinsic_spread_2.f90  -O2  (internal compiler error)
FAIL: gfortran.dg/intrinsic_spread_2.f90  -O2  (test for excess errors)
UNRESOLVED: gfortran.dg/intrinsic_spread_2.f90  -O2  compilation failed to produce executable
FAIL: gfortran.dg/intrinsic_spread_2.f90  -O3 -fomit-frame-pointer  (internal compiler error)
FAIL: gfortran.dg/intrinsic_spread_2.f90  -O3 -fomit-frame-pointer  (test for excess errors)
UNRESOLVED: gfortran.dg/intrinsic_spread_2.f90  -O3 -fomit-frame-pointer  compilation failed to produce executable
FAIL: gfortran.dg/intrinsic_spread_2.f90  -O3 -fomit-frame-pointer -funroll-loops  (internal compiler error)
FAIL: gfortran.dg/intrinsic_spread_2.f90  -O3 -fomit-frame-pointer -funroll-loops  (test for excess errors)
UNRESOLVED: gfortran.dg/intrinsic_spread_2.f90  -O3 -fomit-frame-pointer -funroll-loops  compilation failed to produce executable
FAIL: gfortran.dg/intrinsic_spread_2.f90  -O3 -fomit-frame-pointer -funroll-all-loops -finline-functions  (internal compiler error)
FAIL: gfortran.dg/intrinsic_spread_2.f90  -O3 -fomit-frame-pointer -funroll-all-loops -finline-functions  (test for excess errors)
UNRESOLVED: gfortran.dg/intrinsic_spread_2.f90  -O3 -fomit-frame-pointer -funroll-all-loops -finline-functions  compilation failed to produce executable
FAIL: gfortran.dg/intrinsic_spread_2.f90  -O3 -g  (internal compiler error)
FAIL: gfortran.dg/intrinsic_spread_2.f90  -O3 -g  (test for excess errors)
UNRESOLVED: gfortran.dg/intrinsic_spread_2.f90  -O3 -g  compilation failed to produce executable
FAIL: gfortran.dg/intrinsic_spread_2.f90  -Os  (internal compiler error)
FAIL: gfortran.dg/intrinsic_spread_2.f90  -Os  (test for excess errors)
UNRESOLVED: gfortran.dg/intrinsic_spread_2.f90  -Os  compilation failed to produce executable
FAIL: gfortran.dg/intrinsic_spread_3.f90  -O0  (internal compiler error)
FAIL: gfortran.dg/intrinsic_spread_3.f90  -O0  (test for excess errors)
UNRESOLVED: gfortran.dg/intrinsic_spread_3.f90  -O0  compilation failed to produce executable
FAIL: gfortran.dg/intrinsic_spread_3.f90  -O1  (internal compiler error)
FAIL: gfortran.dg/intrinsic_spread_3.f90  -O1  (test for excess errors)
UNRESOLVED: gfortran.dg/intrinsic_spread_3.f90  -O1  compilation failed to produce executable
FAIL: gfortran.dg/intrinsic_spread_3.f90  -O2  (internal compiler error)
FAIL: gfortran.dg/intrinsic_spread_3.f90  -O2  (test for excess errors)
UNRESOLVED: gfortran.dg/intrinsic_spread_3.f90  -O2  compilation failed to produce executable
FAIL: gfortran.dg/intrinsic_spread_3.f90  -O3 -fomit-frame-pointer  (internal compiler error)
FAIL: gfortran.dg/intrinsic_spread_3.f90  -O3 -fomit-frame-pointer  (test for excess errors)
UNRESOLVED: gfortran.dg/intrinsic_spread_3.f90  -O3 -fomit-frame-pointer  compilation failed to produce executable
FAIL: gfortran.dg/intrinsic_spread_3.f90  -O3 -fomit-frame-pointer -funroll-loops  (internal compiler error)
FAIL: gfortran.dg/intrinsic_spread_3.f90  -O3 -fomit-frame-pointer -funroll-loops  (test for excess errors)
UNRESOLVED: gfortran.dg/intrinsic_spread_3.f90  -O3 -fomit-frame-pointer -funroll-loops  compilation failed to produce executable
FAIL: gfortran.dg/intrinsic_spread_3.f90  -O3 -fomit-frame-pointer -funroll-all-loops -finline-functions  (internal compiler error)
FAIL: gfortran.dg/intrinsic_spread_3.f90  -O3 -fomit-frame-pointer -funroll-all-loops -finline-functions  (test for excess errors)
UNRESOLVED: gfortran.dg/intrinsic_spread_3.f90  -O3 -fomit-frame-pointer -funroll-all-loops -finline-functions  compilation failed to produce executable
FAIL: gfortran.dg/intrinsic_spread_3.f90  -O3 -g  (internal compiler error)
FAIL: gfortran.dg/intrinsic_spread_3.f90  -O3 -g  (test for excess errors)
UNRESOLVED: gfortran.dg/intrinsic_spread_3.f90  -O3 -g  compilation failed to produce executable
FAIL: gfortran.dg/intrinsic_spread_3.f90  -Os  (internal compiler error)
FAIL: gfortran.dg/intrinsic_spread_3.f90  -Os  (test for excess errors)
UNRESOLVED: gfortran.dg/intrinsic_spread_3.f90  -Os  compilation failed to produce executable
FAIL: gfortran.dg/intrinsic_unpack_1.f90  -O0  (test for excess errors)
UNRESOLVED: gfortran.dg/intrinsic_unpack_1.f90  -O0  compilation failed to produce executable
FAIL: gfortran.dg/intrinsic_unpack_1.f90  -O1  (test for excess errors)
UNRESOLVED: gfortran.dg/intrinsic_unpack_1.f90  -O1  compilation failed to produce executable
FAIL: gfortran.dg/intrinsic_unpack_1.f90  -O2  (test for excess errors)
UNRESOLVED: gfortran.dg/intrinsic_unpack_1.f90  -O2  compilation failed to produce executable
FAIL: gfortran.dg/intrinsic_unpack_1.f90  -O3 -fomit-frame-pointer  (test for excess errors)
UNRESOLVED: gfortran.dg/intrinsic_unpack_1.f90  -O3 -fomit-frame-pointer  compilation failed to produce executable
FAIL: gfortran.dg/intrinsic_unpack_1.f90  -O3 -fomit-frame-pointer -funroll-loops  (test for excess errors)
UNRESOLVED: gfortran.dg/intrinsic_unpack_1.f90  -O3 -fomit-frame-pointer -funroll-loops  compilation failed to produce executable
FAIL: gfortran.dg/intrinsic_unpack_1.f90  -O3 -fomit-frame-pointer -funroll-all-loops -finline-functions  (test for excess errors)
UNRESOLVED: gfortran.dg/intrinsic_unpack_1.f90  -O3 -fomit-frame-pointer -funroll-all-loops -finline-functions  compilation failed to produce executable
FAIL: gfortran.dg/intrinsic_unpack_1.f90  -O3 -g  (test for excess errors)
UNRESOLVED: gfortran.dg/intrinsic_unpack_1.f90  -O3 -g  compilation failed to produce executable
FAIL: gfortran.dg/intrinsic_unpack_1.f90  -Os  (test for excess errors)
UNRESOLVED: gfortran.dg/intrinsic_unpack_1.f90  -Os  compilation failed to produce executable
FAIL: gfortran.dg/intrinsic_unpack_2.f90  -O0  (test for excess errors)
UNRESOLVED: gfortran.dg/intrinsic_unpack_2.f90  -O0  compilation failed to produce executable
FAIL: gfortran.dg/intrinsic_unpack_2.f90  -O1  (test for excess errors)
UNRESOLVED: gfortran.dg/intrinsic_unpack_2.f90  -O1  compilation failed to produce executable
FAIL: gfortran.dg/intrinsic_unpack_2.f90  -O2  (test for excess errors)
UNRESOLVED: gfortran.dg/intrinsic_unpack_2.f90  -O2  compilation failed to produce executable
FAIL: gfortran.dg/intrinsic_unpack_2.f90  -O3 -fomit-frame-pointer  (test for excess errors)
UNRESOLVED: gfortran.dg/intrinsic_unpack_2.f90  -O3 -fomit-frame-pointer  compilation failed to produce executable
FAIL: gfortran.dg/intrinsic_unpack_2.f90  -O3 -fomit-frame-pointer -funroll-loops  (test for excess errors)
UNRESOLVED: gfortran.dg/intrinsic_unpack_2.f90  -O3 -fomit-frame-pointer -funroll-loops  compilation failed to produce executable
FAIL: gfortran.dg/intrinsic_unpack_2.f90  -O3 -fomit-frame-pointer -funroll-all-loops -finline-functions  (test for excess errors)
UNRESOLVED: gfortran.dg/intrinsic_unpack_2.f90  -O3 -fomit-frame-pointer -funroll-all-loops -finline-functions  compilation failed to produce executable
FAIL: gfortran.dg/intrinsic_unpack_2.f90  -O3 -g  (test for excess errors)
UNRESOLVED: gfortran.dg/intrinsic_unpack_2.f90  -O3 -g  compilation failed to produce executable
FAIL: gfortran.dg/intrinsic_unpack_2.f90  -Os  (test for excess errors)
UNRESOLVED: gfortran.dg/intrinsic_unpack_2.f90  -Os  compilation failed to produce executable
FAIL: gfortran.dg/intrinsic_unpack_3.f90  -O0  (test for excess errors)
UNRESOLVED: gfortran.dg/intrinsic_unpack_3.f90  -O0  compilation failed to produce executable
FAIL: gfortran.dg/intrinsic_unpack_3.f90  -O1  (test for excess errors)
UNRESOLVED: gfortran.dg/intrinsic_unpack_3.f90  -O1  compilation failed to produce executable
FAIL: gfortran.dg/intrinsic_unpack_3.f90  -O2  (test for excess errors)
UNRESOLVED: gfortran.dg/intrinsic_unpack_3.f90  -O2  compilation failed to produce executable
FAIL: gfortran.dg/intrinsic_unpack_3.f90  -O3 -fomit-frame-pointer  (test for excess errors)
UNRESOLVED: gfortran.dg/intrinsic_unpack_3.f90  -O3 -fomit-frame-pointer  compilation failed to produce executable
FAIL: gfortran.dg/intrinsic_unpack_3.f90  -O3 -fomit-frame-pointer -funroll-loops  (test for excess errors)
UNRESOLVED: gfortran.dg/intrinsic_unpack_3.f90  -O3 -fomit-frame-pointer -funroll-loops  compilation failed to produce executable
FAIL: gfortran.dg/intrinsic_unpack_3.f90  -O3 -fomit-frame-pointer -funroll-all-loops -finline-functions  (test for excess errors)
UNRESOLVED: gfortran.dg/intrinsic_unpack_3.f90  -O3 -fomit-frame-pointer -funroll-all-loops -finline-functions  compilation failed to produce executable
FAIL: gfortran.dg/intrinsic_unpack_3.f90  -O3 -g  (test for excess errors)
UNRESOLVED: gfortran.dg/intrinsic_unpack_3.f90  -O3 -g  compilation failed to produce executable
FAIL: gfortran.dg/intrinsic_unpack_3.f90  -Os  (test for excess errors)
UNRESOLVED: gfortran.dg/intrinsic_unpack_3.f90  -Os  compilation failed to produce executable
FAIL: gfortran.dg/intrinsics_kind_argument_1.f90  -O  (test for excess errors)
FAIL: gfortran.dg/large_real_kind_2.F90  -O0  execution test
FAIL: gfortran.dg/large_real_kind_2.F90  -O1  execution test
FAIL: gfortran.dg/large_real_kind_2.F90  -O2  execution test
FAIL: gfortran.dg/large_real_kind_2.F90  -O3 -fomit-frame-pointer  execution test
FAIL: gfortran.dg/large_real_kind_2.F90  -O3 -fomit-frame-pointer -funroll-loops  execution test
FAIL: gfortran.dg/large_real_kind_2.F90  -O3 -fomit-frame-pointer -funroll-all-loops -finline-functions  execution test
FAIL: gfortran.dg/large_real_kind_2.F90  -O3 -g  execution test
FAIL: gfortran.dg/large_real_kind_2.F90  -Os  execution test
FAIL: gfortran.dg/largeequiv_1.f90  -O0  execution test
FAIL: gfortran.dg/largeequiv_1.f90  -O1  execution test
FAIL: gfortran.dg/largeequiv_1.f90  -O2  execution test
FAIL: gfortran.dg/largeequiv_1.f90  -O3 -fomit-frame-pointer  execution test
FAIL: gfortran.dg/largeequiv_1.f90  -O3 -fomit-frame-pointer -funroll-loops  execution test
FAIL: gfortran.dg/largeequiv_1.f90  -O3 -fomit-frame-pointer -funroll-all-loops -finline-functions  execution test
FAIL: gfortran.dg/largeequiv_1.f90  -O3 -g  execution test
FAIL: gfortran.dg/largeequiv_1.f90  -Os  execution test
FAIL: gfortran.dg/mapping_2.f90  -O0  (test for excess errors)
UNRESOLVED: gfortran.dg/mapping_2.f90  -O0  compilation failed to produce executable
FAIL: gfortran.dg/mapping_2.f90  -O1  (test for excess errors)
UNRESOLVED: gfortran.dg/mapping_2.f90  -O1  compilation failed to produce executable
FAIL: gfortran.dg/mapping_2.f90  -O2  (test for excess errors)
UNRESOLVED: gfortran.dg/mapping_2.f90  -O2  compilation failed to produce executable
FAIL: gfortran.dg/mapping_2.f90  -O3 -fomit-frame-pointer  (test for excess errors)
UNRESOLVED: gfortran.dg/mapping_2.f90  -O3 -fomit-frame-pointer  compilation failed to produce executable
FAIL: gfortran.dg/mapping_2.f90  -O3 -fomit-frame-pointer -funroll-loops  (test for excess errors)
UNRESOLVED: gfortran.dg/mapping_2.f90  -O3 -fomit-frame-pointer -funroll-loops  compilation failed to produce executable
FAIL: gfortran.dg/mapping_2.f90  -O3 -fomit-frame-pointer -funroll-all-loops -finline-functions  (test for excess errors)
UNRESOLVED: gfortran.dg/mapping_2.f90  -O3 -fomit-frame-pointer -funroll-all-loops -finline-functions  compilation failed to produce executable
FAIL: gfortran.dg/mapping_2.f90  -O3 -g  (test for excess errors)
UNRESOLVED: gfortran.dg/mapping_2.f90  -O3 -g  compilation failed to produce executable
FAIL: gfortran.dg/mapping_2.f90  -Os  (test for excess errors)
UNRESOLVED: gfortran.dg/mapping_2.f90  -Os  compilation failed to produce executable
FAIL: gfortran.dg/matmul_3.f90  -O0  (test for excess errors)
UNRESOLVED: gfortran.dg/matmul_3.f90  -O0  compilation failed to produce executable
FAIL: gfortran.dg/matmul_3.f90  -O1  (test for excess errors)
UNRESOLVED: gfortran.dg/matmul_3.f90  -O1  compilation failed to produce executable
FAIL: gfortran.dg/matmul_3.f90  -O2  (test for excess errors)
UNRESOLVED: gfortran.dg/matmul_3.f90  -O2  compilation failed to produce executable
FAIL: gfortran.dg/matmul_3.f90  -O3 -fomit-frame-pointer  (test for excess errors)
UNRESOLVED: gfortran.dg/matmul_3.f90  -O3 -fomit-frame-pointer  compilation failed to produce executable
FAIL: gfortran.dg/matmul_3.f90  -O3 -fomit-frame-pointer -funroll-loops  (test for excess errors)
UNRESOLVED: gfortran.dg/matmul_3.f90  -O3 -fomit-frame-pointer -funroll-loops  compilation failed to produce executable
FAIL: gfortran.dg/matmul_3.f90  -O3 -fomit-frame-pointer -funroll-all-loops -finline-functions  (test for excess errors)
UNRESOLVED: gfortran.dg/matmul_3.f90  -O3 -fomit-frame-pointer -funroll-all-loops -finline-functions  compilation failed to produce executable
FAIL: gfortran.dg/matmul_3.f90  -O3 -g  (test for excess errors)
UNRESOLVED: gfortran.dg/matmul_3.f90  -O3 -g  compilation failed to produce executable
FAIL: gfortran.dg/matmul_3.f90  -Os  (test for excess errors)
UNRESOLVED: gfortran.dg/matmul_3.f90  -Os  compilation failed to produce executable
FAIL: gfortran.dg/maxloc_shape_1.f90  -O  (test for excess errors)
FAIL: gfortran.dg/module_equivalence_1.f90  -O0  execution test
FAIL: gfortran.dg/module_equivalence_1.f90  -O1  execution test
FAIL: gfortran.dg/module_equivalence_1.f90  -O2  execution test
FAIL: gfortran.dg/module_equivalence_1.f90  -O3 -fomit-frame-pointer  execution test
FAIL: gfortran.dg/module_equivalence_1.f90  -O3 -fomit-frame-pointer -funroll-loops  execution test
FAIL: gfortran.dg/module_equivalence_1.f90  -O3 -fomit-frame-pointer -funroll-all-loops -finline-functions  execution test
FAIL: gfortran.dg/module_equivalence_1.f90  -O3 -g  execution test
FAIL: gfortran.dg/module_equivalence_1.f90  -Os  execution test
FAIL: gfortran.dg/module_equivalence_3.f90  -O0  execution test
FAIL: gfortran.dg/module_equivalence_3.f90  -O1  execution test
FAIL: gfortran.dg/module_equivalence_3.f90  -O2  execution test
FAIL: gfortran.dg/module_equivalence_3.f90  -O3 -fomit-frame-pointer  execution test
FAIL: gfortran.dg/module_equivalence_3.f90  -O3 -fomit-frame-pointer -funroll-loops  execution test
FAIL: gfortran.dg/module_equivalence_3.f90  -O3 -fomit-frame-pointer -funroll-all-loops -finline-functions  execution test
FAIL: gfortran.dg/module_equivalence_3.f90  -O3 -g  execution test
FAIL: gfortran.dg/module_equivalence_3.f90  -Os  execution test
FAIL: gfortran.dg/module_private_array_refs_1.f90  -O  (test for excess errors)
FAIL: gfortran.dg/nested_modules_6.f90  -O  (test for excess errors)
FAIL: gfortran.dg/nested_reshape.f90  -O0  (test for excess errors)
UNRESOLVED: gfortran.dg/nested_reshape.f90  -O0  compilation failed to produce executable
FAIL: gfortran.dg/nested_reshape.f90  -O1  (test for excess errors)
UNRESOLVED: gfortran.dg/nested_reshape.f90  -O1  compilation failed to produce executable
FAIL: gfortran.dg/nested_reshape.f90  -O2  (test for excess errors)
UNRESOLVED: gfortran.dg/nested_reshape.f90  -O2  compilation failed to produce executable
FAIL: gfortran.dg/nested_reshape.f90  -O3 -fomit-frame-pointer  (test for excess errors)
UNRESOLVED: gfortran.dg/nested_reshape.f90  -O3 -fomit-frame-pointer  compilation failed to produce executable
FAIL: gfortran.dg/nested_reshape.f90  -O3 -fomit-frame-pointer -funroll-loops  (test for excess errors)
UNRESOLVED: gfortran.dg/nested_reshape.f90  -O3 -fomit-frame-pointer -funroll-loops  compilation failed to produce executable
FAIL: gfortran.dg/nested_reshape.f90  -O3 -fomit-frame-pointer -funroll-all-loops -finline-functions  (test for excess errors)
UNRESOLVED: gfortran.dg/nested_reshape.f90  -O3 -fomit-frame-pointer -funroll-all-loops -finline-functions  compilation failed to produce executable
FAIL: gfortran.dg/nested_reshape.f90  -O3 -g  (test for excess errors)
UNRESOLVED: gfortran.dg/nested_reshape.f90  -O3 -g  compilation failed to produce executable
FAIL: gfortran.dg/nested_reshape.f90  -Os  (test for excess errors)
UNRESOLVED: gfortran.dg/nested_reshape.f90  -Os  compilation failed to produce executable
FAIL: gfortran.dg/new_line.f90  -O0  execution test
FAIL: gfortran.dg/new_line.f90  -O1  execution test
FAIL: gfortran.dg/new_line.f90  -O2  execution test
FAIL: gfortran.dg/new_line.f90  -O3 -fomit-frame-pointer  execution test
FAIL: gfortran.dg/new_line.f90  -O3 -fomit-frame-pointer -funroll-loops  execution test
FAIL: gfortran.dg/new_line.f90  -O3 -fomit-frame-pointer -funroll-all-loops -finline-functions  execution test
FAIL: gfortran.dg/new_line.f90  -O3 -g  execution test
FAIL: gfortran.dg/new_line.f90  -Os  execution test
FAIL: gfortran.dg/operator_1.f90  -O0  (test for excess errors)
UNRESOLVED: gfortran.dg/operator_1.f90  -O0  compilation failed to produce executable
FAIL: gfortran.dg/operator_1.f90  -O1  (test for excess errors)
UNRESOLVED: gfortran.dg/operator_1.f90  -O1  compilation failed to produce executable
FAIL: gfortran.dg/operator_1.f90  -O2  (test for excess errors)
UNRESOLVED: gfortran.dg/operator_1.f90  -O2  compilation failed to produce executable
FAIL: gfortran.dg/operator_1.f90  -O3 -fomit-frame-pointer  (test for excess errors)
UNRESOLVED: gfortran.dg/operator_1.f90  -O3 -fomit-frame-pointer  compilation failed to produce executable
FAIL: gfortran.dg/operator_1.f90  -O3 -fomit-frame-pointer -funroll-loops  (test for excess errors)
UNRESOLVED: gfortran.dg/operator_1.f90  -O3 -fomit-frame-pointer -funroll-loops  compilation failed to produce executable
FAIL: gfortran.dg/operator_1.f90  -O3 -fomit-frame-pointer -funroll-all-loops -finline-functions  (test for excess errors)
UNRESOLVED: gfortran.dg/operator_1.f90  -O3 -fomit-frame-pointer -funroll-all-loops -finline-functions  compilation failed to produce executable
FAIL: gfortran.dg/operator_1.f90  -O3 -g  (test for excess errors)
UNRESOLVED: gfortran.dg/operator_1.f90  -O3 -g  compilation failed to produce executable
FAIL: gfortran.dg/operator_1.f90  -Os  (test for excess errors)
UNRESOLVED: gfortran.dg/operator_1.f90  -Os  compilation failed to produce executable
FAIL: gfortran.dg/operator_2.f90  -O   (test for errors, line 6)
FAIL: gfortran.dg/operator_2.f90  -O   (test for errors, line 10)
FAIL: gfortran.dg/operator_2.f90  -O  (test for excess errors)
FAIL: gfortran.dg/pack_bounds_1.f90  -O0  (test for excess errors)
UNRESOLVED: gfortran.dg/pack_bounds_1.f90  -O0  compilation failed to produce executable
FAIL: gfortran.dg/pack_bounds_1.f90  -O1  (test for excess errors)
UNRESOLVED: gfortran.dg/pack_bounds_1.f90  -O1  compilation failed to produce executable
FAIL: gfortran.dg/pack_bounds_1.f90  -O2  (test for excess errors)
UNRESOLVED: gfortran.dg/pack_bounds_1.f90  -O2  compilation failed to produce executable
FAIL: gfortran.dg/pack_bounds_1.f90  -O3 -fomit-frame-pointer  (test for excess errors)
UNRESOLVED: gfortran.dg/pack_bounds_1.f90  -O3 -fomit-frame-pointer  compilation failed to produce executable
FAIL: gfortran.dg/pack_bounds_1.f90  -O3 -fomit-frame-pointer -funroll-loops  (test for excess errors)
UNRESOLVED: gfortran.dg/pack_bounds_1.f90  -O3 -fomit-frame-pointer -funroll-loops  compilation failed to produce executable
FAIL: gfortran.dg/pack_bounds_1.f90  -O3 -fomit-frame-pointer -funroll-all-loops -finline-functions  (test for excess errors)
UNRESOLVED: gfortran.dg/pack_bounds_1.f90  -O3 -fomit-frame-pointer -funroll-all-loops -finline-functions  compilation failed to produce executable
FAIL: gfortran.dg/pack_bounds_1.f90  -O3 -g  (test for excess errors)
UNRESOLVED: gfortran.dg/pack_bounds_1.f90  -O3 -g  compilation failed to produce executable
FAIL: gfortran.dg/pack_bounds_1.f90  -Os  (test for excess errors)
UNRESOLVED: gfortran.dg/pack_bounds_1.f90  -Os  compilation failed to produce executable
FAIL: gfortran.dg/parameter_array_element_1.f90  -O  (test for excess errors)
FAIL: gfortran.dg/parameter_array_element_1.f90  -O  scan-tree-dump-times original "105" 1: dump file does not exist
FAIL: gfortran.dg/parameter_array_init_4.f90  -O0  execution test
FAIL: gfortran.dg/parameter_array_init_4.f90  -O1  execution test
FAIL: gfortran.dg/parameter_array_init_4.f90  -O2  execution test
FAIL: gfortran.dg/parameter_array_init_4.f90  -O3 -fomit-frame-pointer  execution test
FAIL: gfortran.dg/parameter_array_init_4.f90  -O3 -fomit-frame-pointer -funroll-loops  execution test
FAIL: gfortran.dg/parameter_array_init_4.f90  -O3 -fomit-frame-pointer -funroll-all-loops -finline-functions  execution test
FAIL: gfortran.dg/parameter_array_init_4.f90  -O3 -g  execution test
FAIL: gfortran.dg/parameter_array_init_4.f90  -Os  execution test
FAIL: gfortran.dg/pr15957.f90  -O0  (test for excess errors)
UNRESOLVED: gfortran.dg/pr15957.f90  -O0  compilation failed to produce executable
FAIL: gfortran.dg/pr15957.f90  -O1  (test for excess errors)
UNRESOLVED: gfortran.dg/pr15957.f90  -O1  compilation failed to produce executable
FAIL: gfortran.dg/pr15957.f90  -O2  (test for excess errors)
UNRESOLVED: gfortran.dg/pr15957.f90  -O2  compilation failed to produce executable
FAIL: gfortran.dg/pr15957.f90  -O3 -fomit-frame-pointer  (test for excess errors)
UNRESOLVED: gfortran.dg/pr15957.f90  -O3 -fomit-frame-pointer  compilation failed to produce executable
FAIL: gfortran.dg/pr15957.f90  -O3 -fomit-frame-pointer -funroll-loops  (test for excess errors)
UNRESOLVED: gfortran.dg/pr15957.f90  -O3 -fomit-frame-pointer -funroll-loops  compilation failed to produce executable
FAIL: gfortran.dg/pr15957.f90  -O3 -fomit-frame-pointer -funroll-all-loops -finline-functions  (test for excess errors)
UNRESOLVED: gfortran.dg/pr15957.f90  -O3 -fomit-frame-pointer -funroll-all-loops -finline-functions  compilation failed to produce executable
FAIL: gfortran.dg/pr15957.f90  -O3 -g  (test for excess errors)
UNRESOLVED: gfortran.dg/pr15957.f90  -O3 -g  compilation failed to produce executable
FAIL: gfortran.dg/pr15957.f90  -Os  (test for excess errors)
UNRESOLVED: gfortran.dg/pr15957.f90  -Os  compilation failed to produce executable
FAIL: gfortran.dg/pr15959.f90  -O0  execution test
FAIL: gfortran.dg/pr15959.f90  -O1  execution test
FAIL: gfortran.dg/pr15959.f90  -O2  execution test
FAIL: gfortran.dg/pr15959.f90  -O3 -fomit-frame-pointer  execution test
FAIL: gfortran.dg/pr15959.f90  -O3 -fomit-frame-pointer -funroll-loops  execution test
FAIL: gfortran.dg/pr15959.f90  -O3 -fomit-frame-pointer -funroll-all-loops -finline-functions  execution test
FAIL: gfortran.dg/pr15959.f90  -O3 -g  execution test
FAIL: gfortran.dg/pr15959.f90  -Os  execution test
FAIL: gfortran.dg/pr32136.f90  -O0  (internal compiler error)
FAIL: gfortran.dg/pr32136.f90  -O0  (test for excess errors)
UNRESOLVED: gfortran.dg/pr32136.f90  -O0  compilation failed to produce executable
FAIL: gfortran.dg/pr32136.f90  -O1  (internal compiler error)
FAIL: gfortran.dg/pr32136.f90  -O1  (test for excess errors)
UNRESOLVED: gfortran.dg/pr32136.f90  -O1  compilation failed to produce executable
FAIL: gfortran.dg/pr32136.f90  -O2  (internal compiler error)
FAIL: gfortran.dg/pr32136.f90  -O2  (test for excess errors)
UNRESOLVED: gfortran.dg/pr32136.f90  -O2  compilation failed to produce executable
FAIL: gfortran.dg/pr32136.f90  -O3 -fomit-frame-pointer  (internal compiler error)
FAIL: gfortran.dg/pr32136.f90  -O3 -fomit-frame-pointer  (test for excess errors)
UNRESOLVED: gfortran.dg/pr32136.f90  -O3 -fomit-frame-pointer  compilation failed to produce executable
FAIL: gfortran.dg/pr32136.f90  -O3 -fomit-frame-pointer -funroll-loops  (internal compiler error)
FAIL: gfortran.dg/pr32136.f90  -O3 -fomit-frame-pointer -funroll-loops  (test for excess errors)
UNRESOLVED: gfortran.dg/pr32136.f90  -O3 -fomit-frame-pointer -funroll-loops  compilation failed to produce executable
FAIL: gfortran.dg/pr32136.f90  -O3 -fomit-frame-pointer -funroll-all-loops -finline-functions  (internal compiler error)
FAIL: gfortran.dg/pr32136.f90  -O3 -fomit-frame-pointer -funroll-all-loops -finline-functions  (test for excess errors)
UNRESOLVED: gfortran.dg/pr32136.f90  -O3 -fomit-frame-pointer -funroll-all-loops -finline-functions  compilation failed to produce executable
FAIL: gfortran.dg/pr32136.f90  -O3 -g  (internal compiler error)
FAIL: gfortran.dg/pr32136.f90  -O3 -g  (test for excess errors)
UNRESOLVED: gfortran.dg/pr32136.f90  -O3 -g  compilation failed to produce executable
FAIL: gfortran.dg/pr32136.f90  -Os  (internal compiler error)
FAIL: gfortran.dg/pr32136.f90  -Os  (test for excess errors)
UNRESOLVED: gfortran.dg/pr32136.f90  -Os  compilation failed to produce executable
FAIL: gfortran.dg/pr36286.f90  -O  (test for excess errors)
WARNING: program timed out.
FAIL: gfortran.dg/proc_ptr_5.f90  -O0  execution test
WARNING: program timed out.
FAIL: gfortran.dg/proc_ptr_5.f90  -O1  execution test
WARNING: program timed out.
FAIL: gfortran.dg/proc_ptr_5.f90  -O2  execution test
WARNING: program timed out.
FAIL: gfortran.dg/proc_ptr_5.f90  -O3 -fomit-frame-pointer  execution test
WARNING: program timed out.
FAIL: gfortran.dg/proc_ptr_5.f90  -O3 -fomit-frame-pointer -funroll-loops  execution test
WARNING: program timed out.
FAIL: gfortran.dg/proc_ptr_5.f90  -O3 -fomit-frame-pointer -funroll-all-loops -finline-functions  execution test
WARNING: program timed out.
FAIL: gfortran.dg/proc_ptr_5.f90  -O3 -g  execution test
WARNING: program timed out.
FAIL: gfortran.dg/proc_ptr_5.f90  -Os  execution test
FAIL: gfortran.dg/reshape_2.f90  -O0  (test for excess errors)
UNRESOLVED: gfortran.dg/reshape_2.f90  -O0  compilation failed to produce executable
FAIL: gfortran.dg/reshape_2.f90  -O1  (test for excess errors)
UNRESOLVED: gfortran.dg/reshape_2.f90  -O1  compilation failed to produce executable
FAIL: gfortran.dg/reshape_2.f90  -O2  (test for excess errors)
UNRESOLVED: gfortran.dg/reshape_2.f90  -O2  compilation failed to produce executable
FAIL: gfortran.dg/reshape_2.f90  -O3 -fomit-frame-pointer  (test for excess errors)
UNRESOLVED: gfortran.dg/reshape_2.f90  -O3 -fomit-frame-pointer  compilation failed to produce executable
FAIL: gfortran.dg/reshape_2.f90  -O3 -fomit-frame-pointer -funroll-loops  (test for excess errors)
UNRESOLVED: gfortran.dg/reshape_2.f90  -O3 -fomit-frame-pointer -funroll-loops  compilation failed to produce executable
FAIL: gfortran.dg/reshape_2.f90  -O3 -fomit-frame-pointer -funroll-all-loops -finline-functions  (test for excess errors)
UNRESOLVED: gfortran.dg/reshape_2.f90  -O3 -fomit-frame-pointer -funroll-all-loops -finline-functions  compilation failed to produce executable
FAIL: gfortran.dg/reshape_2.f90  -O3 -g  (test for excess errors)
UNRESOLVED: gfortran.dg/reshape_2.f90  -O3 -g  compilation failed to produce executable
FAIL: gfortran.dg/reshape_2.f90  -Os  (test for excess errors)
UNRESOLVED: gfortran.dg/reshape_2.f90  -Os  compilation failed to produce executable
FAIL: gfortran.dg/ret_array_1.f90  -O0  (test for excess errors)
UNRESOLVED: gfortran.dg/ret_array_1.f90  -O0  compilation failed to produce executable
FAIL: gfortran.dg/ret_array_1.f90  -O1  (test for excess errors)
UNRESOLVED: gfortran.dg/ret_array_1.f90  -O1  compilation failed to produce executable
FAIL: gfortran.dg/ret_array_1.f90  -O2  (test for excess errors)
UNRESOLVED: gfortran.dg/ret_array_1.f90  -O2  compilation failed to produce executable
FAIL: gfortran.dg/ret_array_1.f90  -O3 -fomit-frame-pointer  (test for excess errors)
UNRESOLVED: gfortran.dg/ret_array_1.f90  -O3 -fomit-frame-pointer  compilation failed to produce executable
FAIL: gfortran.dg/ret_array_1.f90  -O3 -fomit-frame-pointer -funroll-loops  (test for excess errors)
UNRESOLVED: gfortran.dg/ret_array_1.f90  -O3 -fomit-frame-pointer -funroll-loops  compilation failed to produce executable
FAIL: gfortran.dg/ret_array_1.f90  -O3 -fomit-frame-pointer -funroll-all-loops -finline-functions  (test for excess errors)
UNRESOLVED: gfortran.dg/ret_array_1.f90  -O3 -fomit-frame-pointer -funroll-all-loops -finline-functions  compilation failed to produce executable
FAIL: gfortran.dg/ret_array_1.f90  -O3 -g  (test for excess errors)
UNRESOLVED: gfortran.dg/ret_array_1.f90  -O3 -g  compilation failed to produce executable
FAIL: gfortran.dg/ret_array_1.f90  -Os  (test for excess errors)
UNRESOLVED: gfortran.dg/ret_array_1.f90  -Os  compilation failed to produce executable
FAIL: gfortran.dg/scalarize_parameter_array_1.f90  -O0  (test for excess errors)
UNRESOLVED: gfortran.dg/scalarize_parameter_array_1.f90  -O0  compilation failed to produce executable
FAIL: gfortran.dg/scalarize_parameter_array_1.f90  -O1  (test for excess errors)
UNRESOLVED: gfortran.dg/scalarize_parameter_array_1.f90  -O1  compilation failed to produce executable
FAIL: gfortran.dg/scalarize_parameter_array_1.f90  -O2  (test for excess errors)
UNRESOLVED: gfortran.dg/scalarize_parameter_array_1.f90  -O2  compilation failed to produce executable
FAIL: gfortran.dg/scalarize_parameter_array_1.f90  -O3 -fomit-frame-pointer  (test for excess errors)
UNRESOLVED: gfortran.dg/scalarize_parameter_array_1.f90  -O3 -fomit-frame-pointer  compilation failed to produce executable
FAIL: gfortran.dg/scalarize_parameter_array_1.f90  -O3 -fomit-frame-pointer -funroll-loops  (test for excess errors)
UNRESOLVED: gfortran.dg/scalarize_parameter_array_1.f90  -O3 -fomit-frame-pointer -funroll-loops  compilation failed to produce executable
FAIL: gfortran.dg/scalarize_parameter_array_1.f90  -O3 -fomit-frame-pointer -funroll-all-loops -finline-functions  (test for excess errors)
UNRESOLVED: gfortran.dg/scalarize_parameter_array_1.f90  -O3 -fomit-frame-pointer -funroll-all-loops -finline-functions  compilation failed to produce executable
FAIL: gfortran.dg/scalarize_parameter_array_1.f90  -O3 -g  (test for excess errors)
UNRESOLVED: gfortran.dg/scalarize_parameter_array_1.f90  -O3 -g  compilation failed to produce executable
FAIL: gfortran.dg/scalarize_parameter_array_1.f90  -Os  (test for excess errors)
UNRESOLVED: gfortran.dg/scalarize_parameter_array_1.f90  -Os  compilation failed to produce executable
FAIL: gfortran.dg/shape_4.f90  -O  (test for excess errors)
FAIL: gfortran.dg/shift-alloc.f90  -O0  (test for excess errors)
UNRESOLVED: gfortran.dg/shift-alloc.f90  -O0  compilation failed to produce executable
FAIL: gfortran.dg/shift-alloc.f90  -O1  (test for excess errors)
UNRESOLVED: gfortran.dg/shift-alloc.f90  -O1  compilation failed to produce executable
FAIL: gfortran.dg/shift-alloc.f90  -O2  (test for excess errors)
UNRESOLVED: gfortran.dg/shift-alloc.f90  -O2  compilation failed to produce executable
FAIL: gfortran.dg/shift-alloc.f90  -O3 -fomit-frame-pointer  (test for excess errors)
UNRESOLVED: gfortran.dg/shift-alloc.f90  -O3 -fomit-frame-pointer  compilation failed to produce executable
FAIL: gfortran.dg/shift-alloc.f90  -O3 -fomit-frame-pointer -funroll-loops  (test for excess errors)
UNRESOLVED: gfortran.dg/shift-alloc.f90  -O3 -fomit-frame-pointer -funroll-loops  compilation failed to produce executable
FAIL: gfortran.dg/shift-alloc.f90  -O3 -fomit-frame-pointer -funroll-all-loops -finline-functions  (test for excess errors)
UNRESOLVED: gfortran.dg/shift-alloc.f90  -O3 -fomit-frame-pointer -funroll-all-loops -finline-functions  compilation failed to produce executable
FAIL: gfortran.dg/shift-alloc.f90  -O3 -g  (test for excess errors)
UNRESOLVED: gfortran.dg/shift-alloc.f90  -O3 -g  compilation failed to produce executable
FAIL: gfortran.dg/shift-alloc.f90  -Os  (test for excess errors)
UNRESOLVED: gfortran.dg/shift-alloc.f90  -Os  compilation failed to produce executable
FAIL: gfortran.dg/shift-kind.f90  -O  (test for excess errors)
FAIL: gfortran.dg/single_char_string.f90  -O0  execution test
FAIL: gfortran.dg/single_char_string.f90  -O1  execution test
FAIL: gfortran.dg/single_char_string.f90  -O2  execution test
FAIL: gfortran.dg/single_char_string.f90  -O3 -fomit-frame-pointer  execution test
FAIL: gfortran.dg/single_char_string.f90  -O3 -fomit-frame-pointer -funroll-loops  execution test
FAIL: gfortran.dg/single_char_string.f90  -O3 -fomit-frame-pointer -funroll-all-loops -finline-functions  execution test
FAIL: gfortran.dg/single_char_string.f90  -O3 -g  execution test
FAIL: gfortran.dg/single_char_string.f90  -Os  execution test
FAIL: gfortran.dg/size_dim.f90  -O0  (test for excess errors)
UNRESOLVED: gfortran.dg/size_dim.f90  -O0  compilation failed to produce executable
FAIL: gfortran.dg/size_dim.f90  -O1  (test for excess errors)
UNRESOLVED: gfortran.dg/size_dim.f90  -O1  compilation failed to produce executable
FAIL: gfortran.dg/size_dim.f90  -O2  (test for excess errors)
UNRESOLVED: gfortran.dg/size_dim.f90  -O2  compilation failed to produce executable
FAIL: gfortran.dg/size_dim.f90  -O3 -fomit-frame-pointer  (test for excess errors)
UNRESOLVED: gfortran.dg/size_dim.f90  -O3 -fomit-frame-pointer  compilation failed to produce executable
FAIL: gfortran.dg/size_dim.f90  -O3 -fomit-frame-pointer -funroll-loops  (test for excess errors)
UNRESOLVED: gfortran.dg/size_dim.f90  -O3 -fomit-frame-pointer -funroll-loops  compilation failed to produce executable
FAIL: gfortran.dg/size_dim.f90  -O3 -fomit-frame-pointer -funroll-all-loops -finline-functions  (test for excess errors)
UNRESOLVED: gfortran.dg/size_dim.f90  -O3 -fomit-frame-pointer -funroll-all-loops -finline-functions  compilation failed to produce executable
FAIL: gfortran.dg/size_dim.f90  -O3 -g  (test for excess errors)
UNRESOLVED: gfortran.dg/size_dim.f90  -O3 -g  compilation failed to produce executable
FAIL: gfortran.dg/size_dim.f90  -Os  (test for excess errors)
UNRESOLVED: gfortran.dg/size_dim.f90  -Os  compilation failed to produce executable
FAIL: gfortran.dg/sms-1.f90  -O0  (test for excess errors)
UNRESOLVED: gfortran.dg/sms-1.f90  -O0  compilation failed to produce executable
FAIL: gfortran.dg/sms-1.f90  -O1  (test for excess errors)
UNRESOLVED: gfortran.dg/sms-1.f90  -O1  compilation failed to produce executable
FAIL: gfortran.dg/sms-1.f90  -O2  (test for excess errors)
UNRESOLVED: gfortran.dg/sms-1.f90  -O2  compilation failed to produce executable
FAIL: gfortran.dg/sms-1.f90  -O3 -fomit-frame-pointer  (test for excess errors)
UNRESOLVED: gfortran.dg/sms-1.f90  -O3 -fomit-frame-pointer  compilation failed to produce executable
FAIL: gfortran.dg/sms-1.f90  -O3 -fomit-frame-pointer -funroll-loops  (test for excess errors)
UNRESOLVED: gfortran.dg/sms-1.f90  -O3 -fomit-frame-pointer -funroll-loops  compilation failed to produce executable
FAIL: gfortran.dg/sms-1.f90  -O3 -fomit-frame-pointer -funroll-all-loops -finline-functions  (test for excess errors)
UNRESOLVED: gfortran.dg/sms-1.f90  -O3 -fomit-frame-pointer -funroll-all-loops -finline-functions  compilation failed to produce executable
FAIL: gfortran.dg/sms-1.f90  -O3 -g  (test for excess errors)
UNRESOLVED: gfortran.dg/sms-1.f90  -O3 -g  compilation failed to produce executable
FAIL: gfortran.dg/sms-1.f90  -Os  (test for excess errors)
UNRESOLVED: gfortran.dg/sms-1.f90  -Os  compilation failed to produce executable
FAIL: gfortran.dg/spec_expr_4.f90  -O  (test for excess errors)
FAIL: gfortran.dg/specification_type_resolution_1.f90  -O  (test for excess errors)
FAIL: gfortran.dg/spread_shape_1.f90  -O  (test for excess errors)
FAIL: gfortran.dg/spread_zerosize_1.f90  -O0  (internal compiler error)
FAIL: gfortran.dg/spread_zerosize_1.f90  -O0  (test for excess errors)
UNRESOLVED: gfortran.dg/spread_zerosize_1.f90  -O0  compilation failed to produce executable
FAIL: gfortran.dg/spread_zerosize_1.f90  -O1  (internal compiler error)
FAIL: gfortran.dg/spread_zerosize_1.f90  -O1  (test for excess errors)
UNRESOLVED: gfortran.dg/spread_zerosize_1.f90  -O1  compilation failed to produce executable
FAIL: gfortran.dg/spread_zerosize_1.f90  -O2  (internal compiler error)
FAIL: gfortran.dg/spread_zerosize_1.f90  -O2  (test for excess errors)
UNRESOLVED: gfortran.dg/spread_zerosize_1.f90  -O2  compilation failed to produce executable
FAIL: gfortran.dg/spread_zerosize_1.f90  -O3 -fomit-frame-pointer  (internal compiler error)
FAIL: gfortran.dg/spread_zerosize_1.f90  -O3 -fomit-frame-pointer  (test for excess errors)
UNRESOLVED: gfortran.dg/spread_zerosize_1.f90  -O3 -fomit-frame-pointer  compilation failed to produce executable
FAIL: gfortran.dg/spread_zerosize_1.f90  -O3 -fomit-frame-pointer -funroll-loops  (internal compiler error)
FAIL: gfortran.dg/spread_zerosize_1.f90  -O3 -fomit-frame-pointer -funroll-loops  (test for excess errors)
UNRESOLVED: gfortran.dg/spread_zerosize_1.f90  -O3 -fomit-frame-pointer -funroll-loops  compilation failed to produce executable
FAIL: gfortran.dg/spread_zerosize_1.f90  -O3 -fomit-frame-pointer -funroll-all-loops -finline-functions  (internal compiler error)
FAIL: gfortran.dg/spread_zerosize_1.f90  -O3 -fomit-frame-pointer -funroll-all-loops -finline-functions  (test for excess errors)
UNRESOLVED: gfortran.dg/spread_zerosize_1.f90  -O3 -fomit-frame-pointer -funroll-all-loops -finline-functions  compilation failed to produce executable
FAIL: gfortran.dg/spread_zerosize_1.f90  -O3 -g  (internal compiler error)
FAIL: gfortran.dg/spread_zerosize_1.f90  -O3 -g  (test for excess errors)
UNRESOLVED: gfortran.dg/spread_zerosize_1.f90  -O3 -g  compilation failed to produce executable
FAIL: gfortran.dg/spread_zerosize_1.f90  -Os  (internal compiler error)
FAIL: gfortran.dg/spread_zerosize_1.f90  -Os  (test for excess errors)
UNRESOLVED: gfortran.dg/spread_zerosize_1.f90  -Os  compilation failed to produce executable
FAIL: gfortran.dg/string_compare_1.f90  -O0  execution test
FAIL: gfortran.dg/string_compare_1.f90  -O1  execution test
FAIL: gfortran.dg/string_compare_1.f90  -O2  execution test
FAIL: gfortran.dg/string_compare_1.f90  -O3 -fomit-frame-pointer  execution test
FAIL: gfortran.dg/string_compare_1.f90  -O3 -fomit-frame-pointer -funroll-loops  execution test
FAIL: gfortran.dg/string_compare_1.f90  -O3 -fomit-frame-pointer -funroll-all-loops -finline-functions  execution test
FAIL: gfortran.dg/string_compare_1.f90  -O3 -g  execution test
FAIL: gfortran.dg/string_compare_1.f90  -Os  execution test
FAIL: gfortran.dg/structure_constructor_1.f03  -O0  (test for excess errors)
UNRESOLVED: gfortran.dg/structure_constructor_1.f03  -O0  compilation failed to produce executable
FAIL: gfortran.dg/structure_constructor_1.f03  -O1  (test for excess errors)
UNRESOLVED: gfortran.dg/structure_constructor_1.f03  -O1  compilation failed to produce executable
FAIL: gfortran.dg/structure_constructor_1.f03  -O2  (test for excess errors)
UNRESOLVED: gfortran.dg/structure_constructor_1.f03  -O2  compilation failed to produce executable
FAIL: gfortran.dg/structure_constructor_1.f03  -O3 -fomit-frame-pointer  (test for excess errors)
UNRESOLVED: gfortran.dg/structure_constructor_1.f03  -O3 -fomit-frame-pointer  compilation failed to produce executable
FAIL: gfortran.dg/structure_constructor_1.f03  -O3 -fomit-frame-pointer -funroll-loops  (test for excess errors)
UNRESOLVED: gfortran.dg/structure_constructor_1.f03  -O3 -fomit-frame-pointer -funroll-loops  compilation failed to produce executable
FAIL: gfortran.dg/structure_constructor_1.f03  -O3 -fomit-frame-pointer -funroll-all-loops -finline-functions  (test for excess errors)
UNRESOLVED: gfortran.dg/structure_constructor_1.f03  -O3 -fomit-frame-pointer -funroll-all-loops -finline-functions  compilation failed to produce executable
FAIL: gfortran.dg/structure_constructor_1.f03  -O3 -g  (test for excess errors)
UNRESOLVED: gfortran.dg/structure_constructor_1.f03  -O3 -g  compilation failed to produce executable
FAIL: gfortran.dg/structure_constructor_1.f03  -Os  (test for excess errors)
UNRESOLVED: gfortran.dg/structure_constructor_1.f03  -Os  compilation failed to produce executable
FAIL: gfortran.dg/subref_array_pointer_2.f90  -O0  (test for excess errors)
UNRESOLVED: gfortran.dg/subref_array_pointer_2.f90  -O0  compilation failed to produce executable
FAIL: gfortran.dg/subref_array_pointer_2.f90  -O1  (test for excess errors)
UNRESOLVED: gfortran.dg/subref_array_pointer_2.f90  -O1  compilation failed to produce executable
FAIL: gfortran.dg/subref_array_pointer_2.f90  -O2  (test for excess errors)
UNRESOLVED: gfortran.dg/subref_array_pointer_2.f90  -O2  compilation failed to produce executable
FAIL: gfortran.dg/subref_array_pointer_2.f90  -O3 -fomit-frame-pointer  (test for excess errors)
UNRESOLVED: gfortran.dg/subref_array_pointer_2.f90  -O3 -fomit-frame-pointer  compilation failed to produce executable
FAIL: gfortran.dg/subref_array_pointer_2.f90  -O3 -fomit-frame-pointer -funroll-loops  (test for excess errors)
UNRESOLVED: gfortran.dg/subref_array_pointer_2.f90  -O3 -fomit-frame-pointer -funroll-loops  compilation failed to produce executable
FAIL: gfortran.dg/subref_array_pointer_2.f90  -O3 -fomit-frame-pointer -funroll-all-loops -finline-functions  (test for excess errors)
UNRESOLVED: gfortran.dg/subref_array_pointer_2.f90  -O3 -fomit-frame-pointer -funroll-all-loops -finline-functions  compilation failed to produce executable
FAIL: gfortran.dg/subref_array_pointer_2.f90  -O3 -g  (test for excess errors)
UNRESOLVED: gfortran.dg/subref_array_pointer_2.f90  -O3 -g  compilation failed to produce executable
FAIL: gfortran.dg/subref_array_pointer_2.f90  -Os  (test for excess errors)
UNRESOLVED: gfortran.dg/subref_array_pointer_2.f90  -Os  compilation failed to produce executable
FAIL: gfortran.dg/substr_6.f90  -O0  execution test
FAIL: gfortran.dg/substr_6.f90  -O1  execution test
FAIL: gfortran.dg/substr_6.f90  -O2  execution test
FAIL: gfortran.dg/substr_6.f90  -O3 -fomit-frame-pointer  execution test
FAIL: gfortran.dg/substr_6.f90  -O3 -fomit-frame-pointer -funroll-loops  execution test
FAIL: gfortran.dg/substr_6.f90  -O3 -fomit-frame-pointer -funroll-all-loops -finline-functions  execution test
FAIL: gfortran.dg/substr_6.f90  -O3 -g  execution test
FAIL: gfortran.dg/substr_6.f90  -Os  execution test
FAIL: gfortran.dg/temporary_1.f90  -O0  (test for excess errors)
UNRESOLVED: gfortran.dg/temporary_1.f90  -O0  compilation failed to produce executable
FAIL: gfortran.dg/temporary_1.f90  -O1  (test for excess errors)
UNRESOLVED: gfortran.dg/temporary_1.f90  -O1  compilation failed to produce executable
FAIL: gfortran.dg/temporary_1.f90  -O2  (test for excess errors)
UNRESOLVED: gfortran.dg/temporary_1.f90  -O2  compilation failed to produce executable
FAIL: gfortran.dg/temporary_1.f90  -O3 -fomit-frame-pointer  (test for excess errors)
UNRESOLVED: gfortran.dg/temporary_1.f90  -O3 -fomit-frame-pointer  compilation failed to produce executable
FAIL: gfortran.dg/temporary_1.f90  -O3 -fomit-frame-pointer -funroll-loops  (test for excess errors)
UNRESOLVED: gfortran.dg/temporary_1.f90  -O3 -fomit-frame-pointer -funroll-loops  compilation failed to produce executable
FAIL: gfortran.dg/temporary_1.f90  -O3 -fomit-frame-pointer -funroll-all-loops -finline-functions  (test for excess errors)
UNRESOLVED: gfortran.dg/temporary_1.f90  -O3 -fomit-frame-pointer -funroll-all-loops -finline-functions  compilation failed to produce executable
FAIL: gfortran.dg/temporary_1.f90  -O3 -g  (test for excess errors)
UNRESOLVED: gfortran.dg/temporary_1.f90  -O3 -g  compilation failed to produce executable
FAIL: gfortran.dg/temporary_1.f90  -Os  (test for excess errors)
UNRESOLVED: gfortran.dg/temporary_1.f90  -Os  compilation failed to produce executable
FAIL: gfortran.dg/transfer_check_1.f90  -O   (test for warnings, line 5)
FAIL: gfortran.dg/transfer_check_1.f90  -O  (test for excess errors)
FAIL: gfortran.dg/transfer_simplify_1.f90  -O0  execution test
FAIL: gfortran.dg/transfer_simplify_1.f90  -O1  execution test
FAIL: gfortran.dg/transfer_simplify_1.f90  -O2  execution test
FAIL: gfortran.dg/transfer_simplify_1.f90  -O3 -fomit-frame-pointer  execution test
FAIL: gfortran.dg/transfer_simplify_1.f90  -O3 -fomit-frame-pointer -funroll-loops  execution test
FAIL: gfortran.dg/transfer_simplify_1.f90  -O3 -fomit-frame-pointer -funroll-all-loops -finline-functions  execution test
FAIL: gfortran.dg/transfer_simplify_1.f90  -O3 -g  execution test
FAIL: gfortran.dg/transfer_simplify_1.f90  -Os  execution test
FAIL: gfortran.dg/transfer_simplify_2.f90  -O0  (test for excess errors)
UNRESOLVED: gfortran.dg/transfer_simplify_2.f90  -O0  compilation failed to produce executable
FAIL: gfortran.dg/transfer_simplify_2.f90  -O1  (test for excess errors)
UNRESOLVED: gfortran.dg/transfer_simplify_2.f90  -O1  compilation failed to produce executable
FAIL: gfortran.dg/transfer_simplify_2.f90  -O2  (test for excess errors)
UNRESOLVED: gfortran.dg/transfer_simplify_2.f90  -O2  compilation failed to produce executable
FAIL: gfortran.dg/transfer_simplify_2.f90  -O3 -fomit-frame-pointer  (test for excess errors)
UNRESOLVED: gfortran.dg/transfer_simplify_2.f90  -O3 -fomit-frame-pointer  compilation failed to produce executable
FAIL: gfortran.dg/transfer_simplify_2.f90  -O3 -fomit-frame-pointer -funroll-loops  (test for excess errors)
UNRESOLVED: gfortran.dg/transfer_simplify_2.f90  -O3 -fomit-frame-pointer -funroll-loops  compilation failed to produce executable
FAIL: gfortran.dg/transfer_simplify_2.f90  -O3 -fomit-frame-pointer -funroll-all-loops -finline-functions  (test for excess errors)
UNRESOLVED: gfortran.dg/transfer_simplify_2.f90  -O3 -fomit-frame-pointer -funroll-all-loops -finline-functions  compilation failed to produce executable
FAIL: gfortran.dg/transfer_simplify_2.f90  -O3 -g  (test for excess errors)
UNRESOLVED: gfortran.dg/transfer_simplify_2.f90  -O3 -g  compilation failed to produce executable
FAIL: gfortran.dg/transfer_simplify_2.f90  -Os  (test for excess errors)
UNRESOLVED: gfortran.dg/transfer_simplify_2.f90  -Os  compilation failed to produce executable
FAIL: gfortran.dg/transfer_simplify_9.f90  -O0  (internal compiler error)
FAIL: gfortran.dg/transfer_simplify_9.f90  -O0  (test for excess errors)
UNRESOLVED: gfortran.dg/transfer_simplify_9.f90  -O0  compilation failed to produce executable
FAIL: gfortran.dg/transfer_simplify_9.f90  -O1  (internal compiler error)
FAIL: gfortran.dg/transfer_simplify_9.f90  -O1  (test for excess errors)
UNRESOLVED: gfortran.dg/transfer_simplify_9.f90  -O1  compilation failed to produce executable
FAIL: gfortran.dg/transfer_simplify_9.f90  -O2  (internal compiler error)
FAIL: gfortran.dg/transfer_simplify_9.f90  -O2  (test for excess errors)
UNRESOLVED: gfortran.dg/transfer_simplify_9.f90  -O2  compilation failed to produce executable
FAIL: gfortran.dg/transfer_simplify_9.f90  -O3 -fomit-frame-pointer  (internal compiler error)
FAIL: gfortran.dg/transfer_simplify_9.f90  -O3 -fomit-frame-pointer  (test for excess errors)
UNRESOLVED: gfortran.dg/transfer_simplify_9.f90  -O3 -fomit-frame-pointer  compilation failed to produce executable
FAIL: gfortran.dg/transfer_simplify_9.f90  -O3 -fomit-frame-pointer -funroll-loops  (internal compiler error)
FAIL: gfortran.dg/transfer_simplify_9.f90  -O3 -fomit-frame-pointer -funroll-loops  (test for excess errors)
UNRESOLVED: gfortran.dg/transfer_simplify_9.f90  -O3 -fomit-frame-pointer -funroll-loops  compilation failed to produce executable
FAIL: gfortran.dg/transfer_simplify_9.f90  -O3 -fomit-frame-pointer -funroll-all-loops -finline-functions  (internal compiler error)
FAIL: gfortran.dg/transfer_simplify_9.f90  -O3 -fomit-frame-pointer -funroll-all-loops -finline-functions  (test for excess errors)
UNRESOLVED: gfortran.dg/transfer_simplify_9.f90  -O3 -fomit-frame-pointer -funroll-all-loops -finline-functions  compilation failed to produce executable
FAIL: gfortran.dg/transfer_simplify_9.f90  -O3 -g  (internal compiler error)
FAIL: gfortran.dg/transfer_simplify_9.f90  -O3 -g  (test for excess errors)
UNRESOLVED: gfortran.dg/transfer_simplify_9.f90  -O3 -g  compilation failed to produce executable
FAIL: gfortran.dg/transfer_simplify_9.f90  -Os  (internal compiler error)
FAIL: gfortran.dg/transfer_simplify_9.f90  -Os  (test for excess errors)
UNRESOLVED: gfortran.dg/transfer_simplify_9.f90  -Os  compilation failed to produce executable
FAIL: gfortran.dg/use_only_3.f90  -O  (test for excess errors)
FAIL: gfortran.dg/used_dummy_types_2.f90  -O  (test for excess errors)
FAIL: gfortran.dg/utf8_2.f03  -O0  execution test
FAIL: gfortran.dg/utf8_2.f03  -O1  execution test
FAIL: gfortran.dg/utf8_2.f03  -O2  execution test
FAIL: gfortran.dg/utf8_2.f03  -O3 -fomit-frame-pointer  execution test
FAIL: gfortran.dg/utf8_2.f03  -O3 -fomit-frame-pointer -funroll-loops  execution test
FAIL: gfortran.dg/utf8_2.f03  -O3 -fomit-frame-pointer -funroll-all-loops -finline-functions  execution test
FAIL: gfortran.dg/utf8_2.f03  -O3 -g  execution test
FAIL: gfortran.dg/utf8_2.f03  -Os  execution test
FAIL: gfortran.dg/vector_subscript_1.f90  -O0  (test for excess errors)
UNRESOLVED: gfortran.dg/vector_subscript_1.f90  -O0  compilation failed to produce executable
FAIL: gfortran.dg/vector_subscript_1.f90  -O1  (test for excess errors)
UNRESOLVED: gfortran.dg/vector_subscript_1.f90  -O1  compilation failed to produce executable
FAIL: gfortran.dg/vector_subscript_1.f90  -O2  (test for excess errors)
UNRESOLVED: gfortran.dg/vector_subscript_1.f90  -O2  compilation failed to produce executable
FAIL: gfortran.dg/vector_subscript_1.f90  -O3 -fomit-frame-pointer  (test for excess errors)
UNRESOLVED: gfortran.dg/vector_subscript_1.f90  -O3 -fomit-frame-pointer  compilation failed to produce executable
FAIL: gfortran.dg/vector_subscript_1.f90  -O3 -fomit-frame-pointer -funroll-loops  (test for excess errors)
UNRESOLVED: gfortran.dg/vector_subscript_1.f90  -O3 -fomit-frame-pointer -funroll-loops  compilation failed to produce executable
FAIL: gfortran.dg/vector_subscript_1.f90  -O3 -fomit-frame-pointer -funroll-all-loops -finline-functions  (test for excess errors)
UNRESOLVED: gfortran.dg/vector_subscript_1.f90  -O3 -fomit-frame-pointer -funroll-all-loops -finline-functions  compilation failed to produce executable
FAIL: gfortran.dg/vector_subscript_1.f90  -O3 -g  (test for excess errors)
UNRESOLVED: gfortran.dg/vector_subscript_1.f90  -O3 -g  compilation failed to produce executable
FAIL: gfortran.dg/vector_subscript_1.f90  -Os  (test for excess errors)
UNRESOLVED: gfortran.dg/vector_subscript_1.f90  -Os  compilation failed to produce executable
FAIL: gfortran.dg/widechar_5.f90  -O0  (test for excess errors)
UNRESOLVED: gfortran.dg/widechar_5.f90  -O0  compilation failed to produce executable
FAIL: gfortran.dg/widechar_5.f90  -O1  (test for excess errors)
UNRESOLVED: gfortran.dg/widechar_5.f90  -O1  compilation failed to produce executable
FAIL: gfortran.dg/widechar_5.f90  -O2  (test for excess errors)
UNRESOLVED: gfortran.dg/widechar_5.f90  -O2  compilation failed to produce executable
FAIL: gfortran.dg/widechar_5.f90  -O3 -fomit-frame-pointer  (test for excess errors)
UNRESOLVED: gfortran.dg/widechar_5.f90  -O3 -fomit-frame-pointer  compilation failed to produce executable
FAIL: gfortran.dg/widechar_5.f90  -O3 -fomit-frame-pointer -funroll-loops  (test for excess errors)
UNRESOLVED: gfortran.dg/widechar_5.f90  -O3 -fomit-frame-pointer -funroll-loops  compilation failed to produce executable
FAIL: gfortran.dg/widechar_5.f90  -O3 -fomit-frame-pointer -funroll-all-loops -finline-functions  (test for excess errors)
UNRESOLVED: gfortran.dg/widechar_5.f90  -O3 -fomit-frame-pointer -funroll-all-loops -finline-functions  compilation failed to produce executable
FAIL: gfortran.dg/widechar_5.f90  -O3 -g  (test for excess errors)
UNRESOLVED: gfortran.dg/widechar_5.f90  -O3 -g  compilation failed to produce executable
FAIL: gfortran.dg/widechar_5.f90  -Os  (test for excess errors)
UNRESOLVED: gfortran.dg/widechar_5.f90  -Os  compilation failed to produce executable
FAIL: gfortran.dg/widechar_8.f90  -O0  (test for excess errors)
UNRESOLVED: gfortran.dg/widechar_8.f90  -O0  compilation failed to produce executable
FAIL: gfortran.dg/widechar_8.f90  -O1  (test for excess errors)
UNRESOLVED: gfortran.dg/widechar_8.f90  -O1  compilation failed to produce executable
FAIL: gfortran.dg/widechar_8.f90  -O2  (test for excess errors)
UNRESOLVED: gfortran.dg/widechar_8.f90  -O2  compilation failed to produce executable
FAIL: gfortran.dg/widechar_8.f90  -O3 -fomit-frame-pointer  (test for excess errors)
UNRESOLVED: gfortran.dg/widechar_8.f90  -O3 -fomit-frame-pointer  compilation failed to produce executable
FAIL: gfortran.dg/widechar_8.f90  -O3 -fomit-frame-pointer -funroll-loops  (test for excess errors)
UNRESOLVED: gfortran.dg/widechar_8.f90  -O3 -fomit-frame-pointer -funroll-loops  compilation failed to produce executable
FAIL: gfortran.dg/widechar_8.f90  -O3 -fomit-frame-pointer -funroll-all-loops -finline-functions  (test for excess errors)
UNRESOLVED: gfortran.dg/widechar_8.f90  -O3 -fomit-frame-pointer -funroll-all-loops -finline-functions  compilation failed to produce executable
FAIL: gfortran.dg/widechar_8.f90  -O3 -g  (test for excess errors)
UNRESOLVED: gfortran.dg/widechar_8.f90  -O3 -g  compilation failed to produce executable
FAIL: gfortran.dg/widechar_8.f90  -Os  (test for excess errors)
UNRESOLVED: gfortran.dg/widechar_8.f90  -Os  compilation failed to produce executable
FAIL: gfortran.dg/widechar_intrinsics_5.f90  -O0  (test for excess errors)
UNRESOLVED: gfortran.dg/widechar_intrinsics_5.f90  -O0  compilation failed to produce executable
FAIL: gfortran.dg/widechar_intrinsics_5.f90  -O1  (test for excess errors)
UNRESOLVED: gfortran.dg/widechar_intrinsics_5.f90  -O1  compilation failed to produce executable
FAIL: gfortran.dg/widechar_intrinsics_5.f90  -O2  (test for excess errors)
UNRESOLVED: gfortran.dg/widechar_intrinsics_5.f90  -O2  compilation failed to produce executable
FAIL: gfortran.dg/widechar_intrinsics_5.f90  -O3 -fomit-frame-pointer  (test for excess errors)
UNRESOLVED: gfortran.dg/widechar_intrinsics_5.f90  -O3 -fomit-frame-pointer  compilation failed to produce executable
FAIL: gfortran.dg/widechar_intrinsics_5.f90  -O3 -fomit-frame-pointer -funroll-loops  (test for excess errors)
UNRESOLVED: gfortran.dg/widechar_intrinsics_5.f90  -O3 -fomit-frame-pointer -funroll-loops  compilation failed to produce executable
FAIL: gfortran.dg/widechar_intrinsics_5.f90  -O3 -fomit-frame-pointer -funroll-all-loops -finline-functions  (test for excess errors)
UNRESOLVED: gfortran.dg/widechar_intrinsics_5.f90  -O3 -fomit-frame-pointer -funroll-all-loops -finline-functions  compilation failed to produce executable
FAIL: gfortran.dg/widechar_intrinsics_5.f90  -O3 -g  (test for excess errors)
UNRESOLVED: gfortran.dg/widechar_intrinsics_5.f90  -O3 -g  compilation failed to produce executable
FAIL: gfortran.dg/widechar_intrinsics_5.f90  -Os  (test for excess errors)
UNRESOLVED: gfortran.dg/widechar_intrinsics_5.f90  -Os  compilation failed to produce executable
FAIL: gfortran.dg/zero_sized_1.f90  -O0  (internal compiler error)
FAIL: gfortran.dg/zero_sized_1.f90  -O0  (test for excess errors)
UNRESOLVED: gfortran.dg/zero_sized_1.f90  -O0  compilation failed to produce executable
FAIL: gfortran.dg/zero_sized_1.f90  -O1  (internal compiler error)
FAIL: gfortran.dg/zero_sized_1.f90  -O1  (test for excess errors)
UNRESOLVED: gfortran.dg/zero_sized_1.f90  -O1  compilation failed to produce executable
FAIL: gfortran.dg/zero_sized_1.f90  -O2  (internal compiler error)
FAIL: gfortran.dg/zero_sized_1.f90  -O2  (test for excess errors)
UNRESOLVED: gfortran.dg/zero_sized_1.f90  -O2  compilation failed to produce executable
FAIL: gfortran.dg/zero_sized_1.f90  -O3 -fomit-frame-pointer  (internal compiler error)
FAIL: gfortran.dg/zero_sized_1.f90  -O3 -fomit-frame-pointer  (test for excess errors)
UNRESOLVED: gfortran.dg/zero_sized_1.f90  -O3 -fomit-frame-pointer  compilation failed to produce executable
FAIL: gfortran.dg/zero_sized_1.f90  -O3 -fomit-frame-pointer -funroll-loops  (internal compiler error)
FAIL: gfortran.dg/zero_sized_1.f90  -O3 -fomit-frame-pointer -funroll-loops  (test for excess errors)
UNRESOLVED: gfortran.dg/zero_sized_1.f90  -O3 -fomit-frame-pointer -funroll-loops  compilation failed to produce executable
FAIL: gfortran.dg/zero_sized_1.f90  -O3 -fomit-frame-pointer -funroll-all-loops -finline-functions  (internal compiler error)
FAIL: gfortran.dg/zero_sized_1.f90  -O3 -fomit-frame-pointer -funroll-all-loops -finline-functions  (test for excess errors)
UNRESOLVED: gfortran.dg/zero_sized_1.f90  -O3 -fomit-frame-pointer -funroll-all-loops -finline-functions  compilation failed to produce executable
FAIL: gfortran.dg/zero_sized_1.f90  -O3 -g  (internal compiler error)
FAIL: gfortran.dg/zero_sized_1.f90  -O3 -g  (test for excess errors)
UNRESOLVED: gfortran.dg/zero_sized_1.f90  -O3 -g  compilation failed to produce executable
FAIL: gfortran.dg/zero_sized_1.f90  -Os  (internal compiler error)
FAIL: gfortran.dg/zero_sized_1.f90  -Os  (test for excess errors)
UNRESOLVED: gfortran.dg/zero_sized_1.f90  -Os  compilation failed to produce executable
FAIL: gfortran.dg/g77/980628-0.f  -O0  execution test
FAIL: gfortran.dg/g77/980628-0.f  -O1  execution test
FAIL: gfortran.dg/g77/980628-0.f  -O2  execution test
FAIL: gfortran.dg/g77/980628-0.f  -O3 -fomit-frame-pointer  execution test
FAIL: gfortran.dg/g77/980628-0.f  -O3 -fomit-frame-pointer -funroll-loops  execution test
FAIL: gfortran.dg/g77/980628-0.f  -O3 -fomit-frame-pointer -funroll-all-loops -finline-functions  execution test
FAIL: gfortran.dg/g77/980628-0.f  -O3 -g  execution test
FAIL: gfortran.dg/g77/980628-0.f  -Os  execution test
FAIL: gfortran.dg/g77/980628-1.f  -O0  execution test
FAIL: gfortran.dg/g77/980628-1.f  -O1  execution test
FAIL: gfortran.dg/g77/980628-1.f  -O2  execution test
FAIL: gfortran.dg/g77/980628-1.f  -O3 -fomit-frame-pointer  execution test
FAIL: gfortran.dg/g77/980628-1.f  -O3 -fomit-frame-pointer -funroll-loops  execution test
FAIL: gfortran.dg/g77/980628-1.f  -O3 -fomit-frame-pointer -funroll-all-loops -finline-functions  execution test
FAIL: gfortran.dg/g77/980628-1.f  -O3 -g  execution test
FAIL: gfortran.dg/g77/980628-1.f  -Os  execution test
FAIL: gfortran.dg/g77/980628-10.f  -O0  execution test
FAIL: gfortran.dg/g77/980628-10.f  -O1  execution test
FAIL: gfortran.dg/g77/980628-10.f  -O2  execution test
FAIL: gfortran.dg/g77/980628-10.f  -O3 -fomit-frame-pointer  execution test
FAIL: gfortran.dg/g77/980628-10.f  -O3 -fomit-frame-pointer -funroll-loops  execution test
FAIL: gfortran.dg/g77/980628-10.f  -O3 -fomit-frame-pointer -funroll-all-loops -finline-functions  execution test
FAIL: gfortran.dg/g77/980628-10.f  -O3 -g  execution test
FAIL: gfortran.dg/g77/980628-10.f  -Os  execution test
FAIL: gfortran.dg/g77/980628-2.f  -O0  execution test
FAIL: gfortran.dg/g77/980628-2.f  -O1  execution test
FAIL: gfortran.dg/g77/980628-2.f  -O2  execution test
FAIL: gfortran.dg/g77/980628-2.f  -O3 -fomit-frame-pointer  execution test
FAIL: gfortran.dg/g77/980628-2.f  -O3 -fomit-frame-pointer -funroll-loops  execution test
FAIL: gfortran.dg/g77/980628-2.f  -O3 -fomit-frame-pointer -funroll-all-loops -finline-functions  execution test
FAIL: gfortran.dg/g77/980628-2.f  -O3 -g  execution test
FAIL: gfortran.dg/g77/980628-2.f  -Os  execution test
FAIL: gfortran.dg/g77/980628-3.f  -O0  execution test
FAIL: gfortran.dg/g77/980628-3.f  -O1  execution test
FAIL: gfortran.dg/g77/980628-3.f  -O2  execution test
FAIL: gfortran.dg/g77/980628-3.f  -O3 -fomit-frame-pointer  execution test
FAIL: gfortran.dg/g77/980628-3.f  -O3 -fomit-frame-pointer -funroll-loops  execution test
FAIL: gfortran.dg/g77/980628-3.f  -O3 -fomit-frame-pointer -funroll-all-loops -finline-functions  execution test
FAIL: gfortran.dg/g77/980628-3.f  -O3 -g  execution test
FAIL: gfortran.dg/g77/980628-3.f  -Os  execution test
FAIL: gfortran.dg/g77/980628-7.f  -O0  execution test
FAIL: gfortran.dg/g77/980628-7.f  -O1  execution test
FAIL: gfortran.dg/g77/980628-7.f  -O2  execution test
FAIL: gfortran.dg/g77/980628-7.f  -O3 -fomit-frame-pointer  execution test
FAIL: gfortran.dg/g77/980628-7.f  -O3 -fomit-frame-pointer -funroll-loops  execution test
FAIL: gfortran.dg/g77/980628-7.f  -O3 -fomit-frame-pointer -funroll-all-loops -finline-functions  execution test
FAIL: gfortran.dg/g77/980628-7.f  -O3 -g  execution test
FAIL: gfortran.dg/g77/980628-7.f  -Os  execution test
FAIL: gfortran.dg/g77/980628-8.f  -O0  execution test
FAIL: gfortran.dg/g77/980628-8.f  -O1  execution test
FAIL: gfortran.dg/g77/980628-8.f  -O2  execution test
FAIL: gfortran.dg/g77/980628-8.f  -O3 -fomit-frame-pointer  execution test
FAIL: gfortran.dg/g77/980628-8.f  -O3 -fomit-frame-pointer -funroll-loops  execution test
FAIL: gfortran.dg/g77/980628-8.f  -O3 -fomit-frame-pointer -funroll-all-loops -finline-functions  execution test
FAIL: gfortran.dg/g77/980628-8.f  -O3 -g  execution test
FAIL: gfortran.dg/g77/980628-8.f  -Os  execution test
FAIL: gfortran.dg/g77/980628-9.f  -O0  execution test
FAIL: gfortran.dg/g77/980628-9.f  -O1  execution test
FAIL: gfortran.dg/g77/980628-9.f  -O2  execution test
FAIL: gfortran.dg/g77/980628-9.f  -O3 -fomit-frame-pointer  execution test
FAIL: gfortran.dg/g77/980628-9.f  -O3 -fomit-frame-pointer -funroll-loops  execution test
FAIL: gfortran.dg/g77/980628-9.f  -O3 -fomit-frame-pointer -funroll-all-loops -finline-functions  execution test
FAIL: gfortran.dg/g77/980628-9.f  -O3 -g  execution test
FAIL: gfortran.dg/g77/980628-9.f  -Os  execution test
FAIL: gfortran.dg/g77/980701-0.f  -O0  execution test
FAIL: gfortran.dg/g77/980701-0.f  -O1  execution test
FAIL: gfortran.dg/g77/980701-0.f  -O2  execution test
FAIL: gfortran.dg/g77/980701-0.f  -O3 -fomit-frame-pointer  execution test
FAIL: gfortran.dg/g77/980701-0.f  -O3 -fomit-frame-pointer -funroll-loops  execution test
FAIL: gfortran.dg/g77/980701-0.f  -O3 -fomit-frame-pointer -funroll-all-loops -finline-functions  execution test
FAIL: gfortran.dg/g77/980701-0.f  -O3 -g  execution test
FAIL: gfortran.dg/g77/980701-0.f  -Os  execution test
FAIL: gfortran.dg/g77/980701-1.f  -O0  execution test
FAIL: gfortran.dg/g77/980701-1.f  -O1  execution test
FAIL: gfortran.dg/g77/980701-1.f  -O2  execution test
FAIL: gfortran.dg/g77/980701-1.f  -O3 -fomit-frame-pointer  execution test
FAIL: gfortran.dg/g77/980701-1.f  -O3 -fomit-frame-pointer -funroll-loops  execution test
FAIL: gfortran.dg/g77/980701-1.f  -O3 -fomit-frame-pointer -funroll-all-loops -finline-functions  execution test
FAIL: gfortran.dg/g77/980701-1.f  -O3 -g  execution test
FAIL: gfortran.dg/g77/980701-1.f  -Os  execution test
FAIL: gfortran.fortran-torture/compile/20080806-1.f90,  -O0  
FAIL: gfortran.fortran-torture/compile/20080806-1.f90,  -O1  
FAIL: gfortran.fortran-torture/compile/20080806-1.f90,  -O2  
FAIL: gfortran.fortran-torture/compile/20080806-1.f90,  -O2 -fomit-frame-pointer -finline-functions  
FAIL: gfortran.fortran-torture/compile/20080806-1.f90,  -O2 -fomit-frame-pointer -finline-functions -funroll-loops  
FAIL: gfortran.fortran-torture/compile/20080806-1.f90,  -O2 -fbounds-check  
FAIL: gfortran.fortran-torture/compile/20080806-1.f90,  -O3 -g  
FAIL: gfortran.fortran-torture/compile/20080806-1.f90,  -Os  
FAIL: gfortran.fortran-torture/compile/pr36078.f90,  -O0   (internal compiler error)
FAIL: gfortran.fortran-torture/compile/pr36078.f90,  -O1   (internal compiler error)
FAIL: gfortran.fortran-torture/compile/pr36078.f90,  -O2   (internal compiler error)
FAIL: gfortran.fortran-torture/compile/pr36078.f90,  -O2 -fomit-frame-pointer -finline-functions   (internal compiler error)
FAIL: gfortran.fortran-torture/compile/pr36078.f90,  -O2 -fomit-frame-pointer -finline-functions -funroll-loops   (internal compiler error)
FAIL: gfortran.fortran-torture/compile/pr36078.f90,  -O2 -fbounds-check   (internal compiler error)
FAIL: gfortran.fortran-torture/compile/pr36078.f90,  -O3 -g   (internal compiler error)
FAIL: gfortran.fortran-torture/compile/pr36078.f90,  -Os   (internal compiler error)
FAIL: gfortran.fortran-torture/compile/shape_reshape.f90,  -O0  
FAIL: gfortran.fortran-torture/compile/shape_reshape.f90,  -O1  
FAIL: gfortran.fortran-torture/compile/shape_reshape.f90,  -O2  
FAIL: gfortran.fortran-torture/compile/shape_reshape.f90,  -O2 -fomit-frame-pointer -finline-functions  
FAIL: gfortran.fortran-torture/compile/shape_reshape.f90,  -O2 -fomit-frame-pointer -finline-functions -funroll-loops  
FAIL: gfortran.fortran-torture/compile/shape_reshape.f90,  -O2 -fbounds-check  
FAIL: gfortran.fortran-torture/compile/shape_reshape.f90,  -O3 -g  
FAIL: gfortran.fortran-torture/compile/shape_reshape.f90,  -Os  
FAIL: gfortran.fortran-torture/execute/assumed_size.f90 compilation,  -O0 
FAIL: gfortran.fortran-torture/execute/assumed_size.f90 compilation,  -O1 
FAIL: gfortran.fortran-torture/execute/assumed_size.f90 compilation,  -O2 
FAIL: gfortran.fortran-torture/execute/assumed_size.f90 compilation,  -O2 -fomit-frame-pointer -finline-functions 
FAIL: gfortran.fortran-torture/execute/assumed_size.f90 compilation,  -O2 -fomit-frame-pointer -finline-functions -funroll-loops 
FAIL: gfortran.fortran-torture/execute/assumed_size.f90 compilation,  -O2 -fbounds-check 
FAIL: gfortran.fortran-torture/execute/assumed_size.f90 compilation,  -O3 -g 
FAIL: gfortran.fortran-torture/execute/assumed_size.f90 compilation,  -Os 
FAIL: gfortran.fortran-torture/execute/common.f90 execution,  -O0 
FAIL: gfortran.fortran-torture/execute/common.f90 execution,  -O1 
FAIL: gfortran.fortran-torture/execute/common.f90 execution,  -O2 
FAIL: gfortran.fortran-torture/execute/common.f90 execution,  -O2 -fomit-frame-pointer -finline-functions 
FAIL: gfortran.fortran-torture/execute/common.f90 execution,  -O2 -fomit-frame-pointer -finline-functions -funroll-loops 
FAIL: gfortran.fortran-torture/execute/common.f90 execution,  -O2 -fbounds-check 
FAIL: gfortran.fortran-torture/execute/common.f90 execution,  -O3 -g 
FAIL: gfortran.fortran-torture/execute/common.f90 execution,  -Os 
FAIL: gfortran.fortran-torture/execute/common_size.f90 execution,  -O0 
FAIL: gfortran.fortran-torture/execute/common_size.f90 execution,  -O1 
FAIL: gfortran.fortran-torture/execute/common_size.f90 execution,  -O2 
FAIL: gfortran.fortran-torture/execute/common_size.f90 execution,  -O2 -fomit-frame-pointer -finline-functions 
FAIL: gfortran.fortran-torture/execute/common_size.f90 execution,  -O2 -fomit-frame-pointer -finline-functions -funroll-loops 
FAIL: gfortran.fortran-torture/execute/common_size.f90 execution,  -O2 -fbounds-check 
FAIL: gfortran.fortran-torture/execute/common_size.f90 execution,  -O3 -g 
FAIL: gfortran.fortran-torture/execute/common_size.f90 execution,  -Os 
FAIL: gfortran.fortran-torture/execute/constructor.f90 compilation,  -O0 
FAIL: gfortran.fortran-torture/execute/constructor.f90 compilation,  -O1 
FAIL: gfortran.fortran-torture/execute/constructor.f90 compilation,  -O2 
FAIL: gfortran.fortran-torture/execute/constructor.f90 compilation,  -O2 -fomit-frame-pointer -finline-functions 
FAIL: gfortran.fortran-torture/execute/constructor.f90 compilation,  -O2 -fomit-frame-pointer -finline-functions -funroll-loops 
FAIL: gfortran.fortran-torture/execute/constructor.f90 compilation,  -O2 -fbounds-check 
FAIL: gfortran.fortran-torture/execute/constructor.f90 compilation,  -O3 -g 
FAIL: gfortran.fortran-torture/execute/constructor.f90 compilation,  -Os 
FAIL: gfortran.fortran-torture/execute/data.f90 compilation,  -O0 
FAIL: gfortran.fortran-torture/execute/data.f90 compilation,  -O1 
FAIL: gfortran.fortran-torture/execute/data.f90 compilation,  -O2 
FAIL: gfortran.fortran-torture/execute/data.f90 compilation,  -O2 -fomit-frame-pointer -finline-functions 
FAIL: gfortran.fortran-torture/execute/data.f90 compilation,  -O2 -fomit-frame-pointer -finline-functions -funroll-loops 
FAIL: gfortran.fortran-torture/execute/data.f90 compilation,  -O2 -fbounds-check 
FAIL: gfortran.fortran-torture/execute/data.f90 compilation,  -O3 -g 
FAIL: gfortran.fortran-torture/execute/data.f90 compilation,  -Os 
FAIL: gfortran.fortran-torture/execute/dep_fails.f90 compilation,  -O0 
FAIL: gfortran.fortran-torture/execute/dep_fails.f90 compilation,  -O1 
FAIL: gfortran.fortran-torture/execute/dep_fails.f90 compilation,  -O2 
FAIL: gfortran.fortran-torture/execute/dep_fails.f90 compilation,  -O2 -fomit-frame-pointer -finline-functions 
FAIL: gfortran.fortran-torture/execute/dep_fails.f90 compilation,  -O2 -fomit-frame-pointer -finline-functions -funroll-loops 
FAIL: gfortran.fortran-torture/execute/dep_fails.f90 compilation,  -O2 -fbounds-check 
FAIL: gfortran.fortran-torture/execute/dep_fails.f90 compilation,  -O3 -g 
FAIL: gfortran.fortran-torture/execute/dep_fails.f90 compilation,  -Os 
FAIL: gfortran.fortran-torture/execute/elemental.f90 compilation,  -O0 
FAIL: gfortran.fortran-torture/execute/elemental.f90 compilation,  -O1 
FAIL: gfortran.fortran-torture/execute/elemental.f90 compilation,  -O2 
FAIL: gfortran.fortran-torture/execute/elemental.f90 compilation,  -O2 -fomit-frame-pointer -finline-functions 
FAIL: gfortran.fortran-torture/execute/elemental.f90 compilation,  -O2 -fomit-frame-pointer -finline-functions -funroll-loops 
FAIL: gfortran.fortran-torture/execute/elemental.f90 compilation,  -O2 -fbounds-check 
FAIL: gfortran.fortran-torture/execute/elemental.f90 compilation,  -O3 -g 
FAIL: gfortran.fortran-torture/execute/elemental.f90 compilation,  -Os 
FAIL: gfortran.fortran-torture/execute/equiv_2.f90 execution,  -O0 
FAIL: gfortran.fortran-torture/execute/equiv_2.f90 execution,  -O1 
FAIL: gfortran.fortran-torture/execute/equiv_2.f90 execution,  -O2 
FAIL: gfortran.fortran-torture/execute/equiv_2.f90 execution,  -O2 -fomit-frame-pointer -finline-functions 
FAIL: gfortran.fortran-torture/execute/equiv_2.f90 execution,  -O2 -fomit-frame-pointer -finline-functions -funroll-loops 
FAIL: gfortran.fortran-torture/execute/equiv_2.f90 execution,  -O2 -fbounds-check 
FAIL: gfortran.fortran-torture/execute/equiv_2.f90 execution,  -O3 -g 
FAIL: gfortran.fortran-torture/execute/equiv_2.f90 execution,  -Os 
FAIL: gfortran.fortran-torture/execute/equiv_4.f90 execution,  -O0 
FAIL: gfortran.fortran-torture/execute/equiv_4.f90 execution,  -O1 
FAIL: gfortran.fortran-torture/execute/equiv_4.f90 execution,  -O2 
FAIL: gfortran.fortran-torture/execute/equiv_4.f90 execution,  -O2 -fomit-frame-pointer -finline-functions 
FAIL: gfortran.fortran-torture/execute/equiv_4.f90 execution,  -O2 -fomit-frame-pointer -finline-functions -funroll-loops 
FAIL: gfortran.fortran-torture/execute/equiv_4.f90 execution,  -O2 -fbounds-check 
FAIL: gfortran.fortran-torture/execute/equiv_4.f90 execution,  -O3 -g 
FAIL: gfortran.fortran-torture/execute/equiv_4.f90 execution,  -Os 
FAIL: gfortran.fortran-torture/execute/equiv_init_1.f90 compilation,  -O0 
FAIL: gfortran.fortran-torture/execute/equiv_init_1.f90 compilation,  -O1 
FAIL: gfortran.fortran-torture/execute/equiv_init_1.f90 compilation,  -O2 
FAIL: gfortran.fortran-torture/execute/equiv_init_1.f90 compilation,  -O2 -fomit-frame-pointer -finline-functions 
FAIL: gfortran.fortran-torture/execute/equiv_init_1.f90 compilation,  -O2 -fomit-frame-pointer -finline-functions -funroll-loops 
FAIL: gfortran.fortran-torture/execute/equiv_init_1.f90 compilation,  -O2 -fbounds-check 
FAIL: gfortran.fortran-torture/execute/equiv_init_1.f90 compilation,  -O3 -g 
FAIL: gfortran.fortran-torture/execute/equiv_init_1.f90 compilation,  -Os 
FAIL: gfortran.fortran-torture/execute/forall.f90 compilation,  -O0 
FAIL: gfortran.fortran-torture/execute/forall.f90 compilation,  -O1 
FAIL: gfortran.fortran-torture/execute/forall.f90 compilation,  -O2 
FAIL: gfortran.fortran-torture/execute/forall.f90 compilation,  -O2 -fomit-frame-pointer -finline-functions 
FAIL: gfortran.fortran-torture/execute/forall.f90 compilation,  -O2 -fomit-frame-pointer -finline-functions -funroll-loops 
FAIL: gfortran.fortran-torture/execute/forall.f90 compilation,  -O2 -fbounds-check 
FAIL: gfortran.fortran-torture/execute/forall.f90 compilation,  -O3 -g 
FAIL: gfortran.fortran-torture/execute/forall.f90 compilation,  -Os 
FAIL: gfortran.fortran-torture/execute/forall_1.f90 compilation,  -O0 
FAIL: gfortran.fortran-torture/execute/forall_1.f90 compilation,  -O1 
FAIL: gfortran.fortran-torture/execute/forall_1.f90 compilation,  -O2 
FAIL: gfortran.fortran-torture/execute/forall_1.f90 compilation,  -O2 -fomit-frame-pointer -finline-functions 
FAIL: gfortran.fortran-torture/execute/forall_1.f90 compilation,  -O2 -fomit-frame-pointer -finline-functions -funroll-loops 
FAIL: gfortran.fortran-torture/execute/forall_1.f90 compilation,  -O2 -fbounds-check 
FAIL: gfortran.fortran-torture/execute/forall_1.f90 compilation,  -O3 -g 
FAIL: gfortran.fortran-torture/execute/forall_1.f90 compilation,  -Os 
FAIL: gfortran.fortran-torture/execute/forall_2.f90 compilation,  -O0 
FAIL: gfortran.fortran-torture/execute/forall_2.f90 compilation,  -O1 
FAIL: gfortran.fortran-torture/execute/forall_2.f90 compilation,  -O2 
FAIL: gfortran.fortran-torture/execute/forall_2.f90 compilation,  -O2 -fomit-frame-pointer -finline-functions 
FAIL: gfortran.fortran-torture/execute/forall_2.f90 compilation,  -O2 -fomit-frame-pointer -finline-functions -funroll-loops 
FAIL: gfortran.fortran-torture/execute/forall_2.f90 compilation,  -O2 -fbounds-check 
FAIL: gfortran.fortran-torture/execute/forall_2.f90 compilation,  -O3 -g 
FAIL: gfortran.fortran-torture/execute/forall_2.f90 compilation,  -Os 
FAIL: gfortran.fortran-torture/execute/forall_4.f90 compilation,  -O0 
FAIL: gfortran.fortran-torture/execute/forall_4.f90 compilation,  -O1 
FAIL: gfortran.fortran-torture/execute/forall_4.f90 compilation,  -O2 
FAIL: gfortran.fortran-torture/execute/forall_4.f90 compilation,  -O2 -fomit-frame-pointer -finline-functions 
FAIL: gfortran.fortran-torture/execute/forall_4.f90 compilation,  -O2 -fomit-frame-pointer -finline-functions -funroll-loops 
FAIL: gfortran.fortran-torture/execute/forall_4.f90 compilation,  -O2 -fbounds-check 
FAIL: gfortran.fortran-torture/execute/forall_4.f90 compilation,  -O3 -g 
FAIL: gfortran.fortran-torture/execute/forall_4.f90 compilation,  -Os 
FAIL: gfortran.fortran-torture/execute/in-pack.f90 execution,  -O0 
FAIL: gfortran.fortran-torture/execute/in-pack.f90 execution,  -O1 
FAIL: gfortran.fortran-torture/execute/in-pack.f90 execution,  -O2 
FAIL: gfortran.fortran-torture/execute/in-pack.f90 execution,  -O2 -fomit-frame-pointer -finline-functions 
FAIL: gfortran.fortran-torture/execute/in-pack.f90 execution,  -O2 -fomit-frame-pointer -finline-functions -funroll-loops 
FAIL: gfortran.fortran-torture/execute/in-pack.f90 execution,  -O2 -fbounds-check 
FAIL: gfortran.fortran-torture/execute/in-pack.f90 execution,  -O3 -g 
FAIL: gfortran.fortran-torture/execute/in-pack.f90 execution,  -Os 
FAIL: gfortran.fortran-torture/execute/intrinsic_cshift.f90 compilation,  -O0 
FAIL: gfortran.fortran-torture/execute/intrinsic_cshift.f90 compilation,  -O1 
FAIL: gfortran.fortran-torture/execute/intrinsic_cshift.f90 compilation,  -O2 
FAIL: gfortran.fortran-torture/execute/intrinsic_cshift.f90 compilation,  -O2 -fomit-frame-pointer -finline-functions 
FAIL: gfortran.fortran-torture/execute/intrinsic_cshift.f90 compilation,  -O2 -fomit-frame-pointer -finline-functions -funroll-loops 
FAIL: gfortran.fortran-torture/execute/intrinsic_cshift.f90 compilation,  -O2 -fbounds-check 
FAIL: gfortran.fortran-torture/execute/intrinsic_cshift.f90 compilation,  -O3 -g 
FAIL: gfortran.fortran-torture/execute/intrinsic_cshift.f90 compilation,  -Os 
FAIL: gfortran.fortran-torture/execute/intrinsic_eoshift.f90 compilation,  -O0 
FAIL: gfortran.fortran-torture/execute/intrinsic_eoshift.f90 compilation,  -O1 
FAIL: gfortran.fortran-torture/execute/intrinsic_eoshift.f90 compilation,  -O2 
FAIL: gfortran.fortran-torture/execute/intrinsic_eoshift.f90 compilation,  -O2 -fomit-frame-pointer -finline-functions 
FAIL: gfortran.fortran-torture/execute/intrinsic_eoshift.f90 compilation,  -O2 -fomit-frame-pointer -finline-functions -funroll-loops 
FAIL: gfortran.fortran-torture/execute/intrinsic_eoshift.f90 compilation,  -O2 -fbounds-check 
FAIL: gfortran.fortran-torture/execute/intrinsic_eoshift.f90 compilation,  -O3 -g 
FAIL: gfortran.fortran-torture/execute/intrinsic_eoshift.f90 compilation,  -Os 
FAIL: gfortran.fortran-torture/execute/intrinsic_matmul.f90 compilation,  -O0 
FAIL: gfortran.fortran-torture/execute/intrinsic_matmul.f90 compilation,  -O1 
FAIL: gfortran.fortran-torture/execute/intrinsic_matmul.f90 compilation,  -O2 
FAIL: gfortran.fortran-torture/execute/intrinsic_matmul.f90 compilation,  -O2 -fomit-frame-pointer -finline-functions 
FAIL: gfortran.fortran-torture/execute/intrinsic_matmul.f90 compilation,  -O2 -fomit-frame-pointer -finline-functions -funroll-loops 
FAIL: gfortran.fortran-torture/execute/intrinsic_matmul.f90 compilation,  -O2 -fbounds-check 
FAIL: gfortran.fortran-torture/execute/intrinsic_matmul.f90 compilation,  -O3 -g 
FAIL: gfortran.fortran-torture/execute/intrinsic_matmul.f90 compilation,  -Os 
FAIL: gfortran.fortran-torture/execute/intrinsic_mmloc.f90 compilation,  -O0 
FAIL: gfortran.fortran-torture/execute/intrinsic_mmloc.f90 compilation,  -O1 
FAIL: gfortran.fortran-torture/execute/intrinsic_mmloc.f90 compilation,  -O2 
FAIL: gfortran.fortran-torture/execute/intrinsic_mmloc.f90 compilation,  -O2 -fomit-frame-pointer -finline-functions 
FAIL: gfortran.fortran-torture/execute/intrinsic_mmloc.f90 compilation,  -O2 -fomit-frame-pointer -finline-functions -funroll-loops 
FAIL: gfortran.fortran-torture/execute/intrinsic_mmloc.f90 compilation,  -O2 -fbounds-check 
FAIL: gfortran.fortran-torture/execute/intrinsic_mmloc.f90 compilation,  -O3 -g 
FAIL: gfortran.fortran-torture/execute/intrinsic_mmloc.f90 compilation,  -Os 
FAIL: gfortran.fortran-torture/execute/intrinsic_mmval.f90 compilation,  -O0 
FAIL: gfortran.fortran-torture/execute/intrinsic_mmval.f90 compilation,  -O1 
FAIL: gfortran.fortran-torture/execute/intrinsic_mmval.f90 compilation,  -O2 
FAIL: gfortran.fortran-torture/execute/intrinsic_mmval.f90 compilation,  -O2 -fomit-frame-pointer -finline-functions 
FAIL: gfortran.fortran-torture/execute/intrinsic_mmval.f90 compilation,  -O2 -fomit-frame-pointer -finline-functions -funroll-loops 
FAIL: gfortran.fortran-torture/execute/intrinsic_mmval.f90 compilation,  -O2 -fbounds-check 
FAIL: gfortran.fortran-torture/execute/intrinsic_mmval.f90 compilation,  -O3 -g 
FAIL: gfortran.fortran-torture/execute/intrinsic_mmval.f90 compilation,  -Os 
FAIL: gfortran.fortran-torture/execute/intrinsic_product.f90 compilation,  -O0 
FAIL: gfortran.fortran-torture/execute/intrinsic_product.f90 compilation,  -O1 
FAIL: gfortran.fortran-torture/execute/intrinsic_product.f90 compilation,  -O2 
FAIL: gfortran.fortran-torture/execute/intrinsic_product.f90 compilation,  -O2 -fomit-frame-pointer -finline-functions 
FAIL: gfortran.fortran-torture/execute/intrinsic_product.f90 compilation,  -O2 -fomit-frame-pointer -finline-functions -funroll-loops 
FAIL: gfortran.fortran-torture/execute/intrinsic_product.f90 compilation,  -O2 -fbounds-check 
FAIL: gfortran.fortran-torture/execute/intrinsic_product.f90 compilation,  -O3 -g 
FAIL: gfortran.fortran-torture/execute/intrinsic_product.f90 compilation,  -Os 
FAIL: gfortran.fortran-torture/execute/intrinsic_shape.f90 compilation,  -O0 
FAIL: gfortran.fortran-torture/execute/intrinsic_shape.f90 compilation,  -O1 
FAIL: gfortran.fortran-torture/execute/intrinsic_shape.f90 compilation,  -O2 
FAIL: gfortran.fortran-torture/execute/intrinsic_shape.f90 compilation,  -O2 -fomit-frame-pointer -finline-functions 
FAIL: gfortran.fortran-torture/execute/intrinsic_shape.f90 compilation,  -O2 -fomit-frame-pointer -finline-functions -funroll-loops 
FAIL: gfortran.fortran-torture/execute/intrinsic_shape.f90 compilation,  -O2 -fbounds-check 
FAIL: gfortran.fortran-torture/execute/intrinsic_shape.f90 compilation,  -O3 -g 
FAIL: gfortran.fortran-torture/execute/intrinsic_shape.f90 compilation,  -Os 
FAIL: gfortran.fortran-torture/execute/intrinsic_size.f90 compilation,  -O0 
FAIL: gfortran.fortran-torture/execute/intrinsic_size.f90 compilation,  -O1 
FAIL: gfortran.fortran-torture/execute/intrinsic_size.f90 compilation,  -O2 
FAIL: gfortran.fortran-torture/execute/intrinsic_size.f90 compilation,  -O2 -fomit-frame-pointer -finline-functions 
FAIL: gfortran.fortran-torture/execute/intrinsic_size.f90 compilation,  -O2 -fomit-frame-pointer -finline-functions -funroll-loops 
FAIL: gfortran.fortran-torture/execute/intrinsic_size.f90 compilation,  -O2 -fbounds-check 
FAIL: gfortran.fortran-torture/execute/intrinsic_size.f90 compilation,  -O3 -g 
FAIL: gfortran.fortran-torture/execute/intrinsic_size.f90 compilation,  -Os 
FAIL: gfortran.fortran-torture/execute/intrinsic_spread.f90,  -O0  (internal compiler error)
FAIL: gfortran.fortran-torture/execute/intrinsic_spread.f90,  -O1  (internal compiler error)
FAIL: gfortran.fortran-torture/execute/intrinsic_spread.f90,  -O2  (internal compiler error)
FAIL: gfortran.fortran-torture/execute/intrinsic_spread.f90,  -O2 -fomit-frame-pointer -finline-functions  (internal compiler error)
FAIL: gfortran.fortran-torture/execute/intrinsic_spread.f90,  -O2 -fomit-frame-pointer -finline-functions -funroll-loops  (internal compiler error)
FAIL: gfortran.fortran-torture/execute/intrinsic_spread.f90,  -O2 -fbounds-check  (internal compiler error)
FAIL: gfortran.fortran-torture/execute/intrinsic_spread.f90,  -O3 -g  (internal compiler error)
FAIL: gfortran.fortran-torture/execute/intrinsic_spread.f90,  -Os  (internal compiler error)
FAIL: gfortran.fortran-torture/execute/intrinsic_sum.f90 compilation,  -O0 
FAIL: gfortran.fortran-torture/execute/intrinsic_sum.f90 compilation,  -O1 
FAIL: gfortran.fortran-torture/execute/intrinsic_sum.f90 compilation,  -O2 
FAIL: gfortran.fortran-torture/execute/intrinsic_sum.f90 compilation,  -O2 -fomit-frame-pointer -finline-functions 
FAIL: gfortran.fortran-torture/execute/intrinsic_sum.f90 compilation,  -O2 -fomit-frame-pointer -finline-functions -funroll-loops 
FAIL: gfortran.fortran-torture/execute/intrinsic_sum.f90 compilation,  -O2 -fbounds-check 
FAIL: gfortran.fortran-torture/execute/intrinsic_sum.f90 compilation,  -O3 -g 
FAIL: gfortran.fortran-torture/execute/intrinsic_sum.f90 compilation,  -Os 
FAIL: gfortran.fortran-torture/execute/intrinsic_transpose.f90 compilation,  -O0 
FAIL: gfortran.fortran-torture/execute/intrinsic_transpose.f90 compilation,  -O1 
FAIL: gfortran.fortran-torture/execute/intrinsic_transpose.f90 compilation,  -O2 
FAIL: gfortran.fortran-torture/execute/intrinsic_transpose.f90 compilation,  -O2 -fomit-frame-pointer -finline-functions 
FAIL: gfortran.fortran-torture/execute/intrinsic_transpose.f90 compilation,  -O2 -fomit-frame-pointer -finline-functions -funroll-loops 
FAIL: gfortran.fortran-torture/execute/intrinsic_transpose.f90 compilation,  -O2 -fbounds-check 
FAIL: gfortran.fortran-torture/execute/intrinsic_transpose.f90 compilation,  -O3 -g 
FAIL: gfortran.fortran-torture/execute/intrinsic_transpose.f90 compilation,  -Os 
FAIL: gfortran.fortran-torture/execute/intrinsic_unpack.f90 compilation,  -O0 
FAIL: gfortran.fortran-torture/execute/intrinsic_unpack.f90 compilation,  -O1 
FAIL: gfortran.fortran-torture/execute/intrinsic_unpack.f90 compilation,  -O2 
FAIL: gfortran.fortran-torture/execute/intrinsic_unpack.f90 compilation,  -O2 -fomit-frame-pointer -finline-functions 
FAIL: gfortran.fortran-torture/execute/intrinsic_unpack.f90 compilation,  -O2 -fomit-frame-pointer -finline-functions -funroll-loops 
FAIL: gfortran.fortran-torture/execute/intrinsic_unpack.f90 compilation,  -O2 -fbounds-check 
FAIL: gfortran.fortran-torture/execute/intrinsic_unpack.f90 compilation,  -O3 -g 
FAIL: gfortran.fortran-torture/execute/intrinsic_unpack.f90 compilation,  -Os 
FAIL: gfortran.fortran-torture/execute/partparm.f90 compilation,  -O0 
FAIL: gfortran.fortran-torture/execute/partparm.f90 compilation,  -O1 
FAIL: gfortran.fortran-torture/execute/partparm.f90 compilation,  -O2 
FAIL: gfortran.fortran-torture/execute/partparm.f90 compilation,  -O2 -fomit-frame-pointer -finline-functions 
FAIL: gfortran.fortran-torture/execute/partparm.f90 compilation,  -O2 -fomit-frame-pointer -finline-functions -funroll-loops 
FAIL: gfortran.fortran-torture/execute/partparm.f90 compilation,  -O2 -fbounds-check 
FAIL: gfortran.fortran-torture/execute/partparm.f90 compilation,  -O3 -g 
FAIL: gfortran.fortran-torture/execute/partparm.f90 compilation,  -Os 
FAIL: gfortran.fortran-torture/execute/pr19269-1.f90 compilation,  -O0 
FAIL: gfortran.fortran-torture/execute/pr19269-1.f90 compilation,  -O1 
FAIL: gfortran.fortran-torture/execute/pr19269-1.f90 compilation,  -O2 
FAIL: gfortran.fortran-torture/execute/pr19269-1.f90 compilation,  -O2 -fomit-frame-pointer -finline-functions 
FAIL: gfortran.fortran-torture/execute/pr19269-1.f90 compilation,  -O2 -fomit-frame-pointer -finline-functions -funroll-loops 
FAIL: gfortran.fortran-torture/execute/pr19269-1.f90 compilation,  -O2 -fbounds-check 
FAIL: gfortran.fortran-torture/execute/pr19269-1.f90 compilation,  -O3 -g 
FAIL: gfortran.fortran-torture/execute/pr19269-1.f90 compilation,  -Os 
FAIL: gfortran.fortran-torture/execute/scalarize3.f90 compilation,  -O0 
FAIL: gfortran.fortran-torture/execute/scalarize3.f90 compilation,  -O1 
FAIL: gfortran.fortran-torture/execute/scalarize3.f90 compilation,  -O2 
FAIL: gfortran.fortran-torture/execute/scalarize3.f90 compilation,  -O2 -fomit-frame-pointer -finline-functions 
FAIL: gfortran.fortran-torture/execute/scalarize3.f90 compilation,  -O2 -fomit-frame-pointer -finline-functions -funroll-loops 
FAIL: gfortran.fortran-torture/execute/scalarize3.f90 compilation,  -O2 -fbounds-check 
FAIL: gfortran.fortran-torture/execute/scalarize3.f90 compilation,  -O3 -g 
FAIL: gfortran.fortran-torture/execute/scalarize3.f90 compilation,  -Os 
FAIL: gfortran.fortran-torture/execute/where18.f90 execution,  -O0 
FAIL: gfortran.fortran-torture/execute/where18.f90 execution,  -O1 
FAIL: gfortran.fortran-torture/execute/where18.f90 execution,  -O2 
FAIL: gfortran.fortran-torture/execute/where18.f90 execution,  -O2 -fomit-frame-pointer -finline-functions 
FAIL: gfortran.fortran-torture/execute/where18.f90 execution,  -O2 -fomit-frame-pointer -finline-functions -funroll-loops 
FAIL: gfortran.fortran-torture/execute/where18.f90 execution,  -O2 -fbounds-check 
FAIL: gfortran.fortran-torture/execute/where18.f90 execution,  -O3 -g 
FAIL: gfortran.fortran-torture/execute/where18.f90 execution,  -Os 
FAIL: gfortran.fortran-torture/execute/where19.f90 execution,  -O0 
FAIL: gfortran.fortran-torture/execute/where19.f90 execution,  -O1 
FAIL: gfortran.fortran-torture/execute/where19.f90 execution,  -O2 
FAIL: gfortran.fortran-torture/execute/where19.f90 execution,  -O2 -fomit-frame-pointer -finline-functions 
FAIL: gfortran.fortran-torture/execute/where19.f90 execution,  -O2 -fomit-frame-pointer -finline-functions -funroll-loops 
FAIL: gfortran.fortran-torture/execute/where19.f90 execution,  -O2 -fbounds-check 
FAIL: gfortran.fortran-torture/execute/where19.f90 execution,  -O3 -g 
FAIL: gfortran.fortran-torture/execute/where19.f90 execution,  -Os 
FAIL: gfortran.fortran-torture/execute/where20.f90 execution,  -O0 
FAIL: gfortran.fortran-torture/execute/where20.f90 execution,  -O1 
FAIL: gfortran.fortran-torture/execute/where20.f90 execution,  -O2 
FAIL: gfortran.fortran-torture/execute/where20.f90 execution,  -O2 -fomit-frame-pointer -finline-functions 
FAIL: gfortran.fortran-torture/execute/where20.f90 execution,  -O2 -fomit-frame-pointer -finline-functions -funroll-loops 
FAIL: gfortran.fortran-torture/execute/where20.f90 execution,  -O2 -fbounds-check 
FAIL: gfortran.fortran-torture/execute/where20.f90 execution,  -O3 -g 
FAIL: gfortran.fortran-torture/execute/where20.f90 execution,  -Os 
FAIL: gfortran.fortran-torture/execute/where_1.f90 compilation,  -O0 
FAIL: gfortran.fortran-torture/execute/where_1.f90 compilation,  -O1 
FAIL: gfortran.fortran-torture/execute/where_1.f90 compilation,  -O2 
FAIL: gfortran.fortran-torture/execute/where_1.f90 compilation,  -O2 -fomit-frame-pointer -finline-functions 
FAIL: gfortran.fortran-torture/execute/where_1.f90 compilation,  -O2 -fomit-frame-pointer -finline-functions -funroll-loops 
FAIL: gfortran.fortran-torture/execute/where_1.f90 compilation,  -O2 -fbounds-check 
FAIL: gfortran.fortran-torture/execute/where_1.f90 compilation,  -O3 -g 
FAIL: gfortran.fortran-torture/execute/where_1.f90 compilation,  -Os 
FAIL: gfortran.fortran-torture/execute/where_3.f90 compilation,  -O0 
FAIL: gfortran.fortran-torture/execute/where_3.f90 compilation,  -O1 
FAIL: gfortran.fortran-torture/execute/where_3.f90 compilation,  -O2 
FAIL: gfortran.fortran-torture/execute/where_3.f90 compilation,  -O2 -fomit-frame-pointer -finline-functions 
FAIL: gfortran.fortran-torture/execute/where_3.f90 compilation,  -O2 -fomit-frame-pointer -finline-functions -funroll-loops 
FAIL: gfortran.fortran-torture/execute/where_3.f90 compilation,  -O2 -fbounds-check 
FAIL: gfortran.fortran-torture/execute/where_3.f90 compilation,  -O3 -g 
FAIL: gfortran.fortran-torture/execute/where_3.f90 compilation,  -Os 
FAIL: gfortran.fortran-torture/execute/where_6.f90 compilation,  -O0 
FAIL: gfortran.fortran-torture/execute/where_6.f90 compilation,  -O1 
FAIL: gfortran.fortran-torture/execute/where_6.f90 compilation,  -O2 
FAIL: gfortran.fortran-torture/execute/where_6.f90 compilation,  -O2 -fomit-frame-pointer -finline-functions 
FAIL: gfortran.fortran-torture/execute/where_6.f90 compilation,  -O2 -fomit-frame-pointer -finline-functions -funroll-loops 
FAIL: gfortran.fortran-torture/execute/where_6.f90 compilation,  -O2 -fbounds-check 
FAIL: gfortran.fortran-torture/execute/where_6.f90 compilation,  -O3 -g 
FAIL: gfortran.fortran-torture/execute/where_6.f90 compilation,  -Os 

		=== gfortran Summary ===

# of expected passes		25402
# of unexpected failures	1470
# of expected failures		10
# of unresolved testcases	624
# of untested testcases		216
# of unsupported tests		36
/mnt/src/gcc-clean/mips64octeon-unknown-linux-gnu/gcc/testsuite/gfortran/../../gfortran  version 4.4.0 20080925 (experimental) (GCC) 

		=== objc tests ===


Running target unix

		=== objc Summary ===

# of expected passes		1814
# of expected failures		7
# of unsupported tests		24
/mnt/src/gcc-clean/mips64octeon-unknown-linux-gnu/gcc/xgcc  version 4.4.0 20080925 (experimental) (GCC) 

		=== libffi tests ===


Running target unix
FAIL: libffi.call/closure_fn1.c -O0 -W -Wall output pattern test, is 0 0 0 0 127 0 0 8 9 10 11 12 13 19 21 1 3: 234
FAIL: libffi.call/closure_fn2.c -O0 -W -Wall output pattern test, is 0 0 0 0 127 0 0 8 9 10 11 12 13 19 21 1 3: 234
FAIL: libffi.call/closure_fn3.c -O0 -W -Wall output pattern test, is 0 0 0 0 0 0 0 0 9 10 11 12 13 19 21 1 3: 99
FAIL: libffi.call/closure_fn6.c -O0 -W -Wall output pattern test, is 1 2 3 4 127 0 0 0 9 10 11 12 13 19 21 1 3: 236
FAIL: libffi.call/cls_16byte.c -O0 -W -Wall output pattern test, is 7 0 9 1 0 3: 8 0 12
FAIL: libffi.call/cls_18byte.c -O0 -W -Wall output pattern test, is 1.05858e-314 127 126 1.05858e-314 3.95253e-323 125 124 1.05858e-314: 1.05858e-314 252 250 2.11717e-314
FAIL: libffi.call/cls_19byte.c -O0 -W -Wall output pattern test, is 1.05965e-314 127 126 1.05965e-314 120 0 125 124 0 119: 1.05965e-314 252 250 1.05965e-314 239
FAIL: libffi.call/cls_20byte.c -O0 -W -Wall output pattern test, is 1.05911e-314 0 3 3.95253e-323 0 7: 1.05911e-314 0 10
FAIL: libffi.call/cls_20byte1.c -O0 -W -Wall output pattern test, is 1 0 1.05851e-314 4 0 1.05851e-314: 5 0 2.11703e-314
FAIL: libffi.call/cls_24byte.c -O0 -W -Wall output pattern test, is 1.06002e-314 0 6 5 3.95253e-323 0 3 7 4.94066e-324 5 7 9 8 6 1 9: 8 11 17 25
FAIL: libffi.call/cls_64byte.c -O0 -W -Wall output pattern test, is 13 13 11 20 6 12 12 18
FAIL: libffi.call/cls_9byte1.c -O0 -W -Wall output pattern test, is 7 1.05736e-314 1 1.05736e-314: 8 2.11473e-314
FAIL: libffi.call/cls_9byte2.c -O0 -W -Wall output pattern test, is 1.05925e-314 8 0 9: 1.05925e-314 17
FAIL: libffi.call/cls_align_double.c -O0 -W -Wall output pattern test, is 12 0 127 1 0 13: 13 0 140
FAIL: libffi.call/cls_double.c -O0 -W -Wall output pattern test, is nan: nan
FAIL: libffi.call/cls_float.c -O0 -W -Wall output pattern test, is nan: nan
FAIL: libffi.call/float.c -O0 -W -Wall execution test
FAIL: libffi.call/float1.c -O0 -W -Wall execution test
FAIL: libffi.call/float2.c -O0 -W -Wall execution test
FAIL: libffi.call/float3.c -O0 -W -Wall execution test
FAIL: libffi.call/float4.c -O0 -W -Wall execution test
FAIL: libffi.call/many.c -O0 -W -Wall execution test
FAIL: libffi.call/nested_struct.c -O0 -W -Wall execution test
FAIL: libffi.call/nested_struct1.c -O0 -W -Wall execution test
FAIL: libffi.call/nested_struct4.c -O0 -W -Wall execution test
FAIL: libffi.call/nested_struct6.c -O0 -W -Wall execution test
FAIL: libffi.call/problem1.c -O0 -W -Wall output pattern test, is 1.05795e-314 0 1.05795e-314 3.95253e-323 0 1.05795e-314: 1.05795e-314 0 2.11591e-314
FAIL: libffi.call/return_dbl.c -O0 -W -Wall execution test
FAIL: libffi.call/return_dbl1.c -O0 -W -Wall execution test
FAIL: libffi.call/return_dbl2.c -O0 -W -Wall execution test
FAIL: libffi.call/return_fl.c -O0 -W -Wall execution test
FAIL: libffi.call/return_fl1.c -O0 -W -Wall execution test
FAIL: libffi.call/return_fl2.c -O0 -W -Wall execution test
FAIL: libffi.call/return_fl3.c -O0 -W -Wall execution test
FAIL: libffi.call/return_ldl.c -O0 -W -Wall execution test
FAIL: libffi.call/struct1.c -O0 -W -Wall execution test
FAIL: libffi.call/struct2.c -O0 -W -Wall execution test
FAIL: libffi.call/struct6.c -O0 -W -Wall execution test
FAIL: libffi.call/struct7.c -O0 -W -Wall execution test
FAIL: libffi.call/closure_fn1.c -O2 output pattern test, is 0 0 0 0 127 0 0 8 9 10 11 12 13 19 21 1 3: 234
FAIL: libffi.call/closure_fn2.c -O2 output pattern test, is 0 0 0 0 127 0 0 8 9 10 11 12 13 19 21 1 3: 234
FAIL: libffi.call/closure_fn3.c -O2 output pattern test, is 0 0 0 0 0 0 0 0 9 10 11 12 13 19 21 1 3: 99
FAIL: libffi.call/closure_fn6.c -O2 output pattern test, is 1 2 3 4 127 0 0 0 9 10 11 12 13 19 21 1 3: 236
FAIL: libffi.call/cls_16byte.c -O2 output pattern test, is 7 0 9 1 0 3: 8 0 12
FAIL: libffi.call/cls_18byte.c -O2 output pattern test, is 1.06079e-314 127 126 1.06079e-314 3.95253e-323 125 124 1.06079e-314: 1.06079e-314 252 250 2.12159e-314
FAIL: libffi.call/cls_19byte.c -O2 output pattern test, is 1.05766e-314 127 126 1.05766e-314 120 0 125 124 0 119: 1.05766e-314 252 250 1.05766e-314 239
FAIL: libffi.call/cls_20byte.c -O2 output pattern test, is 1.05884e-314 0 3 3.95253e-323 0 7: 1.05884e-314 0 10
FAIL: libffi.call/cls_20byte1.c -O2 output pattern test, is 1 0 1.05804e-314 4 0 1.05804e-314: 5 0 2.11608e-314
FAIL: libffi.call/cls_24byte.c -O2 output pattern test, is 1.05841e-314 0 6 5 3.95253e-323 0 3 7 4.94066e-324 5 7 9 8 6 1 9: 8 11 17 25
FAIL: libffi.call/cls_64byte.c -O2 output pattern test, is 13 13 11 20 6 12 12 18
FAIL: libffi.call/cls_9byte1.c -O2 output pattern test, is 7 1.06069e-314 1 1.06069e-314: 8 2.12139e-314
FAIL: libffi.call/cls_9byte2.c -O2 output pattern test, is 1.06061e-314 8 0 9: 1.06061e-314 17
FAIL: libffi.call/cls_align_double.c -O2 output pattern test, is 12 0 127 1 0 13: 13 0 140
FAIL: libffi.call/cls_double.c -O2 output pattern test, is nan: nan
FAIL: libffi.call/cls_float.c -O2 output pattern test, is nan: nan
FAIL: libffi.call/float.c -O2 execution test
FAIL: libffi.call/float1.c -O2 execution test
FAIL: libffi.call/float2.c -O2 execution test
FAIL: libffi.call/float3.c -O2 execution test
FAIL: libffi.call/float4.c -O2 execution test
FAIL: libffi.call/many.c -O2 execution test
FAIL: libffi.call/nested_struct.c -O2 execution test
FAIL: libffi.call/nested_struct1.c -O2 execution test
FAIL: libffi.call/nested_struct4.c -O2 execution test
FAIL: libffi.call/nested_struct6.c -O2 execution test
FAIL: libffi.call/problem1.c -O2 output pattern test, is 1.06017e-314 0 1.06017e-314 3.95253e-323 0 1.06017e-314: 1.06017e-314 0 2.12034e-314
FAIL: libffi.call/return_dbl.c -O2 execution test
FAIL: libffi.call/return_dbl1.c -O2 execution test
FAIL: libffi.call/return_dbl2.c -O2 execution test
FAIL: libffi.call/return_fl.c -O2 execution test
FAIL: libffi.call/return_fl1.c -O2 execution test
FAIL: libffi.call/return_fl2.c -O2 execution test
FAIL: libffi.call/return_fl3.c -O2 execution test
FAIL: libffi.call/return_ldl.c -O2 execution test
FAIL: libffi.call/struct1.c -O2 execution test
FAIL: libffi.call/struct2.c -O2 execution test
FAIL: libffi.call/struct6.c -O2 execution test
FAIL: libffi.call/struct7.c -O2 execution test
FAIL: libffi.call/closure_fn1.c -O3 output pattern test, is 0 0 0 0 127 0 0 8 9 10 11 12 13 19 21 1 3: 234
FAIL: libffi.call/closure_fn2.c -O3 output pattern test, is 0 0 0 0 127 0 0 8 9 10 11 12 13 19 21 1 3: 234
FAIL: libffi.call/closure_fn3.c -O3 output pattern test, is 0 0 0 0 0 0 0 0 9 10 11 12 13 19 21 1 3: 99
FAIL: libffi.call/closure_fn6.c -O3 output pattern test, is 1 2 3 4 127 0 0 0 9 10 11 12 13 19 21 1 3: 236
FAIL: libffi.call/cls_16byte.c -O3 output pattern test, is 7 0 9 1 0 3: 8 0 12
FAIL: libffi.call/cls_18byte.c -O3 output pattern test, is 1.05808e-314 127 126 1.05808e-314 3.95253e-323 125 124 1.05808e-314: 1.05808e-314 252 250 2.11615e-314
FAIL: libffi.call/cls_19byte.c -O3 output pattern test, is 1.05813e-314 127 126 1.05813e-314 120 0 125 124 0 119: 1.05813e-314 252 250 1.05813e-314 239
FAIL: libffi.call/cls_20byte.c -O3 output pattern test, is 1.05962e-314 0 3 3.95253e-323 0 7: 1.05962e-314 0 10
FAIL: libffi.call/cls_20byte1.c -O3 output pattern test, is 1 0 1.05997e-314 4 0 1.05997e-314: 5 0 2.11993e-314
FAIL: libffi.call/cls_24byte.c -O3 output pattern test, is 1.05716e-314 0 6 5 3.95253e-323 0 3 7 4.94066e-324 5 7 9 8 6 1 9: 8 11 17 25
FAIL: libffi.call/cls_64byte.c -O3 output pattern test, is 13 13 11 20 6 12 12 18
FAIL: libffi.call/cls_9byte1.c -O3 output pattern test, is 7 1.0606e-314 1 1.0606e-314: 8 2.12119e-314
FAIL: libffi.call/cls_9byte2.c -O3 output pattern test, is 1.05708e-314 8 0 9: 1.05708e-314 17
FAIL: libffi.call/cls_align_double.c -O3 output pattern test, is 12 0 127 1 0 13: 13 0 140
FAIL: libffi.call/cls_double.c -O3 output pattern test, is nan: nan
FAIL: libffi.call/cls_float.c -O3 output pattern test, is nan: nan
FAIL: libffi.call/float.c -O3 execution test
FAIL: libffi.call/float1.c -O3 execution test
FAIL: libffi.call/float2.c -O3 execution test
FAIL: libffi.call/float3.c -O3 execution test
FAIL: libffi.call/float4.c -O3 execution test
FAIL: libffi.call/many.c -O3 execution test
FAIL: libffi.call/nested_struct.c -O3 execution test
FAIL: libffi.call/nested_struct1.c -O3 execution test
FAIL: libffi.call/nested_struct4.c -O3 execution test
FAIL: libffi.call/nested_struct6.c -O3 execution test
FAIL: libffi.call/problem1.c -O3 output pattern test, is 1.05899e-314 0 1.05899e-314 3.95253e-323 0 1.05899e-314: 1.05899e-314 0 2.11798e-314
FAIL: libffi.call/return_dbl.c -O3 execution test
FAIL: libffi.call/return_dbl1.c -O3 execution test
FAIL: libffi.call/return_dbl2.c -O3 execution test
FAIL: libffi.call/return_fl.c -O3 execution test
FAIL: libffi.call/return_fl1.c -O3 execution test
FAIL: libffi.call/return_fl2.c -O3 execution test
FAIL: libffi.call/return_fl3.c -O3 execution test
FAIL: libffi.call/return_ldl.c -O3 execution test
FAIL: libffi.call/struct1.c -O3 execution test
FAIL: libffi.call/struct2.c -O3 execution test
FAIL: libffi.call/struct6.c -O3 execution test
FAIL: libffi.call/struct7.c -O3 execution test
FAIL: libffi.call/closure_fn1.c -Os output pattern test, is 0 0 0 0 127 0 0 8 9 10 11 12 13 19 21 1 3: 234
FAIL: libffi.call/closure_fn2.c -Os output pattern test, is 0 0 0 0 127 0 0 8 9 10 11 12 13 19 21 1 3: 234
FAIL: libffi.call/closure_fn3.c -Os output pattern test, is 0 0 0 0 0 0 0 0 9 10 11 12 13 19 21 1 3: 99
FAIL: libffi.call/closure_fn6.c -Os output pattern test, is 1 2 3 4 127 0 0 0 9 10 11 12 13 19 21 1 3: 236
FAIL: libffi.call/cls_16byte.c -Os output pattern test, is 7 0 9 1 0 3: 8 0 12
FAIL: libffi.call/cls_18byte.c -Os output pattern test, is 1.06008e-314 127 126 1.06008e-314 3.95253e-323 125 124 1.06008e-314: 1.06008e-314 252 250 2.12016e-314
FAIL: libffi.call/cls_19byte.c -Os output pattern test, is 1.06092e-314 127 126 1.06092e-314 120 0 125 124 0 119: 1.06092e-314 252 250 1.06092e-314 239
FAIL: libffi.call/cls_20byte.c -Os output pattern test, is 1.05752e-314 0 3 3.95253e-323 0 7: 1.05752e-314 0 10
FAIL: libffi.call/cls_20byte1.c -Os output pattern test, is 1 0 1.05822e-314 4 0 1.05822e-314: 5 0 2.11644e-314
FAIL: libffi.call/cls_24byte.c -Os output pattern test, is 1.05874e-314 0 6 5 3.95253e-323 0 3 7 4.94066e-324 5 7 9 8 6 1 9: 8 11 17 25
FAIL: libffi.call/cls_64byte.c -Os output pattern test, is 13 13 11 20 6 12 12 18
FAIL: libffi.call/cls_9byte1.c -Os output pattern test, is 7 1.05933e-314 1 1.05933e-314: 8 2.11867e-314
FAIL: libffi.call/cls_9byte2.c -Os output pattern test, is 1.05923e-314 8 0 9: 1.05923e-314 17
FAIL: libffi.call/cls_align_double.c -Os output pattern test, is 12 0 127 1 0 13: 13 0 140
FAIL: libffi.call/cls_double.c -Os output pattern test, is nan: nan
FAIL: libffi.call/cls_float.c -Os output pattern test, is nan: nan
FAIL: libffi.call/float.c -Os execution test
FAIL: libffi.call/float1.c -Os execution test
FAIL: libffi.call/float2.c -Os execution test
FAIL: libffi.call/float3.c -Os execution test
FAIL: libffi.call/float4.c -Os execution test
FAIL: libffi.call/many.c -Os execution test
FAIL: libffi.call/nested_struct.c -Os execution test
FAIL: libffi.call/nested_struct1.c -Os execution test
FAIL: libffi.call/nested_struct4.c -Os execution test
FAIL: libffi.call/nested_struct6.c -Os execution test
FAIL: libffi.call/problem1.c -Os output pattern test, is 1.05831e-314 0 1.05831e-314 3.95253e-323 0 1.05831e-314: 1.05831e-314 0 2.11663e-314
FAIL: libffi.call/return_dbl.c -Os execution test
FAIL: libffi.call/return_dbl1.c -Os execution test
FAIL: libffi.call/return_dbl2.c -Os execution test
FAIL: libffi.call/return_fl.c -Os execution test
FAIL: libffi.call/return_fl1.c -Os execution test
FAIL: libffi.call/return_fl2.c -Os execution test
FAIL: libffi.call/return_fl3.c -Os execution test
FAIL: libffi.call/return_ldl.c -Os execution test
FAIL: libffi.call/struct1.c -Os execution test
FAIL: libffi.call/struct2.c -Os execution test
FAIL: libffi.call/struct6.c -Os execution test
FAIL: libffi.call/struct7.c -Os execution test
FAIL: libffi.call/closure_fn1.c -O2 -fomit-frame-pointer output pattern test, is 0 0 0 0 127 0 0 8 9 10 11 12 13 19 21 1 3: 234
FAIL: libffi.call/closure_fn2.c -O2 -fomit-frame-pointer output pattern test, is 0 0 0 0 127 0 0 8 9 10 11 12 13 19 21 1 3: 234
FAIL: libffi.call/closure_fn3.c -O2 -fomit-frame-pointer output pattern test, is 0 0 0 0 0 0 0 0 9 10 11 12 13 19 21 1 3: 99
FAIL: libffi.call/closure_fn6.c -O2 -fomit-frame-pointer output pattern test, is 1 2 3 4 127 0 0 0 9 10 11 12 13 19 21 1 3: 236
FAIL: libffi.call/cls_16byte.c -O2 -fomit-frame-pointer output pattern test, is 7 0 9 1 0 3: 8 0 12
FAIL: libffi.call/cls_18byte.c -O2 -fomit-frame-pointer output pattern test, is 1.05851e-314 127 126 1.05851e-314 3.95253e-323 125 124 1.05851e-314: 1.05851e-314 252 250 2.11701e-314
FAIL: libffi.call/cls_19byte.c -O2 -fomit-frame-pointer output pattern test, is 1.05979e-314 127 126 1.05979e-314 120 0 125 124 0 119: 1.05979e-314 252 250 1.05979e-314 239
FAIL: libffi.call/cls_20byte.c -O2 -fomit-frame-pointer output pattern test, is 1.05954e-314 0 3 3.95253e-323 0 7: 1.05954e-314 0 10
FAIL: libffi.call/cls_20byte1.c -O2 -fomit-frame-pointer output pattern test, is 1 0 1.05715e-314 4 0 1.05715e-314: 5 0 2.11429e-314
FAIL: libffi.call/cls_24byte.c -O2 -fomit-frame-pointer output pattern test, is 1.05822e-314 0 6 5 3.95253e-323 0 3 7 4.94066e-324 5 7 9 8 6 1 9: 8 11 17 25
FAIL: libffi.call/cls_64byte.c -O2 -fomit-frame-pointer output pattern test, is 13 13 11 20 6 12 12 18
FAIL: libffi.call/cls_9byte1.c -O2 -fomit-frame-pointer output pattern test, is 7 1.05703e-314 1 1.05703e-314: 8 2.11406e-314
FAIL: libffi.call/cls_9byte2.c -O2 -fomit-frame-pointer output pattern test, is 1.05694e-314 8 0 9: 1.05694e-314 17
FAIL: libffi.call/cls_align_double.c -O2 -fomit-frame-pointer output pattern test, is 12 0 127 1 0 13: 13 0 140
FAIL: libffi.call/cls_double.c -O2 -fomit-frame-pointer output pattern test, is nan: nan
FAIL: libffi.call/cls_float.c -O2 -fomit-frame-pointer output pattern test, is nan: nan
FAIL: libffi.call/float.c -O2 -fomit-frame-pointer execution test
FAIL: libffi.call/float1.c -O2 -fomit-frame-pointer execution test
FAIL: libffi.call/float2.c -O2 -fomit-frame-pointer execution test
FAIL: libffi.call/float3.c -O2 -fomit-frame-pointer execution test
FAIL: libffi.call/float4.c -O2 -fomit-frame-pointer execution test
FAIL: libffi.call/many.c -O2 -fomit-frame-pointer execution test
FAIL: libffi.call/nested_struct.c -O2 -fomit-frame-pointer execution test
FAIL: libffi.call/nested_struct1.c -O2 -fomit-frame-pointer execution test
FAIL: libffi.call/nested_struct4.c -O2 -fomit-frame-pointer execution test
FAIL: libffi.call/nested_struct6.c -O2 -fomit-frame-pointer execution test
FAIL: libffi.call/problem1.c -O2 -fomit-frame-pointer output pattern test, is 1.06071e-314 0 1.06071e-314 3.95253e-323 0 1.06071e-314: 1.06071e-314 0 2.12142e-314
FAIL: libffi.call/return_dbl.c -O2 -fomit-frame-pointer execution test
FAIL: libffi.call/return_dbl1.c -O2 -fomit-frame-pointer execution test
FAIL: libffi.call/return_dbl2.c -O2 -fomit-frame-pointer execution test
FAIL: libffi.call/return_fl.c -O2 -fomit-frame-pointer execution test
FAIL: libffi.call/return_fl1.c -O2 -fomit-frame-pointer execution test
FAIL: libffi.call/return_fl2.c -O2 -fomit-frame-pointer execution test
FAIL: libffi.call/return_fl3.c -O2 -fomit-frame-pointer execution test
FAIL: libffi.call/return_ldl.c -O2 -fomit-frame-pointer execution test
FAIL: libffi.call/struct1.c -O2 -fomit-frame-pointer execution test
FAIL: libffi.call/struct2.c -O2 -fomit-frame-pointer execution test
FAIL: libffi.call/struct6.c -O2 -fomit-frame-pointer execution test
FAIL: libffi.call/struct7.c -O2 -fomit-frame-pointer execution test
FAIL: libffi.special/unwindtest.cc  -shared-libgcc -lstdc++ execution test
FAIL: libffi.special/unwindtest.cc  -shared-libgcc -lstdc++ execution test
FAIL: libffi.special/unwindtest.cc  -shared-libgcc -lstdc++ execution test
FAIL: libffi.special/unwindtest.cc  -shared-libgcc -lstdc++ execution test

		=== libffi Summary ===

# of expected passes		1166
# of unexpected failures	199
# of unsupported tests		10
		=== libgomp tests ===


Running target unix
WARNING: program timed out.
FAIL: libgomp.c/appendix-a/a.18.1.c execution test
FAIL: libgomp.c/copyin-1.c execution test
FAIL: libgomp.c/copyin-2.c execution test
FAIL: libgomp.c/copyin-3.c execution test
FAIL: libgomp.c/icv-2.c execution test
FAIL: libgomp.c/lock-3.c execution test
FAIL: libgomp.c/nqueens-1.c execution test
WARNING: program timed out.
FAIL: libgomp.c/sort-1.c execution test
FAIL: libgomp.c++/copyin-1.C  -O0  execution test
FAIL: libgomp.c++/copyin-1.C  -O1  execution test
FAIL: libgomp.c++/copyin-1.C  -O2  execution test
FAIL: libgomp.c++/copyin-1.C  -O3 -fomit-frame-pointer  execution test
FAIL: libgomp.c++/copyin-1.C  -O3 -fomit-frame-pointer -funroll-loops  execution test
FAIL: libgomp.c++/copyin-1.C  -O3 -fomit-frame-pointer -funroll-all-loops -finline-functions  execution test
FAIL: libgomp.c++/copyin-1.C  -O3 -g  (test for excess errors)
UNRESOLVED: libgomp.c++/copyin-1.C  -O3 -g  compilation failed to produce executable
FAIL: libgomp.c++/copyin-1.C  -Os  execution test
FAIL: libgomp.c++/copyin-2.C  -O0  execution test
FAIL: libgomp.c++/copyin-2.C  -O1  execution test
FAIL: libgomp.c++/copyin-2.C  -O2  execution test
FAIL: libgomp.c++/copyin-2.C  -O3 -fomit-frame-pointer  execution test
FAIL: libgomp.c++/copyin-2.C  -O3 -fomit-frame-pointer -funroll-loops  execution test
FAIL: libgomp.c++/copyin-2.C  -O3 -fomit-frame-pointer -funroll-all-loops -finline-functions  execution test
FAIL: libgomp.c++/copyin-2.C  -O3 -g  (test for excess errors)
UNRESOLVED: libgomp.c++/copyin-2.C  -O3 -g  compilation failed to produce executable
FAIL: libgomp.c++/copyin-2.C  -Os  execution test
FAIL: libgomp.c++/ctor-10.C  -O0  execution test
FAIL: libgomp.c++/ctor-10.C  -O1  execution test
FAIL: libgomp.c++/ctor-10.C  -O2  execution test
FAIL: libgomp.c++/ctor-10.C  -O3 -fomit-frame-pointer  execution test
FAIL: libgomp.c++/ctor-10.C  -O3 -fomit-frame-pointer -funroll-loops  execution test
FAIL: libgomp.c++/ctor-10.C  -O3 -fomit-frame-pointer -funroll-all-loops -finline-functions  execution test
FAIL: libgomp.c++/ctor-10.C  -O3 -g  (test for excess errors)
UNRESOLVED: libgomp.c++/ctor-10.C  -O3 -g  compilation failed to produce executable
FAIL: libgomp.c++/ctor-10.C  -Os  execution test
FAIL: libgomp.c++/ctor-5.C  -O0  execution test
FAIL: libgomp.c++/ctor-5.C  -O1  execution test
FAIL: libgomp.c++/ctor-5.C  -O2  execution test
FAIL: libgomp.c++/ctor-5.C  -O3 -fomit-frame-pointer  execution test
FAIL: libgomp.c++/ctor-5.C  -O3 -fomit-frame-pointer -funroll-loops  execution test
FAIL: libgomp.c++/ctor-5.C  -O3 -fomit-frame-pointer -funroll-all-loops -finline-functions  execution test
FAIL: libgomp.c++/ctor-5.C  -O3 -g  (test for excess errors)
UNRESOLVED: libgomp.c++/ctor-5.C  -O3 -g  compilation failed to produce executable
FAIL: libgomp.c++/ctor-5.C  -Os  execution test
FAIL: libgomp.c++/ctor-8.C  -O0  execution test
FAIL: libgomp.c++/ctor-8.C  -O1  execution test
FAIL: libgomp.c++/ctor-8.C  -O2  execution test
FAIL: libgomp.c++/ctor-8.C  -O3 -fomit-frame-pointer  execution test
FAIL: libgomp.c++/ctor-8.C  -O3 -fomit-frame-pointer -funroll-loops  execution test
FAIL: libgomp.c++/ctor-8.C  -O3 -fomit-frame-pointer -funroll-all-loops -finline-functions  execution test
FAIL: libgomp.c++/ctor-8.C  -O3 -g  (test for excess errors)
UNRESOLVED: libgomp.c++/ctor-8.C  -O3 -g  compilation failed to produce executable
FAIL: libgomp.c++/ctor-8.C  -Os  execution test
FAIL: libgomp.c++/ctor-9.C  -O0  execution test
FAIL: libgomp.c++/ctor-9.C  -O1  execution test
FAIL: libgomp.c++/ctor-9.C  -O2  execution test
FAIL: libgomp.c++/ctor-9.C  -O3 -g  (test for excess errors)
UNRESOLVED: libgomp.c++/ctor-9.C  -O3 -g  compilation failed to produce executable
FAIL: libgomp.c++/ctor-9.C  -Os  execution test
FAIL: libgomp.c++/pr24455.C  -O3 -g  (test for excess errors)
UNRESOLVED: libgomp.c++/pr24455.C  -O3 -g  compilation failed to produce executable
FAIL: libgomp.fortran/allocatable1.f90  -O0  (test for excess errors)
UNRESOLVED: libgomp.fortran/allocatable1.f90  -O0  compilation failed to produce executable
FAIL: libgomp.fortran/allocatable1.f90  -O1  (test for excess errors)
UNRESOLVED: libgomp.fortran/allocatable1.f90  -O1  compilation failed to produce executable
FAIL: libgomp.fortran/allocatable1.f90  -O2  (test for excess errors)
UNRESOLVED: libgomp.fortran/allocatable1.f90  -O2  compilation failed to produce executable
FAIL: libgomp.fortran/allocatable1.f90  -O3 -fomit-frame-pointer  (test for excess errors)
UNRESOLVED: libgomp.fortran/allocatable1.f90  -O3 -fomit-frame-pointer  compilation failed to produce executable
FAIL: libgomp.fortran/allocatable1.f90  -O3 -fomit-frame-pointer -funroll-loops  (test for excess errors)
UNRESOLVED: libgomp.fortran/allocatable1.f90  -O3 -fomit-frame-pointer -funroll-loops  compilation failed to produce executable
FAIL: libgomp.fortran/allocatable1.f90  -O3 -fomit-frame-pointer -funroll-all-loops -finline-functions  (test for excess errors)
UNRESOLVED: libgomp.fortran/allocatable1.f90  -O3 -fomit-frame-pointer -funroll-all-loops -finline-functions  compilation failed to produce executable
FAIL: libgomp.fortran/allocatable1.f90  -O3 -g  (test for excess errors)
UNRESOLVED: libgomp.fortran/allocatable1.f90  -O3 -g  compilation failed to produce executable
FAIL: libgomp.fortran/allocatable1.f90  -Os  (test for excess errors)
UNRESOLVED: libgomp.fortran/allocatable1.f90  -Os  compilation failed to produce executable
FAIL: libgomp.fortran/allocatable2.f90  -O0  (test for excess errors)
UNRESOLVED: libgomp.fortran/allocatable2.f90  -O0  compilation failed to produce executable
FAIL: libgomp.fortran/allocatable2.f90  -O1  (test for excess errors)
UNRESOLVED: libgomp.fortran/allocatable2.f90  -O1  compilation failed to produce executable
FAIL: libgomp.fortran/allocatable2.f90  -O2  (test for excess errors)
UNRESOLVED: libgomp.fortran/allocatable2.f90  -O2  compilation failed to produce executable
FAIL: libgomp.fortran/allocatable2.f90  -O3 -fomit-frame-pointer  (test for excess errors)
UNRESOLVED: libgomp.fortran/allocatable2.f90  -O3 -fomit-frame-pointer  compilation failed to produce executable
FAIL: libgomp.fortran/allocatable2.f90  -O3 -fomit-frame-pointer -funroll-loops  (test for excess errors)
UNRESOLVED: libgomp.fortran/allocatable2.f90  -O3 -fomit-frame-pointer -funroll-loops  compilation failed to produce executable
FAIL: libgomp.fortran/allocatable2.f90  -O3 -fomit-frame-pointer -funroll-all-loops -finline-functions  (test for excess errors)
UNRESOLVED: libgomp.fortran/allocatable2.f90  -O3 -fomit-frame-pointer -funroll-all-loops -finline-functions  compilation failed to produce executable
FAIL: libgomp.fortran/allocatable2.f90  -O3 -g  (test for excess errors)
UNRESOLVED: libgomp.fortran/allocatable2.f90  -O3 -g  compilation failed to produce executable
FAIL: libgomp.fortran/allocatable2.f90  -Os  (test for excess errors)
UNRESOLVED: libgomp.fortran/allocatable2.f90  -Os  compilation failed to produce executable
FAIL: libgomp.fortran/allocatable3.f90  -O0  (test for excess errors)
UNRESOLVED: libgomp.fortran/allocatable3.f90  -O0  compilation failed to produce executable
FAIL: libgomp.fortran/allocatable3.f90  -O1  (test for excess errors)
UNRESOLVED: libgomp.fortran/allocatable3.f90  -O1  compilation failed to produce executable
FAIL: libgomp.fortran/allocatable3.f90  -O2  (test for excess errors)
UNRESOLVED: libgomp.fortran/allocatable3.f90  -O2  compilation failed to produce executable
FAIL: libgomp.fortran/allocatable3.f90  -O3 -fomit-frame-pointer  (test for excess errors)
UNRESOLVED: libgomp.fortran/allocatable3.f90  -O3 -fomit-frame-pointer  compilation failed to produce executable
FAIL: libgomp.fortran/allocatable3.f90  -O3 -fomit-frame-pointer -funroll-loops  (test for excess errors)
UNRESOLVED: libgomp.fortran/allocatable3.f90  -O3 -fomit-frame-pointer -funroll-loops  compilation failed to produce executable
FAIL: libgomp.fortran/allocatable3.f90  -O3 -fomit-frame-pointer -funroll-all-loops -finline-functions  (test for excess errors)
UNRESOLVED: libgomp.fortran/allocatable3.f90  -O3 -fomit-frame-pointer -funroll-all-loops -finline-functions  compilation failed to produce executable
FAIL: libgomp.fortran/allocatable3.f90  -O3 -g  (test for excess errors)
UNRESOLVED: libgomp.fortran/allocatable3.f90  -O3 -g  compilation failed to produce executable
FAIL: libgomp.fortran/allocatable3.f90  -Os  (test for excess errors)
UNRESOLVED: libgomp.fortran/allocatable3.f90  -Os  compilation failed to produce executable
FAIL: libgomp.fortran/allocatable4.f90  -O0  (test for excess errors)
UNRESOLVED: libgomp.fortran/allocatable4.f90  -O0  compilation failed to produce executable
FAIL: libgomp.fortran/allocatable4.f90  -O1  (test for excess errors)
UNRESOLVED: libgomp.fortran/allocatable4.f90  -O1  compilation failed to produce executable
FAIL: libgomp.fortran/allocatable4.f90  -O2  (test for excess errors)
UNRESOLVED: libgomp.fortran/allocatable4.f90  -O2  compilation failed to produce executable
FAIL: libgomp.fortran/allocatable4.f90  -O3 -fomit-frame-pointer  (test for excess errors)
UNRESOLVED: libgomp.fortran/allocatable4.f90  -O3 -fomit-frame-pointer  compilation failed to produce executable
FAIL: libgomp.fortran/allocatable4.f90  -O3 -fomit-frame-pointer -funroll-loops  (test for excess errors)
UNRESOLVED: libgomp.fortran/allocatable4.f90  -O3 -fomit-frame-pointer -funroll-loops  compilation failed to produce executable
FAIL: libgomp.fortran/allocatable4.f90  -O3 -fomit-frame-pointer -funroll-all-loops -finline-functions  (test for excess errors)
UNRESOLVED: libgomp.fortran/allocatable4.f90  -O3 -fomit-frame-pointer -funroll-all-loops -finline-functions  compilation failed to produce executable
FAIL: libgomp.fortran/allocatable4.f90  -O3 -g  (test for excess errors)
UNRESOLVED: libgomp.fortran/allocatable4.f90  -O3 -g  compilation failed to produce executable
FAIL: libgomp.fortran/allocatable4.f90  -Os  (test for excess errors)
UNRESOLVED: libgomp.fortran/allocatable4.f90  -Os  compilation failed to produce executable
WARNING: program timed out.
FAIL: libgomp.fortran/appendix-a/a.18.1.f90  -O3 -fomit-frame-pointer -funroll-loops  execution test
FAIL: libgomp.fortran/appendix-a/a.22.7.f90  -O0  execution test
FAIL: libgomp.fortran/appendix-a/a.22.7.f90  -O1  execution test
FAIL: libgomp.fortran/appendix-a/a.22.7.f90  -O2  execution test
FAIL: libgomp.fortran/appendix-a/a.22.7.f90  -O3 -fomit-frame-pointer  execution test
FAIL: libgomp.fortran/appendix-a/a.22.7.f90  -O3 -fomit-frame-pointer -funroll-loops  execution test
FAIL: libgomp.fortran/appendix-a/a.22.7.f90  -O3 -fomit-frame-pointer -funroll-all-loops -finline-functions  execution test
FAIL: libgomp.fortran/appendix-a/a.22.7.f90  -O3 -g  (test for excess errors)
UNRESOLVED: libgomp.fortran/appendix-a/a.22.7.f90  -O3 -g  compilation failed to produce executable
FAIL: libgomp.fortran/appendix-a/a.22.7.f90  -Os  execution test
FAIL: libgomp.fortran/appendix-a/a.22.8.f90  -O0  execution test
FAIL: libgomp.fortran/appendix-a/a.22.8.f90  -O1  execution test
FAIL: libgomp.fortran/appendix-a/a.22.8.f90  -O2  execution test
FAIL: libgomp.fortran/appendix-a/a.22.8.f90  -O3 -fomit-frame-pointer  execution test
FAIL: libgomp.fortran/appendix-a/a.22.8.f90  -O3 -fomit-frame-pointer -funroll-loops  execution test
FAIL: libgomp.fortran/appendix-a/a.22.8.f90  -O3 -fomit-frame-pointer -funroll-all-loops -finline-functions  execution test
FAIL: libgomp.fortran/appendix-a/a.22.8.f90  -O3 -g  (test for excess errors)
UNRESOLVED: libgomp.fortran/appendix-a/a.22.8.f90  -O3 -g  compilation failed to produce executable
FAIL: libgomp.fortran/appendix-a/a.22.8.f90  -Os  execution test
FAIL: libgomp.fortran/crayptr2.f90  -O0  execution test
FAIL: libgomp.fortran/crayptr2.f90  -O1  execution test
FAIL: libgomp.fortran/crayptr2.f90  -O2  execution test
FAIL: libgomp.fortran/crayptr2.f90  -O3 -fomit-frame-pointer  execution test
FAIL: libgomp.fortran/crayptr2.f90  -O3 -fomit-frame-pointer -funroll-loops  execution test
FAIL: libgomp.fortran/crayptr2.f90  -O3 -fomit-frame-pointer -funroll-all-loops -finline-functions  execution test
FAIL: libgomp.fortran/crayptr2.f90  -O3 -g  (test for excess errors)
UNRESOLVED: libgomp.fortran/crayptr2.f90  -O3 -g  compilation failed to produce executable
FAIL: libgomp.fortran/crayptr2.f90  -Os  execution test
FAIL: libgomp.fortran/omp_parse3.f90  -O0  execution test
FAIL: libgomp.fortran/omp_parse3.f90  -O1  execution test
FAIL: libgomp.fortran/omp_parse3.f90  -O2  execution test
FAIL: libgomp.fortran/omp_parse3.f90  -O3 -fomit-frame-pointer  execution test
FAIL: libgomp.fortran/omp_parse3.f90  -O3 -fomit-frame-pointer -funroll-loops  execution test
FAIL: libgomp.fortran/omp_parse3.f90  -O3 -fomit-frame-pointer -funroll-all-loops -finline-functions  execution test
FAIL: libgomp.fortran/omp_parse3.f90  -O3 -g  (test for excess errors)
UNRESOLVED: libgomp.fortran/omp_parse3.f90  -O3 -g  compilation failed to produce executable
FAIL: libgomp.fortran/omp_parse3.f90  -Os  execution test
FAIL: libgomp.fortran/pr25162.f  -O3 -g  (test for excess errors)
UNRESOLVED: libgomp.fortran/pr25162.f  -O3 -g  compilation failed to produce executable
FAIL: libgomp.fortran/pr32550.f90  -O0  execution test
FAIL: libgomp.fortran/pr32550.f90  -O1  execution test
FAIL: libgomp.fortran/pr32550.f90  -O2  execution test
FAIL: libgomp.fortran/pr32550.f90  -O3 -fomit-frame-pointer  execution test
FAIL: libgomp.fortran/pr32550.f90  -O3 -fomit-frame-pointer -funroll-loops  execution test
FAIL: libgomp.fortran/pr32550.f90  -O3 -fomit-frame-pointer -funroll-all-loops -finline-functions  execution test
FAIL: libgomp.fortran/pr32550.f90  -O3 -g  (test for excess errors)
UNRESOLVED: libgomp.fortran/pr32550.f90  -O3 -g  compilation failed to produce executable
FAIL: libgomp.fortran/pr32550.f90  -Os  execution test
WARNING: program timed out.
FAIL: libgomp.fortran/strassen.f90  -O  execution test
FAIL: libgomp.fortran/task2.f90  -O  (test for excess errors)
UNRESOLVED: libgomp.fortran/task2.f90  -O  compilation failed to produce executable
FAIL: libgomp.fortran/threadprivate1.f90  -O0  execution test
FAIL: libgomp.fortran/threadprivate1.f90  -O1  execution test
FAIL: libgomp.fortran/threadprivate1.f90  -O2  execution test
FAIL: libgomp.fortran/threadprivate1.f90  -O3 -fomit-frame-pointer  execution test
FAIL: libgomp.fortran/threadprivate1.f90  -O3 -fomit-frame-pointer -funroll-loops  execution test
FAIL: libgomp.fortran/threadprivate1.f90  -O3 -fomit-frame-pointer -funroll-all-loops -finline-functions  execution test
FAIL: libgomp.fortran/threadprivate1.f90  -O3 -g  (test for excess errors)
UNRESOLVED: libgomp.fortran/threadprivate1.f90  -O3 -g  compilation failed to produce executable
FAIL: libgomp.fortran/threadprivate1.f90  -Os  execution test
FAIL: libgomp.fortran/threadprivate2.f90  -O0  execution test
FAIL: libgomp.fortran/threadprivate2.f90  -O1  execution test
FAIL: libgomp.fortran/threadprivate2.f90  -O2  execution test
FAIL: libgomp.fortran/threadprivate2.f90  -O3 -fomit-frame-pointer  execution test
FAIL: libgomp.fortran/threadprivate2.f90  -O3 -fomit-frame-pointer -funroll-loops  execution test
FAIL: libgomp.fortran/threadprivate2.f90  -O3 -fomit-frame-pointer -funroll-all-loops -finline-functions  execution test
FAIL: libgomp.fortran/threadprivate2.f90  -O3 -g  (test for excess errors)
UNRESOLVED: libgomp.fortran/threadprivate2.f90  -O3 -g  compilation failed to produce executable
FAIL: libgomp.fortran/threadprivate2.f90  -Os  execution test
FAIL: libgomp.fortran/threadprivate3.f90  -O0  execution test
FAIL: libgomp.fortran/threadprivate3.f90  -O1  execution test
FAIL: libgomp.fortran/threadprivate3.f90  -O2  execution test
FAIL: libgomp.fortran/threadprivate3.f90  -O3 -fomit-frame-pointer  execution test
FAIL: libgomp.fortran/threadprivate3.f90  -O3 -fomit-frame-pointer -funroll-loops  execution test
FAIL: libgomp.fortran/threadprivate3.f90  -O3 -fomit-frame-pointer -funroll-all-loops -finline-functions  execution test
FAIL: libgomp.fortran/threadprivate3.f90  -O3 -g  (test for excess errors)
UNRESOLVED: libgomp.fortran/threadprivate3.f90  -O3 -g  compilation failed to produce executable
FAIL: libgomp.fortran/threadprivate3.f90  -Os  execution test
FAIL: libgomp.fortran/vla1.f90  -O0  (test for excess errors)
UNRESOLVED: libgomp.fortran/vla1.f90  -O0  compilation failed to produce executable
FAIL: libgomp.fortran/vla1.f90  -O1  (test for excess errors)
UNRESOLVED: libgomp.fortran/vla1.f90  -O1  compilation failed to produce executable
FAIL: libgomp.fortran/vla1.f90  -O2  (test for excess errors)
UNRESOLVED: libgomp.fortran/vla1.f90  -O2  compilation failed to produce executable
FAIL: libgomp.fortran/vla1.f90  -O3 -fomit-frame-pointer  (test for excess errors)
UNRESOLVED: libgomp.fortran/vla1.f90  -O3 -fomit-frame-pointer  compilation failed to produce executable
FAIL: libgomp.fortran/vla1.f90  -O3 -fomit-frame-pointer -funroll-loops  (test for excess errors)
UNRESOLVED: libgomp.fortran/vla1.f90  -O3 -fomit-frame-pointer -funroll-loops  compilation failed to produce executable
FAIL: libgomp.fortran/vla1.f90  -O3 -fomit-frame-pointer -funroll-all-loops -finline-functions  (test for excess errors)
UNRESOLVED: libgomp.fortran/vla1.f90  -O3 -fomit-frame-pointer -funroll-all-loops -finline-functions  compilation failed to produce executable
FAIL: libgomp.fortran/vla1.f90  -O3 -g  (test for excess errors)
UNRESOLVED: libgomp.fortran/vla1.f90  -O3 -g  compilation failed to produce executable
FAIL: libgomp.fortran/vla1.f90  -Os  (test for excess errors)
UNRESOLVED: libgomp.fortran/vla1.f90  -Os  compilation failed to produce executable
FAIL: libgomp.fortran/vla2.f90  -O0  (test for excess errors)
UNRESOLVED: libgomp.fortran/vla2.f90  -O0  compilation failed to produce executable
FAIL: libgomp.fortran/vla2.f90  -O1  (test for excess errors)
UNRESOLVED: libgomp.fortran/vla2.f90  -O1  compilation failed to produce executable
FAIL: libgomp.fortran/vla2.f90  -O2  (test for excess errors)
UNRESOLVED: libgomp.fortran/vla2.f90  -O2  compilation failed to produce executable
FAIL: libgomp.fortran/vla2.f90  -O3 -fomit-frame-pointer  (test for excess errors)
UNRESOLVED: libgomp.fortran/vla2.f90  -O3 -fomit-frame-pointer  compilation failed to produce executable
FAIL: libgomp.fortran/vla2.f90  -O3 -fomit-frame-pointer -funroll-loops  (test for excess errors)
UNRESOLVED: libgomp.fortran/vla2.f90  -O3 -fomit-frame-pointer -funroll-loops  compilation failed to produce executable
FAIL: libgomp.fortran/vla2.f90  -O3 -fomit-frame-pointer -funroll-all-loops -finline-functions  (test for excess errors)
UNRESOLVED: libgomp.fortran/vla2.f90  -O3 -fomit-frame-pointer -funroll-all-loops -finline-functions  compilation failed to produce executable
FAIL: libgomp.fortran/vla2.f90  -O3 -g  (test for excess errors)
UNRESOLVED: libgomp.fortran/vla2.f90  -O3 -g  compilation failed to produce executable
FAIL: libgomp.fortran/vla2.f90  -Os  (test for excess errors)
UNRESOLVED: libgomp.fortran/vla2.f90  -Os  compilation failed to produce executable
FAIL: libgomp.fortran/vla3.f90  -O0  (test for excess errors)
UNRESOLVED: libgomp.fortran/vla3.f90  -O0  compilation failed to produce executable
FAIL: libgomp.fortran/vla3.f90  -O1  (test for excess errors)
UNRESOLVED: libgomp.fortran/vla3.f90  -O1  compilation failed to produce executable
FAIL: libgomp.fortran/vla3.f90  -O2  (test for excess errors)
UNRESOLVED: libgomp.fortran/vla3.f90  -O2  compilation failed to produce executable
FAIL: libgomp.fortran/vla3.f90  -O3 -fomit-frame-pointer  (test for excess errors)
UNRESOLVED: libgomp.fortran/vla3.f90  -O3 -fomit-frame-pointer  compilation failed to produce executable
FAIL: libgomp.fortran/vla3.f90  -O3 -fomit-frame-pointer -funroll-loops  (test for excess errors)
UNRESOLVED: libgomp.fortran/vla3.f90  -O3 -fomit-frame-pointer -funroll-loops  compilation failed to produce executable
FAIL: libgomp.fortran/vla3.f90  -O3 -fomit-frame-pointer -funroll-all-loops -finline-functions  (test for excess errors)
UNRESOLVED: libgomp.fortran/vla3.f90  -O3 -fomit-frame-pointer -funroll-all-loops -finline-functions  compilation failed to produce executable
FAIL: libgomp.fortran/vla3.f90  -O3 -g  (test for excess errors)
UNRESOLVED: libgomp.fortran/vla3.f90  -O3 -g  compilation failed to produce executable
FAIL: libgomp.fortran/vla3.f90  -Os  (test for excess errors)
UNRESOLVED: libgomp.fortran/vla3.f90  -Os  compilation failed to produce executable
FAIL: libgomp.fortran/vla4.f90  -O0   (test for warnings, line 97)
FAIL: libgomp.fortran/vla4.f90  -O0  (test for excess errors)
UNRESOLVED: libgomp.fortran/vla4.f90  -O0  compilation failed to produce executable
FAIL: libgomp.fortran/vla4.f90  -O1   (test for warnings, line 97)
FAIL: libgomp.fortran/vla4.f90  -O1  (test for excess errors)
UNRESOLVED: libgomp.fortran/vla4.f90  -O1  compilation failed to produce executable
FAIL: libgomp.fortran/vla4.f90  -O2   (test for warnings, line 97)
FAIL: libgomp.fortran/vla4.f90  -O2  (test for excess errors)
UNRESOLVED: libgomp.fortran/vla4.f90  -O2  compilation failed to produce executable
FAIL: libgomp.fortran/vla4.f90  -O3 -fomit-frame-pointer   (test for warnings, line 97)
FAIL: libgomp.fortran/vla4.f90  -O3 -fomit-frame-pointer  (test for excess errors)
UNRESOLVED: libgomp.fortran/vla4.f90  -O3 -fomit-frame-pointer  compilation failed to produce executable
FAIL: libgomp.fortran/vla4.f90  -O3 -fomit-frame-pointer -funroll-loops   (test for warnings, line 97)
FAIL: libgomp.fortran/vla4.f90  -O3 -fomit-frame-pointer -funroll-loops  (test for excess errors)
UNRESOLVED: libgomp.fortran/vla4.f90  -O3 -fomit-frame-pointer -funroll-loops  compilation failed to produce executable
FAIL: libgomp.fortran/vla4.f90  -O3 -fomit-frame-pointer -funroll-all-loops -finline-functions   (test for warnings, line 97)
FAIL: libgomp.fortran/vla4.f90  -O3 -fomit-frame-pointer -funroll-all-loops -finline-functions  (test for excess errors)
UNRESOLVED: libgomp.fortran/vla4.f90  -O3 -fomit-frame-pointer -funroll-all-loops -finline-functions  compilation failed to produce executable
FAIL: libgomp.fortran/vla4.f90  -O3 -g   (test for warnings, line 97)
FAIL: libgomp.fortran/vla4.f90  -O3 -g  (test for excess errors)
UNRESOLVED: libgomp.fortran/vla4.f90  -O3 -g  compilation failed to produce executable
FAIL: libgomp.fortran/vla4.f90  -Os   (test for warnings, line 97)
FAIL: libgomp.fortran/vla4.f90  -Os  (test for excess errors)
UNRESOLVED: libgomp.fortran/vla4.f90  -Os  compilation failed to produce executable
FAIL: libgomp.fortran/vla5.f90  -O0   (test for warnings, line 69)
FAIL: libgomp.fortran/vla5.f90  -O0  (test for excess errors)
UNRESOLVED: libgomp.fortran/vla5.f90  -O0  compilation failed to produce executable
FAIL: libgomp.fortran/vla5.f90  -O1   (test for warnings, line 69)
FAIL: libgomp.fortran/vla5.f90  -O1  (test for excess errors)
UNRESOLVED: libgomp.fortran/vla5.f90  -O1  compilation failed to produce executable
FAIL: libgomp.fortran/vla5.f90  -O2   (test for warnings, line 69)
FAIL: libgomp.fortran/vla5.f90  -O2  (test for excess errors)
UNRESOLVED: libgomp.fortran/vla5.f90  -O2  compilation failed to produce executable
FAIL: libgomp.fortran/vla5.f90  -O3 -fomit-frame-pointer   (test for warnings, line 69)
FAIL: libgomp.fortran/vla5.f90  -O3 -fomit-frame-pointer  (test for excess errors)
UNRESOLVED: libgomp.fortran/vla5.f90  -O3 -fomit-frame-pointer  compilation failed to produce executable
FAIL: libgomp.fortran/vla5.f90  -O3 -fomit-frame-pointer -funroll-loops   (test for warnings, line 69)
FAIL: libgomp.fortran/vla5.f90  -O3 -fomit-frame-pointer -funroll-loops  (test for excess errors)
UNRESOLVED: libgomp.fortran/vla5.f90  -O3 -fomit-frame-pointer -funroll-loops  compilation failed to produce executable
FAIL: libgomp.fortran/vla5.f90  -O3 -fomit-frame-pointer -funroll-all-loops -finline-functions   (test for warnings, line 69)
FAIL: libgomp.fortran/vla5.f90  -O3 -fomit-frame-pointer -funroll-all-loops -finline-functions  (test for excess errors)
UNRESOLVED: libgomp.fortran/vla5.f90  -O3 -fomit-frame-pointer -funroll-all-loops -finline-functions  compilation failed to produce executable
FAIL: libgomp.fortran/vla5.f90  -O3 -g   (test for warnings, line 69)
FAIL: libgomp.fortran/vla5.f90  -O3 -g  (test for excess errors)
UNRESOLVED: libgomp.fortran/vla5.f90  -O3 -g  compilation failed to produce executable
FAIL: libgomp.fortran/vla5.f90  -Os   (test for warnings, line 69)
FAIL: libgomp.fortran/vla5.f90  -Os  (test for excess errors)
UNRESOLVED: libgomp.fortran/vla5.f90  -Os  compilation failed to produce executable
FAIL: libgomp.fortran/vla6.f90  -O0  (test for excess errors)
UNRESOLVED: libgomp.fortran/vla6.f90  -O0  compilation failed to produce executable
FAIL: libgomp.fortran/vla6.f90  -O1  (test for excess errors)
UNRESOLVED: libgomp.fortran/vla6.f90  -O1  compilation failed to produce executable
FAIL: libgomp.fortran/vla6.f90  -O2  (test for excess errors)
UNRESOLVED: libgomp.fortran/vla6.f90  -O2  compilation failed to produce executable
FAIL: libgomp.fortran/vla6.f90  -O3 -fomit-frame-pointer  (test for excess errors)
UNRESOLVED: libgomp.fortran/vla6.f90  -O3 -fomit-frame-pointer  compilation failed to produce executable
FAIL: libgomp.fortran/vla6.f90  -O3 -fomit-frame-pointer -funroll-loops  (test for excess errors)
UNRESOLVED: libgomp.fortran/vla6.f90  -O3 -fomit-frame-pointer -funroll-loops  compilation failed to produce executable
FAIL: libgomp.fortran/vla6.f90  -O3 -fomit-frame-pointer -funroll-all-loops -finline-functions  (test for excess errors)
UNRESOLVED: libgomp.fortran/vla6.f90  -O3 -fomit-frame-pointer -funroll-all-loops -finline-functions  compilation failed to produce executable
FAIL: libgomp.fortran/vla6.f90  -O3 -g  (test for excess errors)
UNRESOLVED: libgomp.fortran/vla6.f90  -O3 -g  compilation failed to produce executable
FAIL: libgomp.fortran/vla6.f90  -Os  (test for excess errors)
UNRESOLVED: libgomp.fortran/vla6.f90  -Os  compilation failed to produce executable

		=== libgomp Summary ===

# of expected passes		1974
# of unexpected failures	218
# of unresolved testcases	97
		=== libjava tests ===


Running target unix
FAIL: calls output
FAIL: InvokeReturn output - source compiled test
FAIL: InvokeReturn -findirect-dispatch output - source compiled test
FAIL: InvokeReturn -O3 output - source compiled test
FAIL: InvokeReturn -O3 -findirect-dispatch output - source compiled test
FAIL: PR18699 execution - source compiled test
FAIL: PR18699 -O3 execution - source compiled test
FAIL: Serialization output - source compiled test
FAIL: Serialization -findirect-dispatch output - source compiled test
FAIL: Serialization -O3 output - source compiled test
FAIL: Serialization -O3 -findirect-dispatch output - source compiled test
FAIL: negzero output - source compiled test
FAIL: negzero -findirect-dispatch output - source compiled test
FAIL: negzero -O3 output - source compiled test
FAIL: negzero -O3 -findirect-dispatch output - source compiled test
FAIL: pr25676 output - source compiled test
FAIL: pr25676 -findirect-dispatch output - source compiled test
FAIL: pr25676 -O3 output - source compiled test
FAIL: pr25676 -O3 -findirect-dispatch output - source compiled test

		=== libjava Summary ===

# of expected passes		2551
# of unexpected failures	19
# of untested testcases		2
		=== libmudflap tests ===


Running target unix
FAIL: libmudflap.c/fail17-frag.c (-static) (test for excess errors)
WARNING: libmudflap.c/fail17-frag.c (-static) compilation failed to produce executable
FAIL: libmudflap.c/fail23-frag.c (-static) (test for excess errors)
WARNING: libmudflap.c/fail23-frag.c (-static) compilation failed to produce executable
FAIL: libmudflap.c/fail25-frag.c (-static) (test for excess errors)
WARNING: libmudflap.c/fail25-frag.c (-static) compilation failed to produce executable
FAIL: libmudflap.c/fail4-frag.c (-static) (test for excess errors)
WARNING: libmudflap.c/fail4-frag.c (-static) compilation failed to produce executable
FAIL: libmudflap.c/fail5-frag.c (-static) (test for excess errors)
WARNING: libmudflap.c/fail5-frag.c (-static) compilation failed to produce executable
FAIL: libmudflap.c/fail6-frag.c (-static) (test for excess errors)
WARNING: libmudflap.c/fail6-frag.c (-static) compilation failed to produce executable
FAIL: libmudflap.c/fail7-frag.c (-static) (test for excess errors)
WARNING: libmudflap.c/fail7-frag.c (-static) compilation failed to produce executable
FAIL: libmudflap.c/fail8-frag.c (-static) (test for excess errors)
WARNING: libmudflap.c/fail8-frag.c (-static) compilation failed to produce executable
FAIL: libmudflap.c/fail9-frag.c (-static) (test for excess errors)
WARNING: libmudflap.c/fail9-frag.c (-static) compilation failed to produce executable
FAIL: libmudflap.c/heap-scalestress.c (-static) (test for excess errors)
WARNING: libmudflap.c/heap-scalestress.c (-static) compilation failed to produce executable
FAIL: libmudflap.c/hook-allocstuff.c (-static) (test for excess errors)
WARNING: libmudflap.c/hook-allocstuff.c (-static) compilation failed to produce executable
FAIL: libmudflap.c/pass-stratcliff.c (-static) (test for excess errors)
WARNING: libmudflap.c/pass-stratcliff.c (-static) compilation failed to produce executable
FAIL: libmudflap.c/pass30-frag.c (-static) (test for excess errors)
WARNING: libmudflap.c/pass30-frag.c (-static) compilation failed to produce executable
FAIL: libmudflap.c/pass30-frag.c (-static) (test for excess errors)
WARNING: libmudflap.c/pass30-frag.c (-static) compilation failed to produce executable
FAIL: libmudflap.c/pass4-frag.c (-static) (test for excess errors)
WARNING: libmudflap.c/pass4-frag.c (-static) compilation failed to produce executable
FAIL: libmudflap.c/pass4-frag.c (-static) (test for excess errors)
WARNING: libmudflap.c/pass4-frag.c (-static) compilation failed to produce executable
FAIL: libmudflap.c/pass45-frag.c (-static) (test for excess errors)
WARNING: libmudflap.c/pass45-frag.c (-static) compilation failed to produce executable
FAIL: libmudflap.c/pass45-frag.c (-static) (test for excess errors)
WARNING: libmudflap.c/pass45-frag.c (-static) compilation failed to produce executable
FAIL: libmudflap.c/pass46-frag.c (-static) (test for excess errors)
WARNING: libmudflap.c/pass46-frag.c (-static) compilation failed to produce executable
FAIL: libmudflap.c/pass46-frag.c (-static) (test for excess errors)
WARNING: libmudflap.c/pass46-frag.c (-static) compilation failed to produce executable
FAIL: libmudflap.c/pass47-frag.c (-static) (test for excess errors)
WARNING: libmudflap.c/pass47-frag.c (-static) compilation failed to produce executable
FAIL: libmudflap.c/pass47-frag.c (-static) (test for excess errors)
WARNING: libmudflap.c/pass47-frag.c (-static) compilation failed to produce executable
FAIL: libmudflap.c/pass49-frag.c (-static) (test for excess errors)
WARNING: libmudflap.c/pass49-frag.c (-static) compilation failed to produce executable
FAIL: libmudflap.c/pass49-frag.c (-static) (test for excess errors)
WARNING: libmudflap.c/pass49-frag.c (-static) compilation failed to produce executable
FAIL: libmudflap.c/pass5-frag.c (-static) (test for excess errors)
WARNING: libmudflap.c/pass5-frag.c (-static) compilation failed to produce executable
FAIL: libmudflap.c/pass5-frag.c (-static) (test for excess errors)
WARNING: libmudflap.c/pass5-frag.c (-static) compilation failed to produce executable
FAIL: libmudflap.c/pass51-frag.c (-static) (test for excess errors)
WARNING: libmudflap.c/pass51-frag.c (-static) compilation failed to produce executable
FAIL: libmudflap.c/pass51-frag.c (-static) (test for excess errors)
WARNING: libmudflap.c/pass51-frag.c (-static) compilation failed to produce executable
FAIL: libmudflap.c/pass52-frag.c (-static) (test for excess errors)
WARNING: libmudflap.c/pass52-frag.c (-static) compilation failed to produce executable
FAIL: libmudflap.c/pass52-frag.c (-static) (test for excess errors)
WARNING: libmudflap.c/pass52-frag.c (-static) compilation failed to produce executable
FAIL: libmudflap.c/pass6-frag.c (-static) (test for excess errors)
WARNING: libmudflap.c/pass6-frag.c (-static) compilation failed to produce executable
FAIL: libmudflap.c/pass6-frag.c (-static) (test for excess errors)
WARNING: libmudflap.c/pass6-frag.c (-static) compilation failed to produce executable
FAIL: libmudflap.c/pass7-frag.c (-static) (test for excess errors)
WARNING: libmudflap.c/pass7-frag.c (-static) compilation failed to produce executable
FAIL: libmudflap.c/pass7-frag.c (-static) (test for excess errors)
WARNING: libmudflap.c/pass7-frag.c (-static) compilation failed to produce executable
FAIL: libmudflap.c/pass8-frag.c (-static) (test for excess errors)
WARNING: libmudflap.c/pass8-frag.c (-static) compilation failed to produce executable
FAIL: libmudflap.c/pass8-frag.c (-static) (test for excess errors)
WARNING: libmudflap.c/pass8-frag.c (-static) compilation failed to produce executable
FAIL: libmudflap.c/pass9-frag.c (-static) (test for excess errors)
WARNING: libmudflap.c/pass9-frag.c (-static) compilation failed to produce executable
FAIL: libmudflap.c/pass9-frag.c (-static) (test for excess errors)
WARNING: libmudflap.c/pass9-frag.c (-static) compilation failed to produce executable
FAIL: libmudflap.c++/pass41-frag.cxx execution test
FAIL: libmudflap.c++/fail24-frag.cxx (-static) (test for excess errors)
WARNING: libmudflap.c++/fail24-frag.cxx (-static) compilation failed to produce executable
FAIL: libmudflap.c++/pass31-frag.cxx (-static) (test for excess errors)
WARNING: libmudflap.c++/pass31-frag.cxx (-static) compilation failed to produce executable
FAIL: libmudflap.c++/pass41-frag.cxx (-static) execution test
FAIL: libmudflap.c++/pass41-frag.cxx (-O2) execution test
FAIL: libmudflap.c++/pass41-frag.cxx (-O3) execution test
FAIL: libmudflap.cth/pass37-frag.c (-static -DSTATIC) (test for excess errors)
FAIL: libmudflap.cth/pass39-frag.c (-static -DSTATIC) (test for excess errors)
FAIL: libmudflap.cth/pass40-frag.c (-static -DSTATIC) (test for excess errors)
FAIL: libmudflap.cth/pass59-frag.c (-static -DSTATIC) (test for excess errors)

		=== libmudflap Summary ===

# of expected passes		1777
# of unexpected failures	48
		=== libstdc++ tests ===


Running target unix
FAIL: abi_check
XPASS: 23_containers/unordered_multimap/init-list.cc (test for excess errors)
XPASS: 26_numerics/headers/cmath/c99_classification_macros_c.cc (test for excess errors)

		=== libstdc++ Summary ===

# of expected passes		5560
# of unexpected failures	1
# of unexpected successes	2
# of expected failures		72
# of unsupported tests		326

Compiler version: 4.4.0 20080925 (experimental) (GCC) 
Platform: mips64octeon-unknown-linux-gnu
configure flags: --target=mips64octeon-unknown-linux-gnu --prefix=/mnt/src/gcc-clean/mips64octeon-unknown-linux-gnu/../install-mips64octeon-unknown-linux-gnu --build=mips64octeon-unknown-linux-gnu --disable-multilib


Index Nav: [Date Index] [Subject Index] [Author Index] [Thread Index]
Message Nav: [Date Prev] [Date Next] [Thread Prev] [Thread Next]