This is the mail archive of the gcc-testresults@gcc.gnu.org mailing list for the GCC project.


Index Nav: [Date Index] [Subject Index] [Author Index] [Thread Index]
Message Nav: [Date Prev] [Date Next] [Thread Prev] [Thread Next]
Other format: [Raw text]

Results for 4.3.0 20080128 (experimental) [trunk revision 131923] (GCC) gcc testsuite on powerpc-unknown-eabisim


Debian 4 on x86_64
cross tool versions:
GNU assembler (GNU Binutils) 2.18.50.20080127
GNU gdb 6.7.50.20080126-cvs
GNU ld (GNU Binutils) 2.18.50.20080127

GNU Make 3.81
expect version 5.43.0
host gcc version: gcc (GCC) 4.3.0 20080128 (experimental) [trunk revision 131923]
LAST_UPDATED: Mon Jan 28 23:02:30 UTC 2008 (revision 131923)

Target is powerpc-unknown-eabisim
Host   is x86_64-unknown-linux-gnu

		=== gcc tests ===


Running target powerpc-sim
FAIL: gcc.c-torture/compile/20071117-1.c  -O0  (internal compiler error)
FAIL: gcc.c-torture/compile/20071117-1.c  -O0  (test for excess errors)
FAIL: gcc.c-torture/compile/limits-structnest.c  -O2  (test for excess errors)
FAIL: gcc.c-torture/compile/limits-structnest.c  -O3 -fomit-frame-pointer  (test for excess errors)
FAIL: gcc.c-torture/compile/limits-structnest.c  -O3 -g  (test for excess errors)
FAIL: gcc.c-torture/compile/limits-structnest.c  -Os  (test for excess errors)
FAIL: gcc.c-torture/execute/builtins/fputs.c execution,  -Os 
FAIL: gcc.c-torture/execute/builtins/snprintf-chk.c execution,  -Os 
FAIL: gcc.c-torture/execute/builtins/vsprintf-chk.c execution,  -O1 
FAIL: gcc.c-torture/execute/20020406-1.c execution,  -O1 
FAIL: gcc.c-torture/execute/20020406-1.c execution,  -O3 -fomit-frame-pointer 
FAIL: gcc.c-torture/execute/20020406-1.c execution,  -O3 -fomit-frame-pointer -funroll-loops 
FAIL: gcc.c-torture/execute/bf64-1.c compilation,  -O1  (internal compiler error)
UNRESOLVED: gcc.c-torture/execute/bf64-1.c execution,  -O1 
FAIL: gcc.c-torture/execute/fprintf-chk-1.c execution,  -O1 
FAIL: gcc.c-torture/execute/printf-chk-1.c execution,  -O3 -g 
FAIL: gcc.c-torture/execute/printf-chk-1.c execution,  -Os 
FAIL: gcc.c-torture/execute/vfprintf-1.c execution,  -O2 
FAIL: gcc.c-torture/execute/vfprintf-1.c execution,  -O3 -fomit-frame-pointer 
FAIL: gcc.c-torture/execute/vprintf-1.c execution,  -O3 -g 
FAIL: gcc.c-torture/execute/ieee/inf-1.c execution,  -O0 
WARNING: Could not compile gcc.dg/compat/struct-layout-1 generator
FAIL: gcc.dg/cpp/assert4.c (test for excess errors)
FAIL: gcc.dg/ia64-sync-1.c execution test
FAIL: gcc.dg/memcpy-1.c scan-tree-dump-times optimized "nasty_local" 0
FAIL: gcc.dg/pr34856.c (test for excess errors)
FAIL: gcc.dg/var-expand3.c execution test
FAIL: gcc.dg/struct/wo_prof_malloc_size_var.c execution test
FAIL: gcc.dg/torture/builtin-math-2.c  -O0  (test for excess errors)
ERROR: gcc.dg/torture/builtin-math-2.c  -O0 : error executing dg-final: no files matched glob pattern "builtin-math-2.c.[0-9][0-9][0-9]t.original"
UNRESOLVED: gcc.dg/torture/builtin-math-2.c  -O0 : error executing dg-final: no files matched glob pattern "builtin-math-2.c.[0-9][0-9][0-9]t.original"
FAIL: gcc.dg/torture/builtin-math-2.c  -O1  (test for excess errors)
ERROR: gcc.dg/torture/builtin-math-2.c  -O1 : error executing dg-final: no files matched glob pattern "builtin-math-2.c.[0-9][0-9][0-9]t.original"
UNRESOLVED: gcc.dg/torture/builtin-math-2.c  -O1 : error executing dg-final: no files matched glob pattern "builtin-math-2.c.[0-9][0-9][0-9]t.original"
FAIL: gcc.dg/torture/builtin-math-2.c  -O2  (test for excess errors)
ERROR: gcc.dg/torture/builtin-math-2.c  -O2 : error executing dg-final: no files matched glob pattern "builtin-math-2.c.[0-9][0-9][0-9]t.original"
UNRESOLVED: gcc.dg/torture/builtin-math-2.c  -O2 : error executing dg-final: no files matched glob pattern "builtin-math-2.c.[0-9][0-9][0-9]t.original"
FAIL: gcc.dg/torture/builtin-math-2.c  -O3 -fomit-frame-pointer  (test for excess errors)
ERROR: gcc.dg/torture/builtin-math-2.c  -O3 -fomit-frame-pointer : error executing dg-final: no files matched glob pattern "builtin-math-2.c.[0-9][0-9][0-9]t.original"
UNRESOLVED: gcc.dg/torture/builtin-math-2.c  -O3 -fomit-frame-pointer : error executing dg-final: no files matched glob pattern "builtin-math-2.c.[0-9][0-9][0-9]t.original"
FAIL: gcc.dg/torture/builtin-math-2.c  -O3 -fomit-frame-pointer -funroll-loops  (test for excess errors)
ERROR: gcc.dg/torture/builtin-math-2.c  -O3 -fomit-frame-pointer -funroll-loops : error executing dg-final: no files matched glob pattern "builtin-math-2.c.[0-9][0-9][0-9]t.original"
UNRESOLVED: gcc.dg/torture/builtin-math-2.c  -O3 -fomit-frame-pointer -funroll-loops : error executing dg-final: no files matched glob pattern "builtin-math-2.c.[0-9][0-9][0-9]t.original"
FAIL: gcc.dg/torture/builtin-math-2.c  -O3 -fomit-frame-pointer -funroll-all-loops -finline-functions  (test for excess errors)
ERROR: gcc.dg/torture/builtin-math-2.c  -O3 -fomit-frame-pointer -funroll-all-loops -finline-functions : error executing dg-final: no files matched glob pattern "builtin-math-2.c.[0-9][0-9][0-9]t.original"
UNRESOLVED: gcc.dg/torture/builtin-math-2.c  -O3 -fomit-frame-pointer -funroll-all-loops -finline-functions : error executing dg-final: no files matched glob pattern "builtin-math-2.c.[0-9][0-9][0-9]t.original"
FAIL: gcc.dg/torture/builtin-math-2.c  -O3 -g  (test for excess errors)
ERROR: gcc.dg/torture/builtin-math-2.c  -O3 -g : error executing dg-final: no files matched glob pattern "builtin-math-2.c.[0-9][0-9][0-9]t.original"
UNRESOLVED: gcc.dg/torture/builtin-math-2.c  -O3 -g : error executing dg-final: no files matched glob pattern "builtin-math-2.c.[0-9][0-9][0-9]t.original"
FAIL: gcc.dg/torture/builtin-math-2.c  -Os  (test for excess errors)
ERROR: gcc.dg/torture/builtin-math-2.c  -Os : error executing dg-final: no files matched glob pattern "builtin-math-2.c.[0-9][0-9][0-9]t.original"
UNRESOLVED: gcc.dg/torture/builtin-math-2.c  -Os : error executing dg-final: no files matched glob pattern "builtin-math-2.c.[0-9][0-9][0-9]t.original"
FAIL: gcc.dg/torture/builtin-math-4.c  -O0  (test for excess errors)
FAIL: gcc.dg/torture/builtin-math-4.c  -O1  (test for excess errors)
FAIL: gcc.dg/torture/builtin-math-4.c  -O2  (test for excess errors)
FAIL: gcc.dg/torture/builtin-math-4.c  -O3 -fomit-frame-pointer  (test for excess errors)
FAIL: gcc.dg/torture/builtin-math-4.c  -O3 -fomit-frame-pointer -funroll-loops  (test for excess errors)
FAIL: gcc.dg/torture/builtin-math-4.c  -O3 -fomit-frame-pointer -funroll-all-loops -finline-functions  (test for excess errors)
FAIL: gcc.dg/torture/builtin-math-4.c  -O3 -g  (test for excess errors)
FAIL: gcc.dg/torture/builtin-math-4.c  -Os  (test for excess errors)
FAIL: gcc.dg/torture/builtin-pow-mpfr-1.c  -O0  scan-tree-dump original "pow"
FAIL: gcc.dg/torture/builtin-pow-mpfr-1.c  -O1  scan-tree-dump original "pow"
FAIL: gcc.dg/torture/builtin-pow-mpfr-1.c  -O2  scan-tree-dump original "pow"
FAIL: gcc.dg/torture/builtin-pow-mpfr-1.c  -O3 -fomit-frame-pointer  scan-tree-dump original "pow"
FAIL: gcc.dg/torture/builtin-pow-mpfr-1.c  -O3 -g  scan-tree-dump original "pow"
FAIL: gcc.dg/torture/builtin-pow-mpfr-1.c  -Os  scan-tree-dump original "pow"
FAIL: gcc.dg/vect/costmodel/ppc/costmodel-vect-31d.c scan-tree-dump-times vect "vectorization not profitable" 1
FAIL: gcc.dg/vect/costmodel/ppc/costmodel-vect-31d.c scan-tree-dump-times vect "vectorized 1 loops" 0
FAIL: gcc.dg/vect/costmodel/ppc/costmodel-vect-68d.c scan-tree-dump-times vect "vectorization not profitable" 1
FAIL: gcc.dg/vect/costmodel/ppc/costmodel-vect-68d.c scan-tree-dump-times vect "vectorized 1 loops" 0
FAIL: gcc.dg/vect/pr33953.c scan-tree-dump-times vect "vectorized 1 loops" 1
FAIL: gcc.dg/vect/pr33953.c scan-tree-dump-times vect "vectorizing stmts using SLP" 1
FAIL: gcc.dg/vect/vect-64.c (internal compiler error)
FAIL: gcc.dg/vect/vect-64.c (test for excess errors)
FAIL: gcc.dg/vect/vect-82.c execution test
FAIL: gcc.dg/vect/vect-83.c execution test
FAIL: gcc.target/powerpc/20020118-1.c execution test
FAIL: gcc.target/powerpc/20030218-1.c  (test for errors, line 14)
FAIL: gcc.target/powerpc/20030218-1.c  (test for errors, line 18)
FAIL: gcc.target/powerpc/20030218-1.c  (test for errors, line 21)
FAIL: gcc.target/powerpc/20030218-1.c (test for excess errors)
FAIL: gcc.target/powerpc/altivec-1.c execution test
FAIL: gcc.target/powerpc/altivec-12.c execution test
FAIL: gcc.target/powerpc/altivec-24.c execution test
FAIL: gcc.target/powerpc/altivec-3.c execution test
FAIL: gcc.target/powerpc/altivec-consts.c execution test
FAIL: gcc.target/powerpc/altivec-varargs-1.c execution test
FAIL: gcc.target/powerpc/altivec-vec-merge.c execution test
FAIL: gcc.target/powerpc/darwin-longlong.c execution test
FAIL: gcc.target/powerpc/spe1.c (test for excess errors)

		=== gcc Summary ===

# of expected passes		46273
# of unexpected failures	72
# of expected failures		169
# of unresolved testcases	9
# of untested testcases		35
# of unsupported tests		440
/home/mstein/sim/trunk/powerpc-eabisim/build/gcc/xgcc  version 4.3.0 20080128 (experimental) [trunk revision 131923] (GCC) 


Compiler version: 4.3.0 20080128 (experimental) [trunk revision 131923] (GCC) gcc 
Platform: powerpc-unknown-eabisim
configure flags: --target=powerpc-eabisim --prefix=/n/11/mstein/cross-local/powerpc-eabisim --enable-languages=c --disable-nls --disable-build-warnings --with-ld=/n/11/mstein/cross-local/powerpc-eabisim/bin/powerpc-eabisim-ld --with-as=/n/11/mstein/cross-local/powerpc-eabisim/bin/powerpc-eabisim-as --disable-libssp --with-mpfr=/n/11/mstein/mpfr-2.3.0


Index Nav: [Date Index] [Subject Index] [Author Index] [Thread Index]
Message Nav: [Date Prev] [Date Next] [Thread Prev] [Thread Next]