This is the mail archive of the gcc-testresults@gcc.gnu.org mailing list for the GCC project.


Index Nav: [Date Index] [Subject Index] [Author Index] [Thread Index]
Message Nav: [Date Prev] [Date Next] [Thread Prev] [Thread Next]
Other format: [Raw text]

Results for 4.3.0 20080126 (experimental) [trunk revision 131877] (GCC) gcc testsuite on sh-unknown-elf


Debian 4 on x86_64
cross tool versions:
GNU assembler (GNU Binutils) 2.18.50.20071125
GNU gdb 6.7.50.20071124-cvs
GNU ld (GNU Binutils) 2.18.50.20071125

GNU Make 3.81
expect version 5.43.0
host gcc version: gcc (GCC) 4.3.0 20080126 (experimental) [trunk revision 131877]
LAST_UPDATED: Sat Jan 26 23:02:21 UTC 2008 (revision 131877)

Target is sh-unknown-elf
Host   is x86_64-unknown-linux-gnu

		=== gcc tests ===


Running target sh-sim
FAIL: gcc.c-torture/compile/limits-structnest.c  -O2  (test for excess errors)
FAIL: gcc.c-torture/compile/limits-structnest.c  -O3 -fomit-frame-pointer  (test for excess errors)
FAIL: gcc.c-torture/compile/limits-structnest.c  -O3 -g  (test for excess errors)
FAIL: gcc.c-torture/compile/limits-structnest.c  -Os  (test for excess errors)
WARNING: Could not compile gcc.dg/compat/struct-layout-1 generator
FAIL: gcc.dg/builtin-apply4.c execution test
FAIL: gcc.dg/memcpy-1.c scan-tree-dump-times optimized "nasty_local" 0
XPASS: gcc.dg/pr30957-1.c execution test
FAIL: gcc.dg/pr30957-1.c scan-rtl-dump loop2_unroll "Expanding Accumulator"
FAIL: gcc.dg/unsigned-long-compare.c (internal compiler error)
FAIL: gcc.dg/unsigned-long-compare.c (test for excess errors)
UNRESOLVED: gcc.dg/unsigned-long-compare.c compilation failed to produce executable
FAIL: gcc.dg/var-expand1.c scan-rtl-dump loop2_unroll "Expanding Accumulator"
FAIL: gcc.dg/matrix/transpose-1.c compilation,  -fprofile-generate -O3
UNRESOLVED: gcc.dg/matrix/transpose-1.c execution,    -fprofile-generate -O3
UNRESOLVED: gcc.dg/matrix/transpose-1.c compilation,  -fprofile-use -fipa-matrix-reorg -fdump-ipa-matrix-reorg -O3 -fwhole-program -combine
UNRESOLVED: gcc.dg/matrix/transpose-1.c execution,    -fprofile-use -fipa-matrix-reorg -fdump-ipa-matrix-reorg -O3 -fwhole-program -combine
FAIL: gcc.dg/matrix/transpose-2.c compilation,  -fprofile-generate -O3
UNRESOLVED: gcc.dg/matrix/transpose-2.c execution,    -fprofile-generate -O3
UNRESOLVED: gcc.dg/matrix/transpose-2.c compilation,  -fprofile-use -fipa-matrix-reorg -fdump-ipa-matrix-reorg -O3 -fwhole-program -combine
UNRESOLVED: gcc.dg/matrix/transpose-2.c execution,    -fprofile-use -fipa-matrix-reorg -fdump-ipa-matrix-reorg -O3 -fwhole-program -combine
FAIL: gcc.dg/matrix/transpose-3.c compilation,  -fprofile-generate -O3
UNRESOLVED: gcc.dg/matrix/transpose-3.c execution,    -fprofile-generate -O3
UNRESOLVED: gcc.dg/matrix/transpose-3.c compilation,  -fprofile-use -fipa-matrix-reorg -fdump-ipa-matrix-reorg -O3 -fwhole-program -combine
UNRESOLVED: gcc.dg/matrix/transpose-3.c execution,    -fprofile-use -fipa-matrix-reorg -fdump-ipa-matrix-reorg -O3 -fwhole-program -combine
FAIL: gcc.dg/matrix/transpose-4.c compilation,  -fprofile-generate -O3
UNRESOLVED: gcc.dg/matrix/transpose-4.c execution,    -fprofile-generate -O3
UNRESOLVED: gcc.dg/matrix/transpose-4.c compilation,  -fprofile-use -fipa-matrix-reorg -fdump-ipa-matrix-reorg -O3 -fwhole-program -combine
UNRESOLVED: gcc.dg/matrix/transpose-4.c execution,    -fprofile-use -fipa-matrix-reorg -fdump-ipa-matrix-reorg -O3 -fwhole-program -combine
FAIL: gcc.dg/matrix/transpose-5.c compilation,  -fprofile-generate -O3
UNRESOLVED: gcc.dg/matrix/transpose-5.c execution,    -fprofile-generate -O3
UNRESOLVED: gcc.dg/matrix/transpose-5.c compilation,  -fprofile-use -fipa-matrix-reorg -fdump-ipa-matrix-reorg -O3 -fwhole-program -combine
UNRESOLVED: gcc.dg/matrix/transpose-5.c execution,    -fprofile-use -fipa-matrix-reorg -fdump-ipa-matrix-reorg -O3 -fwhole-program -combine
FAIL: gcc.dg/matrix/transpose-6.c compilation,  -fprofile-generate -O3
UNRESOLVED: gcc.dg/matrix/transpose-6.c execution,    -fprofile-generate -O3
UNRESOLVED: gcc.dg/matrix/transpose-6.c compilation,  -fprofile-use -fipa-matrix-reorg -fdump-ipa-matrix-reorg -O3 -fwhole-program -combine
UNRESOLVED: gcc.dg/matrix/transpose-6.c execution,    -fprofile-use -fipa-matrix-reorg -fdump-ipa-matrix-reorg -O3 -fwhole-program -combine
FAIL: gcc.dg/struct/wo_prof_malloc_size_var.c execution test
FAIL: gcc.dg/struct/w_prof_global_array.c compilation,  -O3 -fwhole-program -combine -fipa-type-escape -fprofile-generate
UNRESOLVED: gcc.dg/struct/w_prof_global_array.c execution,    -O3 -fwhole-program -combine -fipa-type-escape -fprofile-generate
UNRESOLVED: gcc.dg/struct/w_prof_global_array.c compilation,  -O3 -fwhole-program -combine -fipa-type-escape -fprofile-use -fipa-struct-reorg -fdump-ipa-all
UNRESOLVED: gcc.dg/struct/w_prof_global_array.c execution,    -O3 -fwhole-program -combine -fipa-type-escape -fprofile-use -fipa-struct-reorg -fdump-ipa-all
FAIL: gcc.dg/struct/w_prof_global_var.c compilation,  -O3 -fwhole-program -combine -fipa-type-escape -fprofile-generate
UNRESOLVED: gcc.dg/struct/w_prof_global_var.c execution,    -O3 -fwhole-program -combine -fipa-type-escape -fprofile-generate
UNRESOLVED: gcc.dg/struct/w_prof_global_var.c compilation,  -O3 -fwhole-program -combine -fipa-type-escape -fprofile-use -fipa-struct-reorg -fdump-ipa-all
UNRESOLVED: gcc.dg/struct/w_prof_global_var.c execution,    -O3 -fwhole-program -combine -fipa-type-escape -fprofile-use -fipa-struct-reorg -fdump-ipa-all
FAIL: gcc.dg/struct/w_prof_local_array.c compilation,  -O3 -fwhole-program -combine -fipa-type-escape -fprofile-generate
UNRESOLVED: gcc.dg/struct/w_prof_local_array.c execution,    -O3 -fwhole-program -combine -fipa-type-escape -fprofile-generate
UNRESOLVED: gcc.dg/struct/w_prof_local_array.c compilation,  -O3 -fwhole-program -combine -fipa-type-escape -fprofile-use -fipa-struct-reorg -fdump-ipa-all
UNRESOLVED: gcc.dg/struct/w_prof_local_array.c execution,    -O3 -fwhole-program -combine -fipa-type-escape -fprofile-use -fipa-struct-reorg -fdump-ipa-all
FAIL: gcc.dg/struct/w_prof_local_var.c compilation,  -O3 -fwhole-program -combine -fipa-type-escape -fprofile-generate
UNRESOLVED: gcc.dg/struct/w_prof_local_var.c execution,    -O3 -fwhole-program -combine -fipa-type-escape -fprofile-generate
UNRESOLVED: gcc.dg/struct/w_prof_local_var.c compilation,  -O3 -fwhole-program -combine -fipa-type-escape -fprofile-use -fipa-struct-reorg -fdump-ipa-all
UNRESOLVED: gcc.dg/struct/w_prof_local_var.c execution,    -O3 -fwhole-program -combine -fipa-type-escape -fprofile-use -fipa-struct-reorg -fdump-ipa-all
FAIL: gcc.dg/struct/w_prof_single_str_global.c compilation,  -O3 -fwhole-program -combine -fipa-type-escape -fprofile-generate
UNRESOLVED: gcc.dg/struct/w_prof_single_str_global.c execution,    -O3 -fwhole-program -combine -fipa-type-escape -fprofile-generate
UNRESOLVED: gcc.dg/struct/w_prof_single_str_global.c compilation,  -O3 -fwhole-program -combine -fipa-type-escape -fprofile-use -fipa-struct-reorg -fdump-ipa-all
UNRESOLVED: gcc.dg/struct/w_prof_single_str_global.c execution,    -O3 -fwhole-program -combine -fipa-type-escape -fprofile-use -fipa-struct-reorg -fdump-ipa-all
FAIL: gcc.dg/struct/w_prof_two_strs.c compilation,  -O3 -fwhole-program -combine -fipa-type-escape -fprofile-generate
UNRESOLVED: gcc.dg/struct/w_prof_two_strs.c execution,    -O3 -fwhole-program -combine -fipa-type-escape -fprofile-generate
UNRESOLVED: gcc.dg/struct/w_prof_two_strs.c compilation,  -O3 -fwhole-program -combine -fipa-type-escape -fprofile-use -fipa-struct-reorg -fdump-ipa-all
UNRESOLVED: gcc.dg/struct/w_prof_two_strs.c execution,    -O3 -fwhole-program -combine -fipa-type-escape -fprofile-use -fipa-struct-reorg -fdump-ipa-all
FAIL: gcc.dg/struct/w_ratio_cold_str.c compilation,  -O3 -fwhole-program -combine -fipa-type-escape -fprofile-generate
UNRESOLVED: gcc.dg/struct/w_ratio_cold_str.c execution,    -O3 -fwhole-program -combine -fipa-type-escape -fprofile-generate
UNRESOLVED: gcc.dg/struct/w_ratio_cold_str.c compilation,  -O3 -fwhole-program -combine -fipa-type-escape -fprofile-use -fipa-struct-reorg -fdump-ipa-all --param struct-reorg-cold-struct-ratio=30
UNRESOLVED: gcc.dg/struct/w_ratio_cold_str.c execution,    -O3 -fwhole-program -combine -fipa-type-escape -fprofile-use -fipa-struct-reorg -fdump-ipa-all --param struct-reorg-cold-struct-ratio=30
FAIL: gcc.dg/tls/opt-12.c (test for excess errors)
UNRESOLVED: gcc.dg/tls/opt-12.c compilation failed to produce executable
FAIL: gcc.dg/torture/builtin-math-2.c  -O0  (test for excess errors)
ERROR: gcc.dg/torture/builtin-math-2.c  -O0 : error executing dg-final: no files matched glob pattern "builtin-math-2.c.[0-9][0-9][0-9]t.original"
UNRESOLVED: gcc.dg/torture/builtin-math-2.c  -O0 : error executing dg-final: no files matched glob pattern "builtin-math-2.c.[0-9][0-9][0-9]t.original"
FAIL: gcc.dg/torture/builtin-math-2.c  -O1  (test for excess errors)
ERROR: gcc.dg/torture/builtin-math-2.c  -O1 : error executing dg-final: no files matched glob pattern "builtin-math-2.c.[0-9][0-9][0-9]t.original"
UNRESOLVED: gcc.dg/torture/builtin-math-2.c  -O1 : error executing dg-final: no files matched glob pattern "builtin-math-2.c.[0-9][0-9][0-9]t.original"
FAIL: gcc.dg/torture/builtin-math-2.c  -O2  (test for excess errors)
ERROR: gcc.dg/torture/builtin-math-2.c  -O2 : error executing dg-final: no files matched glob pattern "builtin-math-2.c.[0-9][0-9][0-9]t.original"
UNRESOLVED: gcc.dg/torture/builtin-math-2.c  -O2 : error executing dg-final: no files matched glob pattern "builtin-math-2.c.[0-9][0-9][0-9]t.original"
FAIL: gcc.dg/torture/builtin-math-2.c  -O3 -fomit-frame-pointer  (test for excess errors)
ERROR: gcc.dg/torture/builtin-math-2.c  -O3 -fomit-frame-pointer : error executing dg-final: no files matched glob pattern "builtin-math-2.c.[0-9][0-9][0-9]t.original"
UNRESOLVED: gcc.dg/torture/builtin-math-2.c  -O3 -fomit-frame-pointer : error executing dg-final: no files matched glob pattern "builtin-math-2.c.[0-9][0-9][0-9]t.original"
FAIL: gcc.dg/torture/builtin-math-2.c  -O3 -fomit-frame-pointer -funroll-loops  (test for excess errors)
ERROR: gcc.dg/torture/builtin-math-2.c  -O3 -fomit-frame-pointer -funroll-loops : error executing dg-final: no files matched glob pattern "builtin-math-2.c.[0-9][0-9][0-9]t.original"
UNRESOLVED: gcc.dg/torture/builtin-math-2.c  -O3 -fomit-frame-pointer -funroll-loops : error executing dg-final: no files matched glob pattern "builtin-math-2.c.[0-9][0-9][0-9]t.original"
FAIL: gcc.dg/torture/builtin-math-2.c  -O3 -fomit-frame-pointer -funroll-all-loops -finline-functions  (test for excess errors)
ERROR: gcc.dg/torture/builtin-math-2.c  -O3 -fomit-frame-pointer -funroll-all-loops -finline-functions : error executing dg-final: no files matched glob pattern "builtin-math-2.c.[0-9][0-9][0-9]t.original"
UNRESOLVED: gcc.dg/torture/builtin-math-2.c  -O3 -fomit-frame-pointer -funroll-all-loops -finline-functions : error executing dg-final: no files matched glob pattern "builtin-math-2.c.[0-9][0-9][0-9]t.original"
FAIL: gcc.dg/torture/builtin-math-2.c  -O3 -g  (test for excess errors)
ERROR: gcc.dg/torture/builtin-math-2.c  -O3 -g : error executing dg-final: no files matched glob pattern "builtin-math-2.c.[0-9][0-9][0-9]t.original"
UNRESOLVED: gcc.dg/torture/builtin-math-2.c  -O3 -g : error executing dg-final: no files matched glob pattern "builtin-math-2.c.[0-9][0-9][0-9]t.original"
FAIL: gcc.dg/torture/builtin-math-2.c  -Os  (test for excess errors)
ERROR: gcc.dg/torture/builtin-math-2.c  -Os : error executing dg-final: no files matched glob pattern "builtin-math-2.c.[0-9][0-9][0-9]t.original"
UNRESOLVED: gcc.dg/torture/builtin-math-2.c  -Os : error executing dg-final: no files matched glob pattern "builtin-math-2.c.[0-9][0-9][0-9]t.original"
FAIL: gcc.dg/torture/builtin-math-4.c  -O0  (test for excess errors)
FAIL: gcc.dg/torture/builtin-math-4.c  -O1  (test for excess errors)
FAIL: gcc.dg/torture/builtin-math-4.c  -O2  (test for excess errors)
FAIL: gcc.dg/torture/builtin-math-4.c  -O3 -fomit-frame-pointer  (test for excess errors)
FAIL: gcc.dg/torture/builtin-math-4.c  -O3 -fomit-frame-pointer -funroll-loops  (test for excess errors)
FAIL: gcc.dg/torture/builtin-math-4.c  -O3 -fomit-frame-pointer -funroll-all-loops -finline-functions  (test for excess errors)
FAIL: gcc.dg/torture/builtin-math-4.c  -O3 -g  (test for excess errors)
FAIL: gcc.dg/torture/builtin-math-4.c  -Os  (test for excess errors)
FAIL: gcc.dg/torture/builtin-pow-mpfr-1.c  -O0  scan-tree-dump original "pow"
FAIL: gcc.dg/torture/builtin-pow-mpfr-1.c  -O1  scan-tree-dump original "pow"
FAIL: gcc.dg/torture/builtin-pow-mpfr-1.c  -O2  scan-tree-dump original "pow"
FAIL: gcc.dg/torture/builtin-pow-mpfr-1.c  -O3 -fomit-frame-pointer  scan-tree-dump original "pow"
FAIL: gcc.dg/torture/builtin-pow-mpfr-1.c  -O3 -g  scan-tree-dump original "pow"
FAIL: gcc.dg/torture/builtin-pow-mpfr-1.c  -Os  scan-tree-dump original "pow"
FAIL: gcc.dg/tree-prof/bb-reorg.c compilation,  -fprofile-generate -D_PROFILE_GENERATE
UNRESOLVED: gcc.dg/tree-prof/bb-reorg.c execution,    -fprofile-generate -D_PROFILE_GENERATE
UNRESOLVED: gcc.dg/tree-prof/bb-reorg.c compilation,  -fprofile-use -D_PROFILE_USE
UNRESOLVED: gcc.dg/tree-prof/bb-reorg.c execution,    -fprofile-use -D_PROFILE_USE
FAIL: gcc.dg/tree-prof/indir-call-prof.c compilation,  -fprofile-generate -D_PROFILE_GENERATE
UNRESOLVED: gcc.dg/tree-prof/indir-call-prof.c execution,    -fprofile-generate -D_PROFILE_GENERATE
UNRESOLVED: gcc.dg/tree-prof/indir-call-prof.c compilation,  -fprofile-use -D_PROFILE_USE
UNRESOLVED: gcc.dg/tree-prof/indir-call-prof.c execution,    -fprofile-use -D_PROFILE_USE
FAIL: gcc.dg/tree-prof/inliner-1.c compilation,  -fprofile-generate -D_PROFILE_GENERATE
UNRESOLVED: gcc.dg/tree-prof/inliner-1.c execution,    -fprofile-generate -D_PROFILE_GENERATE
UNRESOLVED: gcc.dg/tree-prof/inliner-1.c compilation,  -fprofile-use -D_PROFILE_USE
UNRESOLVED: gcc.dg/tree-prof/inliner-1.c execution,    -fprofile-use -D_PROFILE_USE
FAIL: gcc.dg/tree-prof/stringop-1.c compilation,  -fprofile-generate -D_PROFILE_GENERATE
UNRESOLVED: gcc.dg/tree-prof/stringop-1.c execution,    -fprofile-generate -D_PROFILE_GENERATE
UNRESOLVED: gcc.dg/tree-prof/stringop-1.c compilation,  -fprofile-use -D_PROFILE_USE
UNRESOLVED: gcc.dg/tree-prof/stringop-1.c execution,    -fprofile-use -D_PROFILE_USE
FAIL: gcc.dg/tree-prof/stringop-2.c compilation,  -fprofile-generate -D_PROFILE_GENERATE
UNRESOLVED: gcc.dg/tree-prof/stringop-2.c execution,    -fprofile-generate -D_PROFILE_GENERATE
UNRESOLVED: gcc.dg/tree-prof/stringop-2.c compilation,  -fprofile-use -D_PROFILE_USE
UNRESOLVED: gcc.dg/tree-prof/stringop-2.c execution,    -fprofile-use -D_PROFILE_USE
FAIL: gcc.dg/tree-prof/tracer-1.c compilation,  -fprofile-generate -D_PROFILE_GENERATE
UNRESOLVED: gcc.dg/tree-prof/tracer-1.c execution,    -fprofile-generate -D_PROFILE_GENERATE
UNRESOLVED: gcc.dg/tree-prof/tracer-1.c compilation,  -fprofile-use -D_PROFILE_USE
UNRESOLVED: gcc.dg/tree-prof/tracer-1.c execution,    -fprofile-use -D_PROFILE_USE
FAIL: gcc.dg/tree-prof/update-cunroll-2.c compilation,  -fprofile-generate -D_PROFILE_GENERATE
UNRESOLVED: gcc.dg/tree-prof/update-cunroll-2.c execution,    -fprofile-generate -D_PROFILE_GENERATE
UNRESOLVED: gcc.dg/tree-prof/update-cunroll-2.c compilation,  -fprofile-use -D_PROFILE_USE
UNRESOLVED: gcc.dg/tree-prof/update-cunroll-2.c execution,    -fprofile-use -D_PROFILE_USE
FAIL: gcc.dg/tree-prof/update-loopch.c compilation,  -fprofile-generate -D_PROFILE_GENERATE
UNRESOLVED: gcc.dg/tree-prof/update-loopch.c execution,    -fprofile-generate -D_PROFILE_GENERATE
UNRESOLVED: gcc.dg/tree-prof/update-loopch.c compilation,  -fprofile-use -D_PROFILE_USE
UNRESOLVED: gcc.dg/tree-prof/update-loopch.c execution,    -fprofile-use -D_PROFILE_USE
FAIL: gcc.dg/tree-prof/update-tailcall.c compilation,  -fprofile-generate -D_PROFILE_GENERATE
UNRESOLVED: gcc.dg/tree-prof/update-tailcall.c execution,    -fprofile-generate -D_PROFILE_GENERATE
UNRESOLVED: gcc.dg/tree-prof/update-tailcall.c compilation,  -fprofile-use -D_PROFILE_USE
UNRESOLVED: gcc.dg/tree-prof/update-tailcall.c execution,    -fprofile-use -D_PROFILE_USE
FAIL: gcc.dg/tree-prof/val-prof-1.c compilation,  -fprofile-generate -D_PROFILE_GENERATE
UNRESOLVED: gcc.dg/tree-prof/val-prof-1.c execution,    -fprofile-generate -D_PROFILE_GENERATE
UNRESOLVED: gcc.dg/tree-prof/val-prof-1.c compilation,  -fprofile-use -D_PROFILE_USE
UNRESOLVED: gcc.dg/tree-prof/val-prof-1.c execution,    -fprofile-use -D_PROFILE_USE
FAIL: gcc.dg/tree-prof/val-prof-2.c compilation,  -fprofile-generate -D_PROFILE_GENERATE
UNRESOLVED: gcc.dg/tree-prof/val-prof-2.c execution,    -fprofile-generate -D_PROFILE_GENERATE
UNRESOLVED: gcc.dg/tree-prof/val-prof-2.c compilation,  -fprofile-use -D_PROFILE_USE
UNRESOLVED: gcc.dg/tree-prof/val-prof-2.c execution,    -fprofile-use -D_PROFILE_USE
FAIL: gcc.dg/tree-prof/val-prof-3.c compilation,  -fprofile-generate -D_PROFILE_GENERATE
UNRESOLVED: gcc.dg/tree-prof/val-prof-3.c execution,    -fprofile-generate -D_PROFILE_GENERATE
UNRESOLVED: gcc.dg/tree-prof/val-prof-3.c compilation,  -fprofile-use -D_PROFILE_USE
UNRESOLVED: gcc.dg/tree-prof/val-prof-3.c execution,    -fprofile-use -D_PROFILE_USE
FAIL: gcc.dg/tree-prof/val-prof-4.c compilation,  -fprofile-generate -D_PROFILE_GENERATE
UNRESOLVED: gcc.dg/tree-prof/val-prof-4.c execution,    -fprofile-generate -D_PROFILE_GENERATE
UNRESOLVED: gcc.dg/tree-prof/val-prof-4.c compilation,  -fprofile-use -D_PROFILE_USE
UNRESOLVED: gcc.dg/tree-prof/val-prof-4.c execution,    -fprofile-use -D_PROFILE_USE
FAIL: gcc.dg/tree-prof/val-prof-5.c compilation,  -fprofile-generate -D_PROFILE_GENERATE
UNRESOLVED: gcc.dg/tree-prof/val-prof-5.c execution,    -fprofile-generate -D_PROFILE_GENERATE
UNRESOLVED: gcc.dg/tree-prof/val-prof-5.c compilation,  -fprofile-use -D_PROFILE_USE
UNRESOLVED: gcc.dg/tree-prof/val-prof-5.c execution,    -fprofile-use -D_PROFILE_USE
FAIL: gcc.dg/tree-prof/val-prof-6.c compilation,  -fprofile-generate -D_PROFILE_GENERATE
UNRESOLVED: gcc.dg/tree-prof/val-prof-6.c execution,    -fprofile-generate -D_PROFILE_GENERATE
UNRESOLVED: gcc.dg/tree-prof/val-prof-6.c compilation,  -fprofile-use -D_PROFILE_USE
UNRESOLVED: gcc.dg/tree-prof/val-prof-6.c execution,    -fprofile-use -D_PROFILE_USE
FAIL: gcc.dg/tree-prof/wcoverage-mismatch.c compilation,  -fprofile-generate -D_PROFILE_GENERATE
UNRESOLVED: gcc.dg/tree-prof/wcoverage-mismatch.c execution,    -fprofile-generate -D_PROFILE_GENERATE
UNRESOLVED: gcc.dg/tree-prof/wcoverage-mismatch.c compilation,  -fprofile-use -D_PROFILE_USE
UNRESOLVED: gcc.dg/tree-prof/wcoverage-mismatch.c execution,    -fprofile-use -D_PROFILE_USE
FAIL: gcc.misc-tests/bprob-1.c execution: file bprob-1.gcda does not exist,  -fprofile-arcs
UNRESOLVED: gcc.misc-tests/bprob-1.c compilation,  -fbranch-probabilities
UNRESOLVED: gcc.misc-tests/bprob-1.c execution,    -fbranch-probabilities
FAIL: gcc.misc-tests/bprob-2.c execution: file bprob-2.gcda does not exist,  -fprofile-arcs
UNRESOLVED: gcc.misc-tests/bprob-2.c compilation,  -fbranch-probabilities
UNRESOLVED: gcc.misc-tests/bprob-2.c execution,    -fbranch-probabilities

		=== gcc Summary ===

# of expected passes		43961
# of unexpected failures	65
# of unexpected successes	1
# of expected failures		86
# of unresolved testcases	101
# of untested testcases		35
# of unsupported tests		376
/home/mstein/sim/trunk/sh-elf/build/gcc/xgcc  version 4.3.0 20080126 (experimental) [trunk revision 131877] (GCC) 


Compiler version: 4.3.0 20080126 (experimental) [trunk revision 131877] (GCC) gcc 
Platform: sh-unknown-elf
configure flags: --target=sh-elf --prefix=/n/11/mstein/cross-local/sh-elf --enable-languages=c --disable-nls --disable-build-warnings --with-ld=/n/11/mstein/cross-local/sh-elf/bin/sh-elf-ld --with-as=/n/11/mstein/cross-local/sh-elf/bin/sh-elf-as --disable-libssp --with-mpfr=/n/11/mstein/mpfr-2.3.0


Index Nav: [Date Index] [Subject Index] [Author Index] [Thread Index]
Message Nav: [Date Prev] [Date Next] [Thread Prev] [Thread Next]