This is the mail archive of the gcc-testresults@gcc.gnu.org mailing list for the GCC project.


Index Nav: [Date Index] [Subject Index] [Author Index] [Thread Index]
Message Nav: [Date Prev] [Date Next] [Thread Prev] [Thread Next]
Other format: [Raw text]

Results for 4.3.0 20080126 (experimental) [trunk revision 131877] (GCC) gcc testsuite on m32c-unknown-elf


Debian 4 on x86_64
cross tool versions:
GNU assembler (GNU Binutils) 2.18.50.20071125
GNU gdb 6.7.50.20071124-cvs
GNU ld (GNU Binutils) 2.18.50.20071125

GNU Make 3.81
expect version 5.43.0
host gcc version: gcc (GCC) 4.3.0 20080126 (experimental) [trunk revision 131877]
LAST_UPDATED: Sat Jan 26 23:02:21 UTC 2008 (revision 131877)

Target is m32c-unknown-elf
Host   is x86_64-unknown-linux-gnu

		=== gcc tests ===


Running target m32c-sim
FAIL: gcc.c-torture/compile/930623-1.c  -O0  (internal compiler error)
FAIL: gcc.c-torture/compile/930623-1.c  -O0  (test for excess errors)
FAIL: gcc.c-torture/compile/930623-1.c  -O1  (internal compiler error)
FAIL: gcc.c-torture/compile/930623-1.c  -O1  (test for excess errors)
FAIL: gcc.c-torture/compile/930623-1.c  -O2  (internal compiler error)
FAIL: gcc.c-torture/compile/930623-1.c  -O2  (test for excess errors)
FAIL: gcc.c-torture/compile/930623-1.c  -O3 -fomit-frame-pointer  (internal compiler error)
FAIL: gcc.c-torture/compile/930623-1.c  -O3 -fomit-frame-pointer  (test for excess errors)
FAIL: gcc.c-torture/compile/930623-1.c  -O3 -g  (internal compiler error)
FAIL: gcc.c-torture/compile/930623-1.c  -O3 -g  (test for excess errors)
FAIL: gcc.c-torture/compile/930623-1.c  -Os  (internal compiler error)
FAIL: gcc.c-torture/compile/930623-1.c  -Os  (test for excess errors)
FAIL: gcc.c-torture/compile/limits-stringlit.c  -O0  (test for excess errors)
FAIL: gcc.c-torture/compile/limits-stringlit.c  -O1  (test for excess errors)
FAIL: gcc.c-torture/compile/limits-stringlit.c  -O2  (test for excess errors)
FAIL: gcc.c-torture/compile/limits-stringlit.c  -O3 -fomit-frame-pointer  (test for excess errors)
FAIL: gcc.c-torture/compile/limits-stringlit.c  -O3 -g  (test for excess errors)
FAIL: gcc.c-torture/compile/limits-stringlit.c  -Os  (test for excess errors)
FAIL: gcc.c-torture/compile/limits-structnest.c  -O2  (test for excess errors)
FAIL: gcc.c-torture/compile/limits-structnest.c  -O3 -fomit-frame-pointer  (test for excess errors)
FAIL: gcc.c-torture/compile/limits-structnest.c  -O3 -g  (test for excess errors)
FAIL: gcc.c-torture/compile/limits-structnest.c  -Os  (test for excess errors)
FAIL: gcc.c-torture/execute/builtins/pr23484-chk.c execution,  -O1 
FAIL: gcc.c-torture/execute/builtins/pr23484-chk.c execution,  -O2 
FAIL: gcc.c-torture/execute/builtins/pr23484-chk.c execution,  -O3 -fomit-frame-pointer 
FAIL: gcc.c-torture/execute/builtins/pr23484-chk.c execution,  -O3 -g 
FAIL: gcc.c-torture/execute/builtins/pr23484-chk.c execution,  -Os 
FAIL: gcc.c-torture/execute/builtins/strcat-chk.c execution,  -O3 -fomit-frame-pointer -funroll-all-loops -finline-functions 
FAIL: gcc.c-torture/execute/builtins/strncat-chk.c execution,  -O3 -fomit-frame-pointer -funroll-all-loops -finline-functions 
FAIL: gcc.c-torture/execute/20060420-1.c execution,  -O1 
FAIL: gcc.c-torture/execute/20071211-1.c compilation,  -O0 
UNRESOLVED: gcc.c-torture/execute/20071211-1.c execution,  -O0 
FAIL: gcc.c-torture/execute/20071211-1.c compilation,  -O1 
UNRESOLVED: gcc.c-torture/execute/20071211-1.c execution,  -O1 
FAIL: gcc.c-torture/execute/20071211-1.c compilation,  -O2 
UNRESOLVED: gcc.c-torture/execute/20071211-1.c execution,  -O2 
FAIL: gcc.c-torture/execute/20071211-1.c compilation,  -O3 -fomit-frame-pointer 
UNRESOLVED: gcc.c-torture/execute/20071211-1.c execution,  -O3 -fomit-frame-pointer 
FAIL: gcc.c-torture/execute/20071211-1.c compilation,  -O3 -g 
UNRESOLVED: gcc.c-torture/execute/20071211-1.c execution,  -O3 -g 
FAIL: gcc.c-torture/execute/20071211-1.c compilation,  -Os 
UNRESOLVED: gcc.c-torture/execute/20071211-1.c execution,  -Os 
WARNING: program timed out.
FAIL: gcc.c-torture/execute/arith-rand-ll.c execution,  -O0 
WARNING: program timed out.
FAIL: gcc.c-torture/execute/arith-rand-ll.c execution,  -O3 -fomit-frame-pointer 
WARNING: program timed out.
FAIL: gcc.c-torture/execute/arith-rand-ll.c execution,  -O3 -g 
FAIL: gcc.c-torture/execute/builtin-bitops-1.c compilation,  -O0 
UNRESOLVED: gcc.c-torture/execute/builtin-bitops-1.c execution,  -O0 
FAIL: gcc.c-torture/execute/builtin-bitops-1.c compilation,  -O1 
UNRESOLVED: gcc.c-torture/execute/builtin-bitops-1.c execution,  -O1 
FAIL: gcc.c-torture/execute/builtin-bitops-1.c compilation,  -O2 
UNRESOLVED: gcc.c-torture/execute/builtin-bitops-1.c execution,  -O2 
FAIL: gcc.c-torture/execute/builtin-bitops-1.c compilation,  -O3 -fomit-frame-pointer 
UNRESOLVED: gcc.c-torture/execute/builtin-bitops-1.c execution,  -O3 -fomit-frame-pointer 
FAIL: gcc.c-torture/execute/builtin-bitops-1.c compilation,  -O3 -fomit-frame-pointer -funroll-loops 
UNRESOLVED: gcc.c-torture/execute/builtin-bitops-1.c execution,  -O3 -fomit-frame-pointer -funroll-loops 
FAIL: gcc.c-torture/execute/builtin-bitops-1.c compilation,  -O3 -fomit-frame-pointer -funroll-all-loops -finline-functions 
UNRESOLVED: gcc.c-torture/execute/builtin-bitops-1.c execution,  -O3 -fomit-frame-pointer -funroll-all-loops -finline-functions 
FAIL: gcc.c-torture/execute/builtin-bitops-1.c compilation,  -O3 -g 
UNRESOLVED: gcc.c-torture/execute/builtin-bitops-1.c execution,  -O3 -g 
FAIL: gcc.c-torture/execute/builtin-bitops-1.c compilation,  -Os 
UNRESOLVED: gcc.c-torture/execute/builtin-bitops-1.c execution,  -Os 
FAIL: gcc.c-torture/execute/ffs-1.c compilation,  -O0 
UNRESOLVED: gcc.c-torture/execute/ffs-1.c execution,  -O0 
FAIL: gcc.c-torture/execute/ffs-1.c compilation,  -O1 
UNRESOLVED: gcc.c-torture/execute/ffs-1.c execution,  -O1 
FAIL: gcc.c-torture/execute/ffs-1.c compilation,  -O2 
UNRESOLVED: gcc.c-torture/execute/ffs-1.c execution,  -O2 
FAIL: gcc.c-torture/execute/ffs-1.c compilation,  -O3 -fomit-frame-pointer 
UNRESOLVED: gcc.c-torture/execute/ffs-1.c execution,  -O3 -fomit-frame-pointer 
FAIL: gcc.c-torture/execute/ffs-1.c compilation,  -O3 -g 
UNRESOLVED: gcc.c-torture/execute/ffs-1.c execution,  -O3 -g 
FAIL: gcc.c-torture/execute/ffs-1.c compilation,  -Os 
UNRESOLVED: gcc.c-torture/execute/ffs-1.c execution,  -Os 
FAIL: gcc.c-torture/execute/ffs-2.c compilation,  -O0 
UNRESOLVED: gcc.c-torture/execute/ffs-2.c execution,  -O0 
FAIL: gcc.c-torture/execute/ffs-2.c compilation,  -O1 
UNRESOLVED: gcc.c-torture/execute/ffs-2.c execution,  -O1 
FAIL: gcc.c-torture/execute/ffs-2.c compilation,  -O2 
UNRESOLVED: gcc.c-torture/execute/ffs-2.c execution,  -O2 
FAIL: gcc.c-torture/execute/ffs-2.c compilation,  -O3 -fomit-frame-pointer 
UNRESOLVED: gcc.c-torture/execute/ffs-2.c execution,  -O3 -fomit-frame-pointer 
FAIL: gcc.c-torture/execute/ffs-2.c compilation,  -O3 -fomit-frame-pointer -funroll-loops 
UNRESOLVED: gcc.c-torture/execute/ffs-2.c execution,  -O3 -fomit-frame-pointer -funroll-loops 
FAIL: gcc.c-torture/execute/ffs-2.c compilation,  -O3 -fomit-frame-pointer -funroll-all-loops -finline-functions 
UNRESOLVED: gcc.c-torture/execute/ffs-2.c execution,  -O3 -fomit-frame-pointer -funroll-all-loops -finline-functions 
FAIL: gcc.c-torture/execute/ffs-2.c compilation,  -O3 -g 
UNRESOLVED: gcc.c-torture/execute/ffs-2.c execution,  -O3 -g 
FAIL: gcc.c-torture/execute/ffs-2.c compilation,  -Os 
UNRESOLVED: gcc.c-torture/execute/ffs-2.c execution,  -Os 
WARNING: program timed out.
FAIL: gcc.dg/compat/scalar-by-value-1 c_compat_x_tst.o compile
UNRESOLVED: gcc.dg/compat/scalar-by-value-1 c_compat_x_tst.o-c_compat_y_tst.o link 
UNRESOLVED: gcc.dg/compat/scalar-by-value-1 c_compat_x_tst.o-c_compat_y_tst.o execute 
WARNING: program timed out.
FAIL: gcc.dg/compat/scalar-by-value-3 c_compat_x_tst.o compile
UNRESOLVED: gcc.dg/compat/scalar-by-value-3 c_compat_x_tst.o-c_compat_y_tst.o link 
UNRESOLVED: gcc.dg/compat/scalar-by-value-3 c_compat_x_tst.o-c_compat_y_tst.o execute 
WARNING: program timed out.
FAIL: gcc.dg/compat/struct-by-value-10 c_compat_x_tst.o compile
UNRESOLVED: gcc.dg/compat/struct-by-value-10 c_compat_x_tst.o-c_compat_y_tst.o link 
UNRESOLVED: gcc.dg/compat/struct-by-value-10 c_compat_x_tst.o-c_compat_y_tst.o execute 
WARNING: program timed out.
FAIL: gcc.dg/compat/struct-by-value-12 c_compat_x_tst.o compile
UNRESOLVED: gcc.dg/compat/struct-by-value-12 c_compat_x_tst.o-c_compat_y_tst.o link 
UNRESOLVED: gcc.dg/compat/struct-by-value-12 c_compat_x_tst.o-c_compat_y_tst.o execute 
FAIL: gcc.dg/compat/struct-layout-1 c_compat_x_tst.o compile
FAIL: gcc.dg/compat/struct-layout-1 c_compat_y_tst.o compile
UNRESOLVED: gcc.dg/compat/struct-layout-1 c_compat_x_tst.o-c_compat_y_tst.o link 
UNRESOLVED: gcc.dg/compat/struct-layout-1 c_compat_x_tst.o-c_compat_y_tst.o execute 
WARNING: Could not compile gcc.dg/compat/struct-layout-1 generator
FAIL: gcc.dg/cpp/_Pragma6.c (test for excess errors)
FAIL: gcc.dg/Wconversion-5.c  (test for warnings, line 22)
FAIL: gcc.dg/Wconversion-real-integer.c  (test for warnings, line 34)
FAIL: gcc.dg/Wconversion-real-integer.c  (test for warnings, line 35)
FAIL: gcc.dg/Wconversion-real-integer.c  (test for warnings, line 38)
FAIL: gcc.dg/Wconversion-real-integer.c  (test for warnings, line 39)
FAIL: gcc.dg/Wconversion-real-integer.c  (test for warnings, line 40)
FAIL: gcc.dg/Wconversion-real-integer.c  (test for warnings, line 41)
FAIL: gcc.dg/Wconversion-real-integer.c (test for excess errors)
FAIL: gcc.dg/Wtype-limits-Wextra.c  (test for warnings, line 25)
FAIL: gcc.dg/Wtype-limits-Wextra.c  (test for warnings, line 26)
FAIL: gcc.dg/Wtype-limits-Wextra.c  (test for warnings, line 27)
FAIL: gcc.dg/Wtype-limits-Wextra.c  (test for warnings, line 28)
FAIL: gcc.dg/Wtype-limits-Wextra.c (test for excess errors)
FAIL: gcc.dg/Wtype-limits.c  (test for warnings, line 25)
FAIL: gcc.dg/Wtype-limits.c  (test for warnings, line 26)
FAIL: gcc.dg/Wtype-limits.c  (test for warnings, line 27)
FAIL: gcc.dg/Wtype-limits.c  (test for warnings, line 28)
FAIL: gcc.dg/Wtype-limits.c (test for excess errors)
FAIL: gcc.dg/asm-4.c (internal compiler error)
FAIL: gcc.dg/asm-4.c (test for excess errors)
WARNING: program timed out.
FAIL: gcc.dg/binary-constants-1.c (test for excess errors)
FAIL: gcc.dg/builtin-apply1.c (internal compiler error)
FAIL: gcc.dg/builtin-apply1.c (test for excess errors)
FAIL: gcc.dg/builtin-apply2.c (internal compiler error)
FAIL: gcc.dg/builtin-apply2.c (test for excess errors)
UNRESOLVED: gcc.dg/builtin-apply2.c compilation failed to produce executable
FAIL: gcc.dg/builtin-apply3.c (internal compiler error)
FAIL: gcc.dg/builtin-apply3.c (test for excess errors)
UNRESOLVED: gcc.dg/builtin-apply3.c compilation failed to produce executable
FAIL: gcc.dg/builtin-apply4.c (internal compiler error)
FAIL: gcc.dg/builtin-apply4.c (test for excess errors)
UNRESOLVED: gcc.dg/builtin-apply4.c compilation failed to produce executable
FAIL: gcc.dg/builtin-return-1.c (internal compiler error)
FAIL: gcc.dg/builtin-return-1.c (test for excess errors)
UNRESOLVED: gcc.dg/builtin-return-1.c compilation failed to produce executable
FAIL: gcc.dg/cleanup-12.c execution test
FAIL: gcc.dg/cleanup-5.c execution test
FAIL: gcc.dg/fold-eqandshift-3.c scan-tree-dump-times original "\\(a & 1073741824\\) != 0" 1
FAIL: gcc.dg/fold-eqandshift-3.c scan-tree-dump-times original "\\(b & 1073741824\\) != 0" 1
FAIL: gcc.dg/ftrapv-1.c (test for excess errors)
UNRESOLVED: gcc.dg/ftrapv-1.c compilation failed to produce executable
FAIL: gcc.dg/ftrapv-2.c (test for excess errors)
UNRESOLVED: gcc.dg/ftrapv-2.c compilation failed to produce executable
FAIL: gcc.dg/initpri1.c execution test
FAIL: gcc.dg/memcpy-1.c scan-tree-dump-times optimized "nasty_local" 0
FAIL: gcc.dg/multiple-overflow-warn-3.c  (test for warnings, line 8)
FAIL: gcc.dg/multiple-overflow-warn-3.c (test for excess errors)
FAIL: gcc.dg/pr27639.c (test for excess errors)
FAIL: gcc.dg/pr27758.c (test for excess errors)
UNRESOLVED: gcc.dg/pr27758.c compilation failed to produce executable
FAIL: gcc.dg/pr28755.c (test for excess errors)
FAIL: gcc.dg/pr28755.c scan-assembler-times 2112543726|7deadbee 2
XPASS: gcc.dg/pr30957-1.c execution test
FAIL: gcc.dg/pr30957-1.c scan-rtl-dump loop2_unroll "Expanding Accumulator"
FAIL: gcc.dg/pr32912-2.c execution test
FAIL: gcc.dg/pr34225.c (test for excess errors)
FAIL: gcc.dg/setjmp-1.c spurious clobbered warning (test for bogus messages, line 16)
FAIL: gcc.dg/sibcall-3.c execution test
FAIL: gcc.dg/sibcall-4.c execution test
FAIL: gcc.dg/var-expand1.c scan-rtl-dump loop2_unroll "Expanding Accumulator"
FAIL: gcc.dg/special/gcsec-1.c (test for excess errors)
FAIL: gcc.dg/torture/builtin-frexp-1.c  -O0  (test for excess errors)
FAIL: gcc.dg/torture/builtin-frexp-1.c  -O1  (test for excess errors)
FAIL: gcc.dg/torture/builtin-frexp-1.c  -O2  (test for excess errors)
FAIL: gcc.dg/torture/builtin-frexp-1.c  -O3 -fomit-frame-pointer  (test for excess errors)
FAIL: gcc.dg/torture/builtin-frexp-1.c  -O3 -fomit-frame-pointer -funroll-loops  (test for excess errors)
FAIL: gcc.dg/torture/builtin-frexp-1.c  -O3 -fomit-frame-pointer -funroll-all-loops -finline-functions  (test for excess errors)
FAIL: gcc.dg/torture/builtin-frexp-1.c  -O3 -g  (test for excess errors)
FAIL: gcc.dg/torture/builtin-frexp-1.c  -Os  (test for excess errors)
FAIL: gcc.dg/torture/builtin-math-2.c  -O0  (test for excess errors)
ERROR: gcc.dg/torture/builtin-math-2.c  -O0 : error executing dg-final: no files matched glob pattern "builtin-math-2.c.[0-9][0-9][0-9]t.original"
UNRESOLVED: gcc.dg/torture/builtin-math-2.c  -O0 : error executing dg-final: no files matched glob pattern "builtin-math-2.c.[0-9][0-9][0-9]t.original"
FAIL: gcc.dg/torture/builtin-math-2.c  -O1  (test for excess errors)
ERROR: gcc.dg/torture/builtin-math-2.c  -O1 : error executing dg-final: no files matched glob pattern "builtin-math-2.c.[0-9][0-9][0-9]t.original"
UNRESOLVED: gcc.dg/torture/builtin-math-2.c  -O1 : error executing dg-final: no files matched glob pattern "builtin-math-2.c.[0-9][0-9][0-9]t.original"
FAIL: gcc.dg/torture/builtin-math-2.c  -O2  (test for excess errors)
ERROR: gcc.dg/torture/builtin-math-2.c  -O2 : error executing dg-final: no files matched glob pattern "builtin-math-2.c.[0-9][0-9][0-9]t.original"
UNRESOLVED: gcc.dg/torture/builtin-math-2.c  -O2 : error executing dg-final: no files matched glob pattern "builtin-math-2.c.[0-9][0-9][0-9]t.original"
FAIL: gcc.dg/torture/builtin-math-2.c  -O3 -fomit-frame-pointer  (test for excess errors)
ERROR: gcc.dg/torture/builtin-math-2.c  -O3 -fomit-frame-pointer : error executing dg-final: no files matched glob pattern "builtin-math-2.c.[0-9][0-9][0-9]t.original"
UNRESOLVED: gcc.dg/torture/builtin-math-2.c  -O3 -fomit-frame-pointer : error executing dg-final: no files matched glob pattern "builtin-math-2.c.[0-9][0-9][0-9]t.original"
FAIL: gcc.dg/torture/builtin-math-2.c  -O3 -fomit-frame-pointer -funroll-loops  (test for excess errors)
ERROR: gcc.dg/torture/builtin-math-2.c  -O3 -fomit-frame-pointer -funroll-loops : error executing dg-final: no files matched glob pattern "builtin-math-2.c.[0-9][0-9][0-9]t.original"
UNRESOLVED: gcc.dg/torture/builtin-math-2.c  -O3 -fomit-frame-pointer -funroll-loops : error executing dg-final: no files matched glob pattern "builtin-math-2.c.[0-9][0-9][0-9]t.original"
FAIL: gcc.dg/torture/builtin-math-2.c  -O3 -fomit-frame-pointer -funroll-all-loops -finline-functions  (test for excess errors)
ERROR: gcc.dg/torture/builtin-math-2.c  -O3 -fomit-frame-pointer -funroll-all-loops -finline-functions : error executing dg-final: no files matched glob pattern "builtin-math-2.c.[0-9][0-9][0-9]t.original"
UNRESOLVED: gcc.dg/torture/builtin-math-2.c  -O3 -fomit-frame-pointer -funroll-all-loops -finline-functions : error executing dg-final: no files matched glob pattern "builtin-math-2.c.[0-9][0-9][0-9]t.original"
FAIL: gcc.dg/torture/builtin-math-2.c  -O3 -g  (test for excess errors)
ERROR: gcc.dg/torture/builtin-math-2.c  -O3 -g : error executing dg-final: no files matched glob pattern "builtin-math-2.c.[0-9][0-9][0-9]t.original"
UNRESOLVED: gcc.dg/torture/builtin-math-2.c  -O3 -g : error executing dg-final: no files matched glob pattern "builtin-math-2.c.[0-9][0-9][0-9]t.original"
FAIL: gcc.dg/torture/builtin-math-2.c  -Os  (test for excess errors)
ERROR: gcc.dg/torture/builtin-math-2.c  -Os : error executing dg-final: no files matched glob pattern "builtin-math-2.c.[0-9][0-9][0-9]t.original"
UNRESOLVED: gcc.dg/torture/builtin-math-2.c  -Os : error executing dg-final: no files matched glob pattern "builtin-math-2.c.[0-9][0-9][0-9]t.original"
FAIL: gcc.dg/torture/builtin-math-4.c  -O0  (test for excess errors)
FAIL: gcc.dg/torture/builtin-math-4.c  -O1  (test for excess errors)
FAIL: gcc.dg/torture/builtin-math-4.c  -O2  (test for excess errors)
FAIL: gcc.dg/torture/builtin-math-4.c  -O3 -fomit-frame-pointer  (test for excess errors)
FAIL: gcc.dg/torture/builtin-math-4.c  -O3 -fomit-frame-pointer -funroll-loops  (test for excess errors)
FAIL: gcc.dg/torture/builtin-math-4.c  -O3 -fomit-frame-pointer -funroll-all-loops -finline-functions  (test for excess errors)
FAIL: gcc.dg/torture/builtin-math-4.c  -O3 -g  (test for excess errors)
FAIL: gcc.dg/torture/builtin-math-4.c  -Os  (test for excess errors)
FAIL: gcc.dg/torture/builtin-pow-mpfr-1.c  -O0  scan-tree-dump original "pow"
FAIL: gcc.dg/torture/builtin-pow-mpfr-1.c  -O1  scan-tree-dump original "pow"
FAIL: gcc.dg/torture/builtin-pow-mpfr-1.c  -O2  scan-tree-dump original "pow"
FAIL: gcc.dg/torture/builtin-pow-mpfr-1.c  -O3 -fomit-frame-pointer  scan-tree-dump original "pow"
FAIL: gcc.dg/torture/builtin-pow-mpfr-1.c  -O3 -g  scan-tree-dump original "pow"
FAIL: gcc.dg/torture/builtin-pow-mpfr-1.c  -Os  scan-tree-dump original "pow"
XPASS: gcc.dg/tree-ssa/20040204-1.c scan-tree-dump-times optimized "link_error" 0
FAIL: gcc.dg/tree-ssa/alias-15.c scan-tree-dump salias "SFT.5 created for var m offset 128"
FAIL: gcc.dg/tree-ssa/gen-vect-11.c scan-tree-dump-times vect "vectorized 1 loops" 1
FAIL: gcc.dg/tree-ssa/gen-vect-25.c scan-tree-dump-times vect "vectorized 2 loops" 1
FAIL: gcc.dg/tree-ssa/ifc-20040816-2.c (test for excess errors)
FAIL: gcc.dg/tree-ssa/ifc-20040816-2.c scan-tree-dump-times ifcvt "Applying if-conversion" 1
FAIL: gcc.dg/tree-ssa/pr32540-1.c (test for excess errors)
FAIL: gcc.dg/tree-ssa/pr32540-2.c (test for excess errors)
FAIL: gcc.dg/tree-ssa/pr33920.c (test for excess errors)

		=== gcc Summary ===

# of expected passes		43183
# of unexpected failures	159
# of unexpected successes	2
# of expected failures		90
# of unresolved testcases	53
# of untested testcases		42
# of unsupported tests		517
/home/mstein/sim/trunk/m32c-elf/build/gcc/xgcc  version 4.3.0 20080126 (experimental) [trunk revision 131877] (GCC) 


Compiler version: 4.3.0 20080126 (experimental) [trunk revision 131877] (GCC) gcc 
Platform: m32c-unknown-elf
configure flags: --target=m32c-elf --prefix=/n/11/mstein/cross-local/m32c-elf --enable-languages=c --disable-nls --disable-build-warnings --with-ld=/n/11/mstein/cross-local/m32c-elf/bin/m32c-elf-ld --with-as=/n/11/mstein/cross-local/m32c-elf/bin/m32c-elf-as --disable-libssp --with-mpfr=/n/11/mstein/mpfr-2.3.0


Index Nav: [Date Index] [Subject Index] [Author Index] [Thread Index]
Message Nav: [Date Prev] [Date Next] [Thread Prev] [Thread Next]