This is the mail archive of the gcc-testresults@gcc.gnu.org mailing list for the GCC project.


Index Nav: [Date Index] [Subject Index] [Author Index] [Thread Index]
Message Nav: [Date Prev] [Date Next] [Thread Prev] [Thread Next]
Other format: [Raw text]

Results for 4.3.0 20080124 (experimental) [trunk revision 131778] (GCC) gcc testsuite on xstormy16-unknown-elf


LAST_UPDATED: Fri Jan 25 08:33:32 UTC 2008 (revision 131818)

Target is xstormy16-unknown-elf
Host   is i686-pc-linux-gnu

		=== gcc tests ===


Running target xstormy16-sid/-msim
FAIL: gcc.c-torture/compile/20000403-1.c  -O3 -fomit-frame-pointer -funroll-loops  (internal compiler error)
FAIL: gcc.c-torture/compile/20000403-1.c  -O3 -fomit-frame-pointer -funroll-loops  (test for excess errors)
FAIL: gcc.c-torture/compile/20000403-1.c  -O3 -fomit-frame-pointer -funroll-all-loops -finline-functions  (internal compiler error)
FAIL: gcc.c-torture/compile/20000403-1.c  -O3 -fomit-frame-pointer -funroll-all-loops -finline-functions  (test for excess errors)
FAIL: gcc.c-torture/compile/20000804-1.c  -O0  (test for excess errors)
FAIL: gcc.c-torture/compile/20010102-1.c  -O3 -fomit-frame-pointer -funroll-loops  (internal compiler error)
FAIL: gcc.c-torture/compile/20010102-1.c  -O3 -fomit-frame-pointer -funroll-loops  (test for excess errors)
FAIL: gcc.c-torture/compile/20010102-1.c  -O3 -fomit-frame-pointer -funroll-all-loops -finline-functions  (internal compiler error)
FAIL: gcc.c-torture/compile/20010102-1.c  -O3 -fomit-frame-pointer -funroll-all-loops -finline-functions  (test for excess errors)
FAIL: gcc.c-torture/compile/20010327-1.c  -O0  (test for excess errors)
FAIL: gcc.c-torture/compile/20010327-1.c  -O1  (test for excess errors)
FAIL: gcc.c-torture/compile/20010327-1.c  -O2  (test for excess errors)
FAIL: gcc.c-torture/compile/20010327-1.c  -O3 -fomit-frame-pointer  (test for excess errors)
FAIL: gcc.c-torture/compile/20010327-1.c  -O3 -g  (test for excess errors)
FAIL: gcc.c-torture/compile/20010327-1.c  -Os  (test for excess errors)
FAIL: gcc.c-torture/compile/20011114-4.c  -O3 -fomit-frame-pointer -funroll-loops  (internal compiler error)
FAIL: gcc.c-torture/compile/20011114-4.c  -O3 -fomit-frame-pointer -funroll-loops  (test for excess errors)
FAIL: gcc.c-torture/compile/20011114-4.c  -O3 -fomit-frame-pointer -funroll-all-loops -finline-functions  (internal compiler error)
FAIL: gcc.c-torture/compile/20011114-4.c  -O3 -fomit-frame-pointer -funroll-all-loops -finline-functions  (test for excess errors)
FAIL: gcc.c-torture/compile/20020604-1.c  -O0  (test for excess errors)
FAIL: gcc.c-torture/compile/20020604-1.c  -O1  (test for excess errors)
FAIL: gcc.c-torture/compile/20020604-1.c  -O2  (test for excess errors)
FAIL: gcc.c-torture/compile/20020604-1.c  -O3 -fomit-frame-pointer  (test for excess errors)
FAIL: gcc.c-torture/compile/20020604-1.c  -O3 -fomit-frame-pointer -funroll-loops  (test for excess errors)
FAIL: gcc.c-torture/compile/20020604-1.c  -O3 -fomit-frame-pointer -funroll-all-loops -finline-functions  (test for excess errors)
FAIL: gcc.c-torture/compile/20020604-1.c  -O3 -g  (test for excess errors)
FAIL: gcc.c-torture/compile/20020604-1.c  -Os  (test for excess errors)
FAIL: gcc.c-torture/compile/20070129.c  -O2  (internal compiler error)
FAIL: gcc.c-torture/compile/20070129.c  -O2  (test for excess errors)
FAIL: gcc.c-torture/compile/20070129.c  -O3 -fomit-frame-pointer  (internal compiler error)
FAIL: gcc.c-torture/compile/20070129.c  -O3 -fomit-frame-pointer  (test for excess errors)
FAIL: gcc.c-torture/compile/20070129.c  -O3 -fomit-frame-pointer -funroll-loops  (internal compiler error)
FAIL: gcc.c-torture/compile/20070129.c  -O3 -fomit-frame-pointer -funroll-loops  (test for excess errors)
FAIL: gcc.c-torture/compile/20070129.c  -O3 -fomit-frame-pointer -funroll-all-loops -finline-functions  (internal compiler error)
FAIL: gcc.c-torture/compile/20070129.c  -O3 -fomit-frame-pointer -funroll-all-loops -finline-functions  (test for excess errors)
FAIL: gcc.c-torture/compile/20070129.c  -O3 -g  (internal compiler error)
FAIL: gcc.c-torture/compile/20070129.c  -O3 -g  (test for excess errors)
FAIL: gcc.c-torture/compile/20070129.c  -Os  (internal compiler error)
FAIL: gcc.c-torture/compile/20070129.c  -Os  (test for excess errors)
FAIL: gcc.c-torture/compile/920501-23.c  -O3 -fomit-frame-pointer -funroll-loops  (internal compiler error)
FAIL: gcc.c-torture/compile/920501-23.c  -O3 -fomit-frame-pointer -funroll-loops  (test for excess errors)
FAIL: gcc.c-torture/compile/920501-23.c  -O3 -fomit-frame-pointer -funroll-all-loops -finline-functions  (internal compiler error)
FAIL: gcc.c-torture/compile/920501-23.c  -O3 -fomit-frame-pointer -funroll-all-loops -finline-functions  (test for excess errors)
FAIL: gcc.c-torture/compile/920625-1.c  -O2  (test for excess errors)
FAIL: gcc.c-torture/compile/920625-1.c  -O3 -fomit-frame-pointer  (test for excess errors)
FAIL: gcc.c-torture/compile/920625-1.c  -O3 -fomit-frame-pointer -funroll-loops  (test for excess errors)
FAIL: gcc.c-torture/compile/920625-1.c  -O3 -fomit-frame-pointer -funroll-all-loops -finline-functions  (test for excess errors)
FAIL: gcc.c-torture/compile/920625-1.c  -O3 -g  (test for excess errors)
FAIL: gcc.c-torture/compile/921202-1.c  -O0  (internal compiler error)
FAIL: gcc.c-torture/compile/921202-1.c  -O0  (test for excess errors)
FAIL: gcc.c-torture/compile/930120-1.c  -O3 -fomit-frame-pointer -funroll-loops  (internal compiler error)
FAIL: gcc.c-torture/compile/930120-1.c  -O3 -fomit-frame-pointer -funroll-loops  (test for excess errors)
FAIL: gcc.c-torture/compile/930120-1.c  -O3 -fomit-frame-pointer -funroll-all-loops -finline-functions  (internal compiler error)
FAIL: gcc.c-torture/compile/930120-1.c  -O3 -fomit-frame-pointer -funroll-all-loops -finline-functions  (test for excess errors)
FAIL: gcc.c-torture/compile/930523-1.c  -O2  (internal compiler error)
FAIL: gcc.c-torture/compile/930523-1.c  -O2  (test for excess errors)
FAIL: gcc.c-torture/compile/930523-1.c  -O3 -fomit-frame-pointer  (internal compiler error)
FAIL: gcc.c-torture/compile/930523-1.c  -O3 -fomit-frame-pointer  (test for excess errors)
FAIL: gcc.c-torture/compile/930523-1.c  -O3 -fomit-frame-pointer -funroll-loops  (internal compiler error)
FAIL: gcc.c-torture/compile/930523-1.c  -O3 -fomit-frame-pointer -funroll-loops  (test for excess errors)
FAIL: gcc.c-torture/compile/930523-1.c  -O3 -fomit-frame-pointer -funroll-all-loops -finline-functions  (internal compiler error)
FAIL: gcc.c-torture/compile/930523-1.c  -O3 -fomit-frame-pointer -funroll-all-loops -finline-functions  (test for excess errors)
FAIL: gcc.c-torture/compile/930523-1.c  -O3 -g  (internal compiler error)
FAIL: gcc.c-torture/compile/930523-1.c  -O3 -g  (test for excess errors)
FAIL: gcc.c-torture/compile/930523-1.c  -Os  (internal compiler error)
FAIL: gcc.c-torture/compile/930523-1.c  -Os  (test for excess errors)
FAIL: gcc.c-torture/compile/931003-1.c  -O2  (internal compiler error)
FAIL: gcc.c-torture/compile/931003-1.c  -O2  (test for excess errors)
FAIL: gcc.c-torture/compile/931003-1.c  -O3 -fomit-frame-pointer  (internal compiler error)
FAIL: gcc.c-torture/compile/931003-1.c  -O3 -fomit-frame-pointer  (test for excess errors)
FAIL: gcc.c-torture/compile/931003-1.c  -O3 -fomit-frame-pointer -funroll-loops  (internal compiler error)
FAIL: gcc.c-torture/compile/931003-1.c  -O3 -fomit-frame-pointer -funroll-loops  (test for excess errors)
FAIL: gcc.c-torture/compile/931003-1.c  -O3 -fomit-frame-pointer -funroll-all-loops -finline-functions  (internal compiler error)
FAIL: gcc.c-torture/compile/931003-1.c  -O3 -fomit-frame-pointer -funroll-all-loops -finline-functions  (test for excess errors)
FAIL: gcc.c-torture/compile/931003-1.c  -O3 -g  (internal compiler error)
FAIL: gcc.c-torture/compile/931003-1.c  -O3 -g  (test for excess errors)
FAIL: gcc.c-torture/compile/951222-1.c  -O0  (internal compiler error)
FAIL: gcc.c-torture/compile/951222-1.c  -O0  (test for excess errors)
FAIL: gcc.c-torture/compile/990517-1.c  -O3 -fomit-frame-pointer -funroll-loops  (internal compiler error)
FAIL: gcc.c-torture/compile/990517-1.c  -O3 -fomit-frame-pointer -funroll-loops  (test for excess errors)
FAIL: gcc.c-torture/compile/990517-1.c  -O3 -fomit-frame-pointer -funroll-all-loops -finline-functions  (internal compiler error)
FAIL: gcc.c-torture/compile/990517-1.c  -O3 -fomit-frame-pointer -funroll-all-loops -finline-functions  (test for excess errors)
XPASS: gcc.c-torture/compile/990617-1.c  -O0  (test for excess errors)
XPASS: gcc.c-torture/compile/990617-1.c  -O1  (test for excess errors)
XPASS: gcc.c-torture/compile/990617-1.c  -O2  (test for excess errors)
XPASS: gcc.c-torture/compile/990617-1.c  -O3 -fomit-frame-pointer  (test for excess errors)
XPASS: gcc.c-torture/compile/990617-1.c  -O3 -fomit-frame-pointer -funroll-loops  (test for excess errors)
XPASS: gcc.c-torture/compile/990617-1.c  -O3 -fomit-frame-pointer -funroll-all-loops -finline-functions  (test for excess errors)
XPASS: gcc.c-torture/compile/990617-1.c  -O3 -g  (test for excess errors)
XPASS: gcc.c-torture/compile/990617-1.c  -Os  (test for excess errors)
FAIL: gcc.c-torture/compile/991213-2.c  -O3 -fomit-frame-pointer -funroll-loops  (internal compiler error)
FAIL: gcc.c-torture/compile/991213-2.c  -O3 -fomit-frame-pointer -funroll-loops  (test for excess errors)
FAIL: gcc.c-torture/compile/991213-2.c  -O3 -fomit-frame-pointer -funroll-all-loops -finline-functions  (internal compiler error)
FAIL: gcc.c-torture/compile/991213-2.c  -O3 -fomit-frame-pointer -funroll-all-loops -finline-functions  (test for excess errors)
FAIL: gcc.c-torture/compile/limits-stringlit.c  -O0  (test for excess errors)
FAIL: gcc.c-torture/compile/limits-stringlit.c  -O1  (test for excess errors)
FAIL: gcc.c-torture/compile/limits-stringlit.c  -O2  (test for excess errors)
FAIL: gcc.c-torture/compile/limits-stringlit.c  -O3 -fomit-frame-pointer  (test for excess errors)
FAIL: gcc.c-torture/compile/limits-stringlit.c  -O3 -g  (test for excess errors)
FAIL: gcc.c-torture/compile/limits-stringlit.c  -Os  (test for excess errors)
FAIL: gcc.c-torture/compile/pr32349.c  -O3 -fomit-frame-pointer -funroll-loops  (internal compiler error)
FAIL: gcc.c-torture/compile/pr32349.c  -O3 -fomit-frame-pointer -funroll-loops  (test for excess errors)
FAIL: gcc.c-torture/compile/pr32349.c  -O3 -fomit-frame-pointer -funroll-all-loops -finline-functions  (internal compiler error)
FAIL: gcc.c-torture/compile/pr32349.c  -O3 -fomit-frame-pointer -funroll-all-loops -finline-functions  (test for excess errors)
FAIL: gcc.c-torture/compile/pr34458.c  -O0  (internal compiler error)
FAIL: gcc.c-torture/compile/pr34458.c  -O0  (test for excess errors)
FAIL: gcc.c-torture/execute/builtins/memmove-chk.c compilation,  -O1  (internal compiler error)
UNRESOLVED: gcc.c-torture/execute/builtins/memmove-chk.c execution,  -O1 
FAIL: gcc.c-torture/execute/builtins/memmove.c compilation,  -O1  (internal compiler error)
UNRESOLVED: gcc.c-torture/execute/builtins/memmove.c execution,  -O1 
FAIL: gcc.c-torture/execute/builtins/pr23484-chk.c compilation,  -O0  (internal compiler error)
UNRESOLVED: gcc.c-torture/execute/builtins/pr23484-chk.c execution,  -O0 
FAIL: gcc.c-torture/execute/builtins/pr23484-chk.c compilation,  -O1  (internal compiler error)
UNRESOLVED: gcc.c-torture/execute/builtins/pr23484-chk.c execution,  -O1 
FAIL: gcc.c-torture/execute/builtins/pr23484-chk.c compilation,  -O2  (internal compiler error)
UNRESOLVED: gcc.c-torture/execute/builtins/pr23484-chk.c execution,  -O2 
FAIL: gcc.c-torture/execute/builtins/pr23484-chk.c compilation,  -O3 -fomit-frame-pointer  (internal compiler error)
UNRESOLVED: gcc.c-torture/execute/builtins/pr23484-chk.c execution,  -O3 -fomit-frame-pointer 
FAIL: gcc.c-torture/execute/builtins/pr23484-chk.c compilation,  -O3 -g  (internal compiler error)
UNRESOLVED: gcc.c-torture/execute/builtins/pr23484-chk.c execution,  -O3 -g 
FAIL: gcc.c-torture/execute/builtins/pr23484-chk.c compilation,  -Os  (internal compiler error)
UNRESOLVED: gcc.c-torture/execute/builtins/pr23484-chk.c execution,  -Os 
FAIL: gcc.c-torture/execute/builtins/strcat-chk.c compilation,  -O1  (internal compiler error)
UNRESOLVED: gcc.c-torture/execute/builtins/strcat-chk.c execution,  -O1 
FAIL: gcc.c-torture/execute/builtins/strcat-chk.c compilation,  -O2  (internal compiler error)
UNRESOLVED: gcc.c-torture/execute/builtins/strcat-chk.c execution,  -O2 
FAIL: gcc.c-torture/execute/builtins/strcat-chk.c compilation,  -O3 -fomit-frame-pointer  (internal compiler error)
UNRESOLVED: gcc.c-torture/execute/builtins/strcat-chk.c execution,  -O3 -fomit-frame-pointer 
FAIL: gcc.c-torture/execute/builtins/strcat-chk.c compilation,  -O3 -fomit-frame-pointer -funroll-loops  (internal compiler error)
UNRESOLVED: gcc.c-torture/execute/builtins/strcat-chk.c execution,  -O3 -fomit-frame-pointer -funroll-loops 
FAIL: gcc.c-torture/execute/builtins/strcat-chk.c compilation,  -O3 -fomit-frame-pointer -funroll-all-loops -finline-functions  (internal compiler error)
UNRESOLVED: gcc.c-torture/execute/builtins/strcat-chk.c execution,  -O3 -fomit-frame-pointer -funroll-all-loops -finline-functions 
FAIL: gcc.c-torture/execute/builtins/strcat-chk.c compilation,  -O3 -g  (internal compiler error)
UNRESOLVED: gcc.c-torture/execute/builtins/strcat-chk.c execution,  -O3 -g 
FAIL: gcc.c-torture/execute/builtins/strcat-chk.c compilation,  -Os  (internal compiler error)
UNRESOLVED: gcc.c-torture/execute/builtins/strcat-chk.c execution,  -Os 
FAIL: gcc.c-torture/execute/builtins/strncat-chk.c compilation,  -O1  (internal compiler error)
UNRESOLVED: gcc.c-torture/execute/builtins/strncat-chk.c execution,  -O1 
FAIL: gcc.c-torture/execute/builtins/strncat-chk.c compilation,  -O2  (internal compiler error)
UNRESOLVED: gcc.c-torture/execute/builtins/strncat-chk.c execution,  -O2 
FAIL: gcc.c-torture/execute/builtins/strncat-chk.c compilation,  -O3 -fomit-frame-pointer  (internal compiler error)
UNRESOLVED: gcc.c-torture/execute/builtins/strncat-chk.c execution,  -O3 -fomit-frame-pointer 
FAIL: gcc.c-torture/execute/builtins/strncat-chk.c compilation,  -O3 -fomit-frame-pointer -funroll-loops  (internal compiler error)
UNRESOLVED: gcc.c-torture/execute/builtins/strncat-chk.c execution,  -O3 -fomit-frame-pointer -funroll-loops 
FAIL: gcc.c-torture/execute/builtins/strncat-chk.c compilation,  -O3 -fomit-frame-pointer -funroll-all-loops -finline-functions  (internal compiler error)
UNRESOLVED: gcc.c-torture/execute/builtins/strncat-chk.c execution,  -O3 -fomit-frame-pointer -funroll-all-loops -finline-functions 
FAIL: gcc.c-torture/execute/builtins/strncat-chk.c compilation,  -O3 -g  (internal compiler error)
UNRESOLVED: gcc.c-torture/execute/builtins/strncat-chk.c execution,  -O3 -g 
FAIL: gcc.c-torture/execute/builtins/strncat-chk.c compilation,  -Os  (internal compiler error)
UNRESOLVED: gcc.c-torture/execute/builtins/strncat-chk.c execution,  -Os 
FAIL: gcc.c-torture/execute/builtins/strncat.c compilation,  -Os  (internal compiler error)
UNRESOLVED: gcc.c-torture/execute/builtins/strncat.c execution,  -Os 
FAIL: gcc.c-torture/execute/builtins/strncpy-chk.c compilation,  -Os  (internal compiler error)
UNRESOLVED: gcc.c-torture/execute/builtins/strncpy-chk.c execution,  -Os 
FAIL: gcc.c-torture/execute/builtins/strncpy.c compilation,  -Os  (internal compiler error)
UNRESOLVED: gcc.c-torture/execute/builtins/strncpy.c execution,  -Os 
FAIL: gcc.c-torture/execute/20010129-1.c compilation,  -O3 -fomit-frame-pointer -funroll-loops  (internal compiler error)
UNRESOLVED: gcc.c-torture/execute/20010129-1.c execution,  -O3 -fomit-frame-pointer -funroll-loops 
FAIL: gcc.c-torture/execute/20010129-1.c compilation,  -O3 -fomit-frame-pointer -funroll-all-loops -finline-functions  (internal compiler error)
UNRESOLVED: gcc.c-torture/execute/20010129-1.c execution,  -O3 -fomit-frame-pointer -funroll-all-loops -finline-functions 
FAIL: gcc.c-torture/execute/20020412-1.c execution,  -O0 
FAIL: gcc.c-torture/execute/20020412-1.c execution,  -O1 
FAIL: gcc.c-torture/execute/20020412-1.c execution,  -O2 
FAIL: gcc.c-torture/execute/20020412-1.c execution,  -O3 -fomit-frame-pointer 
FAIL: gcc.c-torture/execute/20020412-1.c execution,  -O3 -fomit-frame-pointer -funroll-loops 
FAIL: gcc.c-torture/execute/20020412-1.c execution,  -O3 -fomit-frame-pointer -funroll-all-loops -finline-functions 
FAIL: gcc.c-torture/execute/20020412-1.c execution,  -O3 -g 
FAIL: gcc.c-torture/execute/20020412-1.c execution,  -Os 
FAIL: gcc.c-torture/execute/20020529-1.c compilation,  -O0  (internal compiler error)
UNRESOLVED: gcc.c-torture/execute/20020529-1.c execution,  -O0 
FAIL: gcc.c-torture/execute/20020529-1.c compilation,  -O1  (internal compiler error)
UNRESOLVED: gcc.c-torture/execute/20020529-1.c execution,  -O1 
FAIL: gcc.c-torture/execute/20020529-1.c compilation,  -O2  (internal compiler error)
UNRESOLVED: gcc.c-torture/execute/20020529-1.c execution,  -O2 
FAIL: gcc.c-torture/execute/20020529-1.c compilation,  -Os  (internal compiler error)
UNRESOLVED: gcc.c-torture/execute/20020529-1.c execution,  -Os 
FAIL: gcc.c-torture/execute/20030606-1.c compilation,  -O1  (internal compiler error)
UNRESOLVED: gcc.c-torture/execute/20030606-1.c execution,  -O1 
FAIL: gcc.c-torture/execute/20030914-1.c compilation,  -O1  (internal compiler error)
UNRESOLVED: gcc.c-torture/execute/20030914-1.c execution,  -O1 
FAIL: gcc.c-torture/execute/20030914-1.c compilation,  -O2  (internal compiler error)
UNRESOLVED: gcc.c-torture/execute/20030914-1.c execution,  -O2 
FAIL: gcc.c-torture/execute/20030914-1.c compilation,  -Os  (internal compiler error)
UNRESOLVED: gcc.c-torture/execute/20030914-1.c execution,  -Os 
FAIL: gcc.c-torture/execute/20031201-1.c compilation,  -O3 -fomit-frame-pointer -funroll-loops  (internal compiler error)
UNRESOLVED: gcc.c-torture/execute/20031201-1.c execution,  -O3 -fomit-frame-pointer -funroll-loops 
FAIL: gcc.c-torture/execute/20031201-1.c compilation,  -O3 -fomit-frame-pointer -funroll-all-loops -finline-functions  (internal compiler error)
UNRESOLVED: gcc.c-torture/execute/20031201-1.c execution,  -O3 -fomit-frame-pointer -funroll-all-loops -finline-functions 
FAIL: gcc.c-torture/execute/20050224-1.c compilation,  -O3 -fomit-frame-pointer -funroll-loops  (internal compiler error)
UNRESOLVED: gcc.c-torture/execute/20050224-1.c execution,  -O3 -fomit-frame-pointer -funroll-loops 
FAIL: gcc.c-torture/execute/20050224-1.c compilation,  -O3 -fomit-frame-pointer -funroll-all-loops -finline-functions  (internal compiler error)
UNRESOLVED: gcc.c-torture/execute/20050224-1.c execution,  -O3 -fomit-frame-pointer -funroll-all-loops -finline-functions 
FAIL: gcc.c-torture/execute/20050826-2.c compilation,  -O1  (internal compiler error)
UNRESOLVED: gcc.c-torture/execute/20050826-2.c execution,  -O1 
FAIL: gcc.c-torture/execute/20050826-2.c compilation,  -O2  (internal compiler error)
UNRESOLVED: gcc.c-torture/execute/20050826-2.c execution,  -O2 
FAIL: gcc.c-torture/execute/20050826-2.c compilation,  -O3 -fomit-frame-pointer  (internal compiler error)
UNRESOLVED: gcc.c-torture/execute/20050826-2.c execution,  -O3 -fomit-frame-pointer 
FAIL: gcc.c-torture/execute/20050826-2.c compilation,  -O3 -fomit-frame-pointer -funroll-loops  (internal compiler error)
UNRESOLVED: gcc.c-torture/execute/20050826-2.c execution,  -O3 -fomit-frame-pointer -funroll-loops 
FAIL: gcc.c-torture/execute/20050826-2.c compilation,  -O3 -fomit-frame-pointer -funroll-all-loops -finline-functions  (internal compiler error)
UNRESOLVED: gcc.c-torture/execute/20050826-2.c execution,  -O3 -fomit-frame-pointer -funroll-all-loops -finline-functions 
FAIL: gcc.c-torture/execute/20050826-2.c compilation,  -O3 -g  (internal compiler error)
UNRESOLVED: gcc.c-torture/execute/20050826-2.c execution,  -O3 -g 
FAIL: gcc.c-torture/execute/20050826-2.c compilation,  -Os  (internal compiler error)
UNRESOLVED: gcc.c-torture/execute/20050826-2.c execution,  -Os 
FAIL: gcc.c-torture/execute/20051110-1.c compilation,  -O3 -fomit-frame-pointer -funroll-all-loops -finline-functions  (internal compiler error)
UNRESOLVED: gcc.c-torture/execute/20051110-1.c execution,  -O3 -fomit-frame-pointer -funroll-all-loops -finline-functions 
FAIL: gcc.c-torture/execute/20051110-2.c compilation,  -O3 -fomit-frame-pointer -funroll-all-loops -finline-functions  (internal compiler error)
UNRESOLVED: gcc.c-torture/execute/20051110-2.c execution,  -O3 -fomit-frame-pointer -funroll-all-loops -finline-functions 
FAIL: gcc.c-torture/execute/20060420-1.c compilation,  -O3 -fomit-frame-pointer -funroll-loops  (internal compiler error)
UNRESOLVED: gcc.c-torture/execute/20060420-1.c execution,  -O3 -fomit-frame-pointer -funroll-loops 
FAIL: gcc.c-torture/execute/20060420-1.c compilation,  -O3 -fomit-frame-pointer -funroll-all-loops -finline-functions  (internal compiler error)
UNRESOLVED: gcc.c-torture/execute/20060420-1.c execution,  -O3 -fomit-frame-pointer -funroll-all-loops -finline-functions 
FAIL: gcc.c-torture/execute/20060929-1.c compilation,  -O0  (internal compiler error)
UNRESOLVED: gcc.c-torture/execute/20060929-1.c execution,  -O0 
FAIL: gcc.c-torture/execute/20060929-1.c compilation,  -O1  (internal compiler error)
UNRESOLVED: gcc.c-torture/execute/20060929-1.c execution,  -O1 
FAIL: gcc.c-torture/execute/920810-1.c compilation,  -O1  (internal compiler error)
UNRESOLVED: gcc.c-torture/execute/920810-1.c execution,  -O1 
FAIL: gcc.c-torture/execute/920810-1.c compilation,  -O2  (internal compiler error)
UNRESOLVED: gcc.c-torture/execute/920810-1.c execution,  -O2 
FAIL: gcc.c-torture/execute/920810-1.c compilation,  -Os  (internal compiler error)
UNRESOLVED: gcc.c-torture/execute/920810-1.c execution,  -Os 
FAIL: gcc.c-torture/execute/960209-1.c compilation,  -O3 -fomit-frame-pointer  (internal compiler error)
UNRESOLVED: gcc.c-torture/execute/960209-1.c execution,  -O3 -fomit-frame-pointer 
FAIL: gcc.c-torture/execute/960209-1.c compilation,  -O3 -fomit-frame-pointer -funroll-loops  (internal compiler error)
UNRESOLVED: gcc.c-torture/execute/960209-1.c execution,  -O3 -fomit-frame-pointer -funroll-loops 
FAIL: gcc.c-torture/execute/960209-1.c compilation,  -O3 -fomit-frame-pointer -funroll-all-loops -finline-functions  (internal compiler error)
UNRESOLVED: gcc.c-torture/execute/960209-1.c execution,  -O3 -fomit-frame-pointer -funroll-all-loops -finline-functions 
FAIL: gcc.c-torture/execute/960209-1.c compilation,  -O3 -g  (internal compiler error)
UNRESOLVED: gcc.c-torture/execute/960209-1.c execution,  -O3 -g 
FAIL: gcc.c-torture/execute/bitfld-3.c compilation,  -Os 
UNRESOLVED: gcc.c-torture/execute/bitfld-3.c execution,  -Os 
FAIL: gcc.c-torture/execute/builtin-bitops-1.c compilation,  -O0 
UNRESOLVED: gcc.c-torture/execute/builtin-bitops-1.c execution,  -O0 
FAIL: gcc.c-torture/execute/builtin-bitops-1.c compilation,  -O1 
UNRESOLVED: gcc.c-torture/execute/builtin-bitops-1.c execution,  -O1 
FAIL: gcc.c-torture/execute/builtin-bitops-1.c compilation,  -O2 
UNRESOLVED: gcc.c-torture/execute/builtin-bitops-1.c execution,  -O2 
FAIL: gcc.c-torture/execute/builtin-bitops-1.c compilation,  -O3 -fomit-frame-pointer 
UNRESOLVED: gcc.c-torture/execute/builtin-bitops-1.c execution,  -O3 -fomit-frame-pointer 
FAIL: gcc.c-torture/execute/builtin-bitops-1.c compilation,  -O3 -fomit-frame-pointer -funroll-loops  (internal compiler error)
UNRESOLVED: gcc.c-torture/execute/builtin-bitops-1.c execution,  -O3 -fomit-frame-pointer -funroll-loops 
FAIL: gcc.c-torture/execute/builtin-bitops-1.c compilation,  -O3 -fomit-frame-pointer -funroll-all-loops -finline-functions  (internal compiler error)
UNRESOLVED: gcc.c-torture/execute/builtin-bitops-1.c execution,  -O3 -fomit-frame-pointer -funroll-all-loops -finline-functions 
FAIL: gcc.c-torture/execute/builtin-bitops-1.c compilation,  -O3 -g 
UNRESOLVED: gcc.c-torture/execute/builtin-bitops-1.c execution,  -O3 -g 
FAIL: gcc.c-torture/execute/builtin-bitops-1.c compilation,  -Os 
UNRESOLVED: gcc.c-torture/execute/builtin-bitops-1.c execution,  -Os 
FAIL: gcc.c-torture/execute/ffs-1.c compilation,  -O0 
UNRESOLVED: gcc.c-torture/execute/ffs-1.c execution,  -O0 
FAIL: gcc.c-torture/execute/ffs-1.c compilation,  -O1 
UNRESOLVED: gcc.c-torture/execute/ffs-1.c execution,  -O1 
FAIL: gcc.c-torture/execute/ffs-1.c compilation,  -O2 
UNRESOLVED: gcc.c-torture/execute/ffs-1.c execution,  -O2 
FAIL: gcc.c-torture/execute/ffs-1.c compilation,  -O3 -fomit-frame-pointer 
UNRESOLVED: gcc.c-torture/execute/ffs-1.c execution,  -O3 -fomit-frame-pointer 
FAIL: gcc.c-torture/execute/ffs-1.c compilation,  -O3 -g 
UNRESOLVED: gcc.c-torture/execute/ffs-1.c execution,  -O3 -g 
FAIL: gcc.c-torture/execute/ffs-1.c compilation,  -Os 
UNRESOLVED: gcc.c-torture/execute/ffs-1.c execution,  -Os 
FAIL: gcc.c-torture/execute/ffs-2.c compilation,  -O0 
UNRESOLVED: gcc.c-torture/execute/ffs-2.c execution,  -O0 
FAIL: gcc.c-torture/execute/ffs-2.c compilation,  -O1 
UNRESOLVED: gcc.c-torture/execute/ffs-2.c execution,  -O1 
FAIL: gcc.c-torture/execute/ffs-2.c compilation,  -O2 
UNRESOLVED: gcc.c-torture/execute/ffs-2.c execution,  -O2 
FAIL: gcc.c-torture/execute/ffs-2.c compilation,  -O3 -fomit-frame-pointer 
UNRESOLVED: gcc.c-torture/execute/ffs-2.c execution,  -O3 -fomit-frame-pointer 
FAIL: gcc.c-torture/execute/ffs-2.c compilation,  -O3 -fomit-frame-pointer -funroll-loops 
UNRESOLVED: gcc.c-torture/execute/ffs-2.c execution,  -O3 -fomit-frame-pointer -funroll-loops 
FAIL: gcc.c-torture/execute/ffs-2.c compilation,  -O3 -fomit-frame-pointer -funroll-all-loops -finline-functions 
UNRESOLVED: gcc.c-torture/execute/ffs-2.c execution,  -O3 -fomit-frame-pointer -funroll-all-loops -finline-functions 
FAIL: gcc.c-torture/execute/ffs-2.c compilation,  -O3 -g 
UNRESOLVED: gcc.c-torture/execute/ffs-2.c execution,  -O3 -g 
FAIL: gcc.c-torture/execute/ffs-2.c compilation,  -Os 
UNRESOLVED: gcc.c-torture/execute/ffs-2.c execution,  -Os 
FAIL: gcc.c-torture/execute/frame-address.c compilation,  -O0  (internal compiler error)
UNRESOLVED: gcc.c-torture/execute/frame-address.c execution,  -O0 
FAIL: gcc.c-torture/execute/multi-ix.c compilation,  -O1  (internal compiler error)
UNRESOLVED: gcc.c-torture/execute/multi-ix.c execution,  -O1 
FAIL: gcc.c-torture/execute/pr15296.c compilation,  -O1  (internal compiler error)
UNRESOLVED: gcc.c-torture/execute/pr15296.c execution,  -O1 
FAIL: gcc.c-torture/execute/pr15296.c compilation,  -O2  (internal compiler error)
UNRESOLVED: gcc.c-torture/execute/pr15296.c execution,  -O2 
FAIL: gcc.c-torture/execute/pr15296.c compilation,  -O3 -fomit-frame-pointer  (internal compiler error)
UNRESOLVED: gcc.c-torture/execute/pr15296.c execution,  -O3 -fomit-frame-pointer 
FAIL: gcc.c-torture/execute/pr15296.c compilation,  -O3 -g  (internal compiler error)
UNRESOLVED: gcc.c-torture/execute/pr15296.c execution,  -O3 -g 
FAIL: gcc.c-torture/execute/pr15296.c compilation,  -Os  (internal compiler error)
UNRESOLVED: gcc.c-torture/execute/pr15296.c execution,  -Os 
FAIL: gcc.c-torture/execute/pr20527-1.c compilation,  -O3 -fomit-frame-pointer -funroll-loops  (internal compiler error)
UNRESOLVED: gcc.c-torture/execute/pr20527-1.c execution,  -O3 -fomit-frame-pointer -funroll-loops 
FAIL: gcc.c-torture/execute/pr20527-1.c compilation,  -O3 -fomit-frame-pointer -funroll-all-loops -finline-functions  (internal compiler error)
UNRESOLVED: gcc.c-torture/execute/pr20527-1.c execution,  -O3 -fomit-frame-pointer -funroll-all-loops -finline-functions 
FAIL: gcc.c-torture/execute/string-opt-5.c compilation,  -Os  (internal compiler error)
UNRESOLVED: gcc.c-torture/execute/string-opt-5.c execution,  -Os 
FAIL: gcc.c-torture/execute/va-arg-22.c compilation,  -O3 -fomit-frame-pointer 
UNRESOLVED: gcc.c-torture/execute/va-arg-22.c execution,  -O3 -fomit-frame-pointer 
FAIL: gcc.c-torture/execute/va-arg-22.c compilation,  -O3 -g 
UNRESOLVED: gcc.c-torture/execute/va-arg-22.c execution,  -O3 -g 
FAIL: gcc.c-torture/unsorted/memtst.c,  -O2   (internal compiler error)
FAIL: gcc.c-torture/unsorted/memtst.c,  -O3 -fomit-frame-pointer   (internal compiler error)
FAIL: gcc.c-torture/unsorted/memtst.c,  -O3 -fomit-frame-pointer -funroll-loops   (internal compiler error)
FAIL: gcc.c-torture/unsorted/memtst.c,  -O3 -fomit-frame-pointer -funroll-all-loops -finline-functions   (internal compiler error)
FAIL: gcc.c-torture/unsorted/memtst.c,  -O3 -g   (internal compiler error)
FAIL: gcc.c-torture/unsorted/memtst.c,  -Os   (internal compiler error)
FAIL: gcc.dg/compat/struct-by-value-15 c_compat_x_tst.o-c_compat_y_tst.o link
UNRESOLVED: gcc.dg/compat/struct-by-value-15 c_compat_x_tst.o-c_compat_y_tst.o execute 
FAIL: gcc.dg/compat/struct-by-value-17 c_compat_x_tst.o-c_compat_y_tst.o link
UNRESOLVED: gcc.dg/compat/struct-by-value-17 c_compat_x_tst.o-c_compat_y_tst.o execute 
FAIL: gcc.dg/compat/struct-by-value-18 c_compat_x_tst.o-c_compat_y_tst.o link
UNRESOLVED: gcc.dg/compat/struct-by-value-18 c_compat_x_tst.o-c_compat_y_tst.o execute 
FAIL: gcc.dg/compat/struct-by-value-22 c_compat_x_tst.o-c_compat_y_tst.o execute 
FAIL: gcc.dg/compat/struct-layout-1 c_compat_x_tst.o compile
FAIL: gcc.dg/compat/struct-layout-1 c_compat_y_tst.o compile
UNRESOLVED: gcc.dg/compat/struct-layout-1 c_compat_x_tst.o-c_compat_y_tst.o link 
UNRESOLVED: gcc.dg/compat/struct-layout-1 c_compat_x_tst.o-c_compat_y_tst.o execute 
FAIL: tmpdir-gcc.dg-struct-layout-1/t001 c_compat_x_tst.o compile
FAIL: tmpdir-gcc.dg-struct-layout-1/t001 c_compat_y_tst.o compile
UNRESOLVED: tmpdir-gcc.dg-struct-layout-1/t001 c_compat_x_tst.o-c_compat_y_tst.o link 
UNRESOLVED: tmpdir-gcc.dg-struct-layout-1/t001 c_compat_x_tst.o-c_compat_y_tst.o execute 
FAIL: tmpdir-gcc.dg-struct-layout-1/t002 c_compat_x_tst.o compile
FAIL: tmpdir-gcc.dg-struct-layout-1/t002 c_compat_y_tst.o compile
UNRESOLVED: tmpdir-gcc.dg-struct-layout-1/t002 c_compat_x_tst.o-c_compat_y_tst.o link 
UNRESOLVED: tmpdir-gcc.dg-struct-layout-1/t002 c_compat_x_tst.o-c_compat_y_tst.o execute 
FAIL: tmpdir-gcc.dg-struct-layout-1/t003 c_compat_x_tst.o compile
FAIL: tmpdir-gcc.dg-struct-layout-1/t003 c_compat_y_tst.o compile
UNRESOLVED: tmpdir-gcc.dg-struct-layout-1/t003 c_compat_x_tst.o-c_compat_y_tst.o link 
UNRESOLVED: tmpdir-gcc.dg-struct-layout-1/t003 c_compat_x_tst.o-c_compat_y_tst.o execute 
FAIL: tmpdir-gcc.dg-struct-layout-1/t004 c_compat_x_tst.o compile
FAIL: tmpdir-gcc.dg-struct-layout-1/t004 c_compat_y_tst.o compile
UNRESOLVED: tmpdir-gcc.dg-struct-layout-1/t004 c_compat_x_tst.o-c_compat_y_tst.o link 
UNRESOLVED: tmpdir-gcc.dg-struct-layout-1/t004 c_compat_x_tst.o-c_compat_y_tst.o execute 
FAIL: tmpdir-gcc.dg-struct-layout-1/t005 c_compat_x_tst.o compile
FAIL: tmpdir-gcc.dg-struct-layout-1/t005 c_compat_y_tst.o compile
UNRESOLVED: tmpdir-gcc.dg-struct-layout-1/t005 c_compat_x_tst.o-c_compat_y_tst.o link 
UNRESOLVED: tmpdir-gcc.dg-struct-layout-1/t005 c_compat_x_tst.o-c_compat_y_tst.o execute 
FAIL: tmpdir-gcc.dg-struct-layout-1/t006 c_compat_x_tst.o compile
FAIL: tmpdir-gcc.dg-struct-layout-1/t006 c_compat_y_tst.o compile
UNRESOLVED: tmpdir-gcc.dg-struct-layout-1/t006 c_compat_x_tst.o-c_compat_y_tst.o link 
UNRESOLVED: tmpdir-gcc.dg-struct-layout-1/t006 c_compat_x_tst.o-c_compat_y_tst.o execute 
FAIL: tmpdir-gcc.dg-struct-layout-1/t007 c_compat_x_tst.o compile
FAIL: tmpdir-gcc.dg-struct-layout-1/t007 c_compat_y_tst.o compile
UNRESOLVED: tmpdir-gcc.dg-struct-layout-1/t007 c_compat_x_tst.o-c_compat_y_tst.o link 
UNRESOLVED: tmpdir-gcc.dg-struct-layout-1/t007 c_compat_x_tst.o-c_compat_y_tst.o execute 
FAIL: tmpdir-gcc.dg-struct-layout-1/t008 c_compat_x_tst.o compile
FAIL: tmpdir-gcc.dg-struct-layout-1/t008 c_compat_y_tst.o compile
UNRESOLVED: tmpdir-gcc.dg-struct-layout-1/t008 c_compat_x_tst.o-c_compat_y_tst.o link 
UNRESOLVED: tmpdir-gcc.dg-struct-layout-1/t008 c_compat_x_tst.o-c_compat_y_tst.o execute 
FAIL: tmpdir-gcc.dg-struct-layout-1/t009 c_compat_x_tst.o compile
FAIL: tmpdir-gcc.dg-struct-layout-1/t009 c_compat_y_tst.o compile
UNRESOLVED: tmpdir-gcc.dg-struct-layout-1/t009 c_compat_x_tst.o-c_compat_y_tst.o link 
UNRESOLVED: tmpdir-gcc.dg-struct-layout-1/t009 c_compat_x_tst.o-c_compat_y_tst.o execute 
FAIL: tmpdir-gcc.dg-struct-layout-1/t010 c_compat_x_tst.o compile
FAIL: tmpdir-gcc.dg-struct-layout-1/t010 c_compat_y_tst.o compile
UNRESOLVED: tmpdir-gcc.dg-struct-layout-1/t010 c_compat_x_tst.o-c_compat_y_tst.o link 
UNRESOLVED: tmpdir-gcc.dg-struct-layout-1/t010 c_compat_x_tst.o-c_compat_y_tst.o execute 
FAIL: tmpdir-gcc.dg-struct-layout-1/t011 c_compat_x_tst.o compile
FAIL: tmpdir-gcc.dg-struct-layout-1/t011 c_compat_y_tst.o compile
UNRESOLVED: tmpdir-gcc.dg-struct-layout-1/t011 c_compat_x_tst.o-c_compat_y_tst.o link 
UNRESOLVED: tmpdir-gcc.dg-struct-layout-1/t011 c_compat_x_tst.o-c_compat_y_tst.o execute 
FAIL: tmpdir-gcc.dg-struct-layout-1/t012 c_compat_x_tst.o compile
FAIL: tmpdir-gcc.dg-struct-layout-1/t012 c_compat_y_tst.o compile
UNRESOLVED: tmpdir-gcc.dg-struct-layout-1/t012 c_compat_x_tst.o-c_compat_y_tst.o link 
UNRESOLVED: tmpdir-gcc.dg-struct-layout-1/t012 c_compat_x_tst.o-c_compat_y_tst.o execute 
FAIL: tmpdir-gcc.dg-struct-layout-1/t013 c_compat_x_tst.o compile
FAIL: tmpdir-gcc.dg-struct-layout-1/t013 c_compat_y_tst.o compile
UNRESOLVED: tmpdir-gcc.dg-struct-layout-1/t013 c_compat_x_tst.o-c_compat_y_tst.o link 
UNRESOLVED: tmpdir-gcc.dg-struct-layout-1/t013 c_compat_x_tst.o-c_compat_y_tst.o execute 
FAIL: tmpdir-gcc.dg-struct-layout-1/t014 c_compat_x_tst.o compile
FAIL: tmpdir-gcc.dg-struct-layout-1/t014 c_compat_y_tst.o compile
UNRESOLVED: tmpdir-gcc.dg-struct-layout-1/t014 c_compat_x_tst.o-c_compat_y_tst.o link 
UNRESOLVED: tmpdir-gcc.dg-struct-layout-1/t014 c_compat_x_tst.o-c_compat_y_tst.o execute 
FAIL: tmpdir-gcc.dg-struct-layout-1/t015 c_compat_x_tst.o compile
FAIL: tmpdir-gcc.dg-struct-layout-1/t015 c_compat_y_tst.o compile
UNRESOLVED: tmpdir-gcc.dg-struct-layout-1/t015 c_compat_x_tst.o-c_compat_y_tst.o link 
UNRESOLVED: tmpdir-gcc.dg-struct-layout-1/t015 c_compat_x_tst.o-c_compat_y_tst.o execute 
FAIL: tmpdir-gcc.dg-struct-layout-1/t016 c_compat_x_tst.o compile
FAIL: tmpdir-gcc.dg-struct-layout-1/t016 c_compat_y_tst.o compile
UNRESOLVED: tmpdir-gcc.dg-struct-layout-1/t016 c_compat_x_tst.o-c_compat_y_tst.o link 
UNRESOLVED: tmpdir-gcc.dg-struct-layout-1/t016 c_compat_x_tst.o-c_compat_y_tst.o execute 
FAIL: tmpdir-gcc.dg-struct-layout-1/t017 c_compat_x_tst.o compile
FAIL: tmpdir-gcc.dg-struct-layout-1/t017 c_compat_y_tst.o compile
UNRESOLVED: tmpdir-gcc.dg-struct-layout-1/t017 c_compat_x_tst.o-c_compat_y_tst.o link 
UNRESOLVED: tmpdir-gcc.dg-struct-layout-1/t017 c_compat_x_tst.o-c_compat_y_tst.o execute 
FAIL: tmpdir-gcc.dg-struct-layout-1/t018 c_compat_x_tst.o compile
FAIL: tmpdir-gcc.dg-struct-layout-1/t018 c_compat_y_tst.o compile
UNRESOLVED: tmpdir-gcc.dg-struct-layout-1/t018 c_compat_x_tst.o-c_compat_y_tst.o link 
UNRESOLVED: tmpdir-gcc.dg-struct-layout-1/t018 c_compat_x_tst.o-c_compat_y_tst.o execute 
FAIL: tmpdir-gcc.dg-struct-layout-1/t019 c_compat_x_tst.o compile
FAIL: tmpdir-gcc.dg-struct-layout-1/t019 c_compat_y_tst.o compile
UNRESOLVED: tmpdir-gcc.dg-struct-layout-1/t019 c_compat_x_tst.o-c_compat_y_tst.o link 
UNRESOLVED: tmpdir-gcc.dg-struct-layout-1/t019 c_compat_x_tst.o-c_compat_y_tst.o execute 
FAIL: tmpdir-gcc.dg-struct-layout-1/t020 c_compat_x_tst.o compile
FAIL: tmpdir-gcc.dg-struct-layout-1/t020 c_compat_y_tst.o compile,  (internal compiler error)
UNRESOLVED: tmpdir-gcc.dg-struct-layout-1/t020 c_compat_x_tst.o-c_compat_y_tst.o link 
UNRESOLVED: tmpdir-gcc.dg-struct-layout-1/t020 c_compat_x_tst.o-c_compat_y_tst.o execute 
FAIL: tmpdir-gcc.dg-struct-layout-1/t021 c_compat_x_tst.o compile
FAIL: tmpdir-gcc.dg-struct-layout-1/t021 c_compat_y_tst.o compile
UNRESOLVED: tmpdir-gcc.dg-struct-layout-1/t021 c_compat_x_tst.o-c_compat_y_tst.o link 
UNRESOLVED: tmpdir-gcc.dg-struct-layout-1/t021 c_compat_x_tst.o-c_compat_y_tst.o execute 
FAIL: tmpdir-gcc.dg-struct-layout-1/t022 c_compat_x_tst.o compile
FAIL: tmpdir-gcc.dg-struct-layout-1/t022 c_compat_y_tst.o compile
UNRESOLVED: tmpdir-gcc.dg-struct-layout-1/t022 c_compat_x_tst.o-c_compat_y_tst.o link 
UNRESOLVED: tmpdir-gcc.dg-struct-layout-1/t022 c_compat_x_tst.o-c_compat_y_tst.o execute 
FAIL: tmpdir-gcc.dg-struct-layout-1/t023 c_compat_x_tst.o compile
FAIL: tmpdir-gcc.dg-struct-layout-1/t023 c_compat_y_tst.o compile
UNRESOLVED: tmpdir-gcc.dg-struct-layout-1/t023 c_compat_x_tst.o-c_compat_y_tst.o link 
UNRESOLVED: tmpdir-gcc.dg-struct-layout-1/t023 c_compat_x_tst.o-c_compat_y_tst.o execute 
FAIL: tmpdir-gcc.dg-struct-layout-1/t024 c_compat_x_tst.o compile
FAIL: tmpdir-gcc.dg-struct-layout-1/t024 c_compat_y_tst.o compile
UNRESOLVED: tmpdir-gcc.dg-struct-layout-1/t024 c_compat_x_tst.o-c_compat_y_tst.o link 
UNRESOLVED: tmpdir-gcc.dg-struct-layout-1/t024 c_compat_x_tst.o-c_compat_y_tst.o execute 
FAIL: tmpdir-gcc.dg-struct-layout-1/t025 c_compat_x_tst.o compile
FAIL: tmpdir-gcc.dg-struct-layout-1/t025 c_compat_y_tst.o compile
UNRESOLVED: tmpdir-gcc.dg-struct-layout-1/t025 c_compat_x_tst.o-c_compat_y_tst.o link 
UNRESOLVED: tmpdir-gcc.dg-struct-layout-1/t025 c_compat_x_tst.o-c_compat_y_tst.o execute 
FAIL: tmpdir-gcc.dg-struct-layout-1/t026 c_compat_x_tst.o compile
FAIL: tmpdir-gcc.dg-struct-layout-1/t026 c_compat_y_tst.o compile
UNRESOLVED: tmpdir-gcc.dg-struct-layout-1/t026 c_compat_x_tst.o-c_compat_y_tst.o link 
UNRESOLVED: tmpdir-gcc.dg-struct-layout-1/t026 c_compat_x_tst.o-c_compat_y_tst.o execute 
FAIL: tmpdir-gcc.dg-struct-layout-1/t027 c_compat_x_tst.o compile
FAIL: tmpdir-gcc.dg-struct-layout-1/t027 c_compat_y_tst.o compile
UNRESOLVED: tmpdir-gcc.dg-struct-layout-1/t027 c_compat_x_tst.o-c_compat_y_tst.o link 
UNRESOLVED: tmpdir-gcc.dg-struct-layout-1/t027 c_compat_x_tst.o-c_compat_y_tst.o execute 
FAIL: tmpdir-gcc.dg-struct-layout-1/t028 c_compat_x_tst.o compile
FAIL: tmpdir-gcc.dg-struct-layout-1/t028 c_compat_y_tst.o compile
UNRESOLVED: tmpdir-gcc.dg-struct-layout-1/t028 c_compat_x_tst.o-c_compat_y_tst.o link 
UNRESOLVED: tmpdir-gcc.dg-struct-layout-1/t028 c_compat_x_tst.o-c_compat_y_tst.o execute 
FAIL: gcc.dg/cpp/_Pragma6.c (test for excess errors)
FAIL: gcc.dg/20021014-1.c No profiler support (test for errors, line )
FAIL: gcc.dg/20021014-1.c (test for excess errors)
UNRESOLVED: gcc.dg/20021014-1.c compilation failed to produce executable
FAIL: gcc.dg/Wconversion-5.c  (test for warnings, line 22)
FAIL: gcc.dg/Wconversion-real-integer.c  (test for warnings, line 34)
FAIL: gcc.dg/Wconversion-real-integer.c  (test for warnings, line 35)
FAIL: gcc.dg/Wconversion-real-integer.c  (test for warnings, line 38)
FAIL: gcc.dg/Wconversion-real-integer.c  (test for warnings, line 39)
FAIL: gcc.dg/Wconversion-real-integer.c  (test for warnings, line 40)
FAIL: gcc.dg/Wconversion-real-integer.c  (test for warnings, line 41)
FAIL: gcc.dg/Wconversion-real-integer.c (test for excess errors)
FAIL: gcc.dg/Wtype-limits-Wextra.c  (test for warnings, line 25)
FAIL: gcc.dg/Wtype-limits-Wextra.c  (test for warnings, line 26)
FAIL: gcc.dg/Wtype-limits-Wextra.c  (test for warnings, line 27)
FAIL: gcc.dg/Wtype-limits-Wextra.c  (test for warnings, line 28)
FAIL: gcc.dg/Wtype-limits-Wextra.c (test for excess errors)
FAIL: gcc.dg/Wtype-limits.c  (test for warnings, line 25)
FAIL: gcc.dg/Wtype-limits.c  (test for warnings, line 26)
FAIL: gcc.dg/Wtype-limits.c  (test for warnings, line 27)
FAIL: gcc.dg/Wtype-limits.c  (test for warnings, line 28)
FAIL: gcc.dg/Wtype-limits.c (test for excess errors)
FAIL: gcc.dg/cleanup-12.c (internal compiler error)
FAIL: gcc.dg/cleanup-12.c (test for excess errors)
UNRESOLVED: gcc.dg/cleanup-12.c compilation failed to produce executable
FAIL: gcc.dg/cleanup-5.c (internal compiler error)
FAIL: gcc.dg/cleanup-5.c (test for excess errors)
UNRESOLVED: gcc.dg/cleanup-5.c compilation failed to produce executable
FAIL: gcc.dg/fold-eqandshift-3.c scan-tree-dump-times original "\\(a & 1073741824\\) != 0" 1
FAIL: gcc.dg/fold-eqandshift-3.c scan-tree-dump-times original "\\(b & 1073741824\\) != 0" 1
FAIL: gcc.dg/fold-overflow-1.c scan-assembler-times 2139095040 2
FAIL: gcc.dg/ftrapv-1.c (test for excess errors)
UNRESOLVED: gcc.dg/ftrapv-1.c compilation failed to produce executable
FAIL: gcc.dg/ftrapv-2.c (test for excess errors)
UNRESOLVED: gcc.dg/ftrapv-2.c compilation failed to produce executable
FAIL: gcc.dg/max-1.c (test for excess errors)
FAIL: gcc.dg/multiple-overflow-warn-3.c (test for excess errors)
FAIL: gcc.dg/nest.c No profiler support (test for errors, line )
FAIL: gcc.dg/nest.c (test for excess errors)
UNRESOLVED: gcc.dg/nest.c compilation failed to produce executable
FAIL: gcc.dg/nested-func-4.c (test for excess errors)
UNRESOLVED: gcc.dg/nested-func-4.c compilation failed to produce executable
FAIL: gcc.dg/pr19340.c (test for excess errors)
FAIL: gcc.dg/pr27639.c (test for excess errors)
FAIL: gcc.dg/pr28755.c (test for excess errors)
FAIL: gcc.dg/pr28755.c scan-assembler-times 2112543726|7deadbee 2
FAIL: gcc.dg/pr28796-2.c (internal compiler error)
FAIL: gcc.dg/pr28796-2.c (test for excess errors)
UNRESOLVED: gcc.dg/pr28796-2.c compilation failed to produce executable
FAIL: gcc.dg/pr30286.c (internal compiler error)
FAIL: gcc.dg/pr30286.c (test for excess errors)
UNRESOLVED: gcc.dg/pr30286.c compilation failed to produce executable
XPASS: gcc.dg/pr30957-1.c execution test
FAIL: gcc.dg/pr30957-1.c scan-rtl-dump loop2_unroll "Expanding Accumulator"
FAIL: gcc.dg/pr32450.c (test for excess errors)
UNRESOLVED: gcc.dg/pr32450.c compilation failed to produce executable
FAIL: gcc.dg/pr32573.c (internal compiler error)
FAIL: gcc.dg/pr32573.c (test for excess errors)
FAIL: gcc.dg/pr32912-2.c execution test
FAIL: gcc.dg/pr33644.c (internal compiler error)
FAIL: gcc.dg/pr33644.c (test for excess errors)
FAIL: gcc.dg/setjmp-1.c spurious clobbered warning (test for bogus messages, line 16)
FAIL: gcc.dg/struct-by-value-1.c (internal compiler error)
FAIL: gcc.dg/struct-by-value-1.c (test for excess errors)
UNRESOLVED: gcc.dg/struct-by-value-1.c compilation failed to produce executable
FAIL: gcc.dg/var-expand1.c scan-rtl-dump loop2_unroll "Expanding Accumulator"
FAIL: gcc.dg/matrix/transpose-1.c compilation,  -fprofile-generate -O3
UNRESOLVED: gcc.dg/matrix/transpose-1.c execution,    -fprofile-generate -O3
UNRESOLVED: gcc.dg/matrix/transpose-1.c compilation,  -fprofile-use -fipa-matrix-reorg -fdump-ipa-matrix-reorg -O3 -fwhole-program -combine
UNRESOLVED: gcc.dg/matrix/transpose-1.c execution,    -fprofile-use -fipa-matrix-reorg -fdump-ipa-matrix-reorg -O3 -fwhole-program -combine
FAIL: gcc.dg/matrix/transpose-2.c compilation,  -fprofile-generate -O3
UNRESOLVED: gcc.dg/matrix/transpose-2.c execution,    -fprofile-generate -O3
UNRESOLVED: gcc.dg/matrix/transpose-2.c compilation,  -fprofile-use -fipa-matrix-reorg -fdump-ipa-matrix-reorg -O3 -fwhole-program -combine
UNRESOLVED: gcc.dg/matrix/transpose-2.c execution,    -fprofile-use -fipa-matrix-reorg -fdump-ipa-matrix-reorg -O3 -fwhole-program -combine
FAIL: gcc.dg/matrix/transpose-3.c compilation,  -fprofile-generate -O3
UNRESOLVED: gcc.dg/matrix/transpose-3.c execution,    -fprofile-generate -O3
UNRESOLVED: gcc.dg/matrix/transpose-3.c compilation,  -fprofile-use -fipa-matrix-reorg -fdump-ipa-matrix-reorg -O3 -fwhole-program -combine
UNRESOLVED: gcc.dg/matrix/transpose-3.c execution,    -fprofile-use -fipa-matrix-reorg -fdump-ipa-matrix-reorg -O3 -fwhole-program -combine
FAIL: gcc.dg/matrix/transpose-4.c compilation,  -fprofile-generate -O3
UNRESOLVED: gcc.dg/matrix/transpose-4.c execution,    -fprofile-generate -O3
UNRESOLVED: gcc.dg/matrix/transpose-4.c compilation,  -fprofile-use -fipa-matrix-reorg -fdump-ipa-matrix-reorg -O3 -fwhole-program -combine
UNRESOLVED: gcc.dg/matrix/transpose-4.c execution,    -fprofile-use -fipa-matrix-reorg -fdump-ipa-matrix-reorg -O3 -fwhole-program -combine
FAIL: gcc.dg/matrix/transpose-5.c compilation,  -fprofile-generate -O3
UNRESOLVED: gcc.dg/matrix/transpose-5.c execution,    -fprofile-generate -O3
UNRESOLVED: gcc.dg/matrix/transpose-5.c compilation,  -fprofile-use -fipa-matrix-reorg -fdump-ipa-matrix-reorg -O3 -fwhole-program -combine
UNRESOLVED: gcc.dg/matrix/transpose-5.c execution,    -fprofile-use -fipa-matrix-reorg -fdump-ipa-matrix-reorg -O3 -fwhole-program -combine
FAIL: gcc.dg/matrix/transpose-6.c compilation,  -fprofile-generate -O3
UNRESOLVED: gcc.dg/matrix/transpose-6.c execution,    -fprofile-generate -O3
UNRESOLVED: gcc.dg/matrix/transpose-6.c compilation,  -fprofile-use -fipa-matrix-reorg -fdump-ipa-matrix-reorg -O3 -fwhole-program -combine
UNRESOLVED: gcc.dg/matrix/transpose-6.c execution,    -fprofile-use -fipa-matrix-reorg -fdump-ipa-matrix-reorg -O3 -fwhole-program -combine
FAIL: gcc.dg/struct/wo_prof_malloc_size_var.c execution test
FAIL: gcc.dg/struct/wo_prof_single_str_global.c execution test
FAIL: gcc.dg/struct/wo_prof_single_str_local.c execution test
FAIL: gcc.dg/struct/wo_prof_single_str_pointer.c execution test
FAIL: gcc.dg/struct/wo_prof_two_strs.c (internal compiler error)
FAIL: gcc.dg/struct/wo_prof_two_strs.c (test for excess errors)
UNRESOLVED: gcc.dg/struct/wo_prof_two_strs.c compilation failed to produce executable
FAIL: gcc.dg/struct/wo_prof_two_strs.c scan-ipa-dump ipa_struct_reorg "Number of structures to transform is 2"
FAIL: gcc.dg/struct/w_prof_global_array.c compilation,  -O3 -fwhole-program -combine -fipa-type-escape -fprofile-generate
UNRESOLVED: gcc.dg/struct/w_prof_global_array.c execution,    -O3 -fwhole-program -combine -fipa-type-escape -fprofile-generate
UNRESOLVED: gcc.dg/struct/w_prof_global_array.c compilation,  -O3 -fwhole-program -combine -fipa-type-escape -fprofile-use -fipa-struct-reorg -fdump-ipa-all
UNRESOLVED: gcc.dg/struct/w_prof_global_array.c execution,    -O3 -fwhole-program -combine -fipa-type-escape -fprofile-use -fipa-struct-reorg -fdump-ipa-all
FAIL: gcc.dg/struct/w_prof_global_var.c compilation,  -O3 -fwhole-program -combine -fipa-type-escape -fprofile-generate
UNRESOLVED: gcc.dg/struct/w_prof_global_var.c execution,    -O3 -fwhole-program -combine -fipa-type-escape -fprofile-generate
UNRESOLVED: gcc.dg/struct/w_prof_global_var.c compilation,  -O3 -fwhole-program -combine -fipa-type-escape -fprofile-use -fipa-struct-reorg -fdump-ipa-all
UNRESOLVED: gcc.dg/struct/w_prof_global_var.c execution,    -O3 -fwhole-program -combine -fipa-type-escape -fprofile-use -fipa-struct-reorg -fdump-ipa-all
FAIL: gcc.dg/struct/w_prof_local_array.c compilation,  -O3 -fwhole-program -combine -fipa-type-escape -fprofile-generate
UNRESOLVED: gcc.dg/struct/w_prof_local_array.c execution,    -O3 -fwhole-program -combine -fipa-type-escape -fprofile-generate
UNRESOLVED: gcc.dg/struct/w_prof_local_array.c compilation,  -O3 -fwhole-program -combine -fipa-type-escape -fprofile-use -fipa-struct-reorg -fdump-ipa-all
UNRESOLVED: gcc.dg/struct/w_prof_local_array.c execution,    -O3 -fwhole-program -combine -fipa-type-escape -fprofile-use -fipa-struct-reorg -fdump-ipa-all
FAIL: gcc.dg/struct/w_prof_local_var.c compilation,  -O3 -fwhole-program -combine -fipa-type-escape -fprofile-generate
UNRESOLVED: gcc.dg/struct/w_prof_local_var.c execution,    -O3 -fwhole-program -combine -fipa-type-escape -fprofile-generate
UNRESOLVED: gcc.dg/struct/w_prof_local_var.c compilation,  -O3 -fwhole-program -combine -fipa-type-escape -fprofile-use -fipa-struct-reorg -fdump-ipa-all
UNRESOLVED: gcc.dg/struct/w_prof_local_var.c execution,    -O3 -fwhole-program -combine -fipa-type-escape -fprofile-use -fipa-struct-reorg -fdump-ipa-all
FAIL: gcc.dg/struct/w_prof_single_str_global.c compilation,  -O3 -fwhole-program -combine -fipa-type-escape -fprofile-generate
UNRESOLVED: gcc.dg/struct/w_prof_single_str_global.c execution,    -O3 -fwhole-program -combine -fipa-type-escape -fprofile-generate
UNRESOLVED: gcc.dg/struct/w_prof_single_str_global.c compilation,  -O3 -fwhole-program -combine -fipa-type-escape -fprofile-use -fipa-struct-reorg -fdump-ipa-all
UNRESOLVED: gcc.dg/struct/w_prof_single_str_global.c execution,    -O3 -fwhole-program -combine -fipa-type-escape -fprofile-use -fipa-struct-reorg -fdump-ipa-all
FAIL: gcc.dg/struct/w_prof_two_strs.c compilation,  -O3 -fwhole-program -combine -fipa-type-escape -fprofile-generate
UNRESOLVED: gcc.dg/struct/w_prof_two_strs.c execution,    -O3 -fwhole-program -combine -fipa-type-escape -fprofile-generate
UNRESOLVED: gcc.dg/struct/w_prof_two_strs.c compilation,  -O3 -fwhole-program -combine -fipa-type-escape -fprofile-use -fipa-struct-reorg -fdump-ipa-all
UNRESOLVED: gcc.dg/struct/w_prof_two_strs.c execution,    -O3 -fwhole-program -combine -fipa-type-escape -fprofile-use -fipa-struct-reorg -fdump-ipa-all
FAIL: gcc.dg/struct/w_ratio_cold_str.c compilation,  -O3 -fwhole-program -combine -fipa-type-escape -fprofile-generate
UNRESOLVED: gcc.dg/struct/w_ratio_cold_str.c execution,    -O3 -fwhole-program -combine -fipa-type-escape -fprofile-generate
UNRESOLVED: gcc.dg/struct/w_ratio_cold_str.c compilation,  -O3 -fwhole-program -combine -fipa-type-escape -fprofile-use -fipa-struct-reorg -fdump-ipa-all --param struct-reorg-cold-struct-ratio=30
UNRESOLVED: gcc.dg/struct/w_ratio_cold_str.c execution,    -O3 -fwhole-program -combine -fipa-type-escape -fprofile-use -fipa-struct-reorg -fdump-ipa-all --param struct-reorg-cold-struct-ratio=30
FAIL: gcc.dg/torture/builtin-frexp-1.c  -O0  (test for excess errors)
FAIL: gcc.dg/torture/builtin-frexp-1.c  -O1  (test for excess errors)
FAIL: gcc.dg/torture/builtin-frexp-1.c  -O2  (test for excess errors)
FAIL: gcc.dg/torture/builtin-frexp-1.c  -O3 -fomit-frame-pointer  (test for excess errors)
FAIL: gcc.dg/torture/builtin-frexp-1.c  -O3 -fomit-frame-pointer -funroll-loops  (test for excess errors)
FAIL: gcc.dg/torture/builtin-frexp-1.c  -O3 -fomit-frame-pointer -funroll-all-loops -finline-functions  (test for excess errors)
FAIL: gcc.dg/torture/builtin-frexp-1.c  -O3 -g  (test for excess errors)
FAIL: gcc.dg/torture/builtin-frexp-1.c  -Os  (test for excess errors)
FAIL: gcc.dg/torture/pr19462-1.c  -O3 -fomit-frame-pointer -funroll-loops  (internal compiler error)
FAIL: gcc.dg/torture/pr19462-1.c  -O3 -fomit-frame-pointer -funroll-loops  (test for excess errors)
FAIL: gcc.dg/torture/pr19462-1.c  -O3 -fomit-frame-pointer -funroll-all-loops -finline-functions  (internal compiler error)
FAIL: gcc.dg/torture/pr19462-1.c  -O3 -fomit-frame-pointer -funroll-all-loops -finline-functions  (test for excess errors)
FAIL: gcc.dg/torture/type-generic-1.c  -O2  (internal compiler error)
FAIL: gcc.dg/torture/type-generic-1.c  -O2  (test for excess errors)
UNRESOLVED: gcc.dg/torture/type-generic-1.c  -O2  compilation failed to produce executable
FAIL: gcc.dg/torture/type-generic-1.c  -O3 -fomit-frame-pointer  (internal compiler error)
FAIL: gcc.dg/torture/type-generic-1.c  -O3 -fomit-frame-pointer  (test for excess errors)
UNRESOLVED: gcc.dg/torture/type-generic-1.c  -O3 -fomit-frame-pointer  compilation failed to produce executable
FAIL: gcc.dg/torture/type-generic-1.c  -O3 -g  (internal compiler error)
FAIL: gcc.dg/torture/type-generic-1.c  -O3 -g  (test for excess errors)
UNRESOLVED: gcc.dg/torture/type-generic-1.c  -O3 -g  compilation failed to produce executable
FAIL: gcc.dg/torture/type-generic-1.c  -Os  (internal compiler error)
FAIL: gcc.dg/torture/type-generic-1.c  -Os  (test for excess errors)
UNRESOLVED: gcc.dg/torture/type-generic-1.c  -Os  compilation failed to produce executable
FAIL: gcc.dg/tree-prof/bb-reorg.c compilation,  -fprofile-generate -D_PROFILE_GENERATE
UNRESOLVED: gcc.dg/tree-prof/bb-reorg.c execution,    -fprofile-generate -D_PROFILE_GENERATE
UNRESOLVED: gcc.dg/tree-prof/bb-reorg.c compilation,  -fprofile-use -D_PROFILE_USE
UNRESOLVED: gcc.dg/tree-prof/bb-reorg.c execution,    -fprofile-use -D_PROFILE_USE
FAIL: gcc.dg/tree-prof/indir-call-prof.c compilation,  -fprofile-generate -D_PROFILE_GENERATE
UNRESOLVED: gcc.dg/tree-prof/indir-call-prof.c execution,    -fprofile-generate -D_PROFILE_GENERATE
UNRESOLVED: gcc.dg/tree-prof/indir-call-prof.c compilation,  -fprofile-use -D_PROFILE_USE
UNRESOLVED: gcc.dg/tree-prof/indir-call-prof.c execution,    -fprofile-use -D_PROFILE_USE
FAIL: gcc.dg/tree-prof/inliner-1.c compilation,  -fprofile-generate -D_PROFILE_GENERATE
UNRESOLVED: gcc.dg/tree-prof/inliner-1.c execution,    -fprofile-generate -D_PROFILE_GENERATE
UNRESOLVED: gcc.dg/tree-prof/inliner-1.c compilation,  -fprofile-use -D_PROFILE_USE
UNRESOLVED: gcc.dg/tree-prof/inliner-1.c execution,    -fprofile-use -D_PROFILE_USE
FAIL: gcc.dg/tree-prof/stringop-1.c compilation,  -fprofile-generate -D_PROFILE_GENERATE
UNRESOLVED: gcc.dg/tree-prof/stringop-1.c execution,    -fprofile-generate -D_PROFILE_GENERATE
UNRESOLVED: gcc.dg/tree-prof/stringop-1.c compilation,  -fprofile-use -D_PROFILE_USE
UNRESOLVED: gcc.dg/tree-prof/stringop-1.c execution,    -fprofile-use -D_PROFILE_USE
FAIL: gcc.dg/tree-prof/stringop-2.c compilation,  -fprofile-generate -D_PROFILE_GENERATE
UNRESOLVED: gcc.dg/tree-prof/stringop-2.c execution,    -fprofile-generate -D_PROFILE_GENERATE
UNRESOLVED: gcc.dg/tree-prof/stringop-2.c compilation,  -fprofile-use -D_PROFILE_USE
UNRESOLVED: gcc.dg/tree-prof/stringop-2.c execution,    -fprofile-use -D_PROFILE_USE
FAIL: gcc.dg/tree-prof/tracer-1.c compilation,  -fprofile-generate -D_PROFILE_GENERATE
UNRESOLVED: gcc.dg/tree-prof/tracer-1.c execution,    -fprofile-generate -D_PROFILE_GENERATE
UNRESOLVED: gcc.dg/tree-prof/tracer-1.c compilation,  -fprofile-use -D_PROFILE_USE
UNRESOLVED: gcc.dg/tree-prof/tracer-1.c execution,    -fprofile-use -D_PROFILE_USE
FAIL: gcc.dg/tree-prof/update-cunroll-2.c compilation,  -fprofile-generate -D_PROFILE_GENERATE
UNRESOLVED: gcc.dg/tree-prof/update-cunroll-2.c execution,    -fprofile-generate -D_PROFILE_GENERATE
UNRESOLVED: gcc.dg/tree-prof/update-cunroll-2.c compilation,  -fprofile-use -D_PROFILE_USE
UNRESOLVED: gcc.dg/tree-prof/update-cunroll-2.c execution,    -fprofile-use -D_PROFILE_USE
FAIL: gcc.dg/tree-prof/update-loopch.c compilation,  -fprofile-generate -D_PROFILE_GENERATE
UNRESOLVED: gcc.dg/tree-prof/update-loopch.c execution,    -fprofile-generate -D_PROFILE_GENERATE
UNRESOLVED: gcc.dg/tree-prof/update-loopch.c compilation,  -fprofile-use -D_PROFILE_USE
UNRESOLVED: gcc.dg/tree-prof/update-loopch.c execution,    -fprofile-use -D_PROFILE_USE
FAIL: gcc.dg/tree-prof/update-tailcall.c compilation,  -fprofile-generate -D_PROFILE_GENERATE
UNRESOLVED: gcc.dg/tree-prof/update-tailcall.c execution,    -fprofile-generate -D_PROFILE_GENERATE
UNRESOLVED: gcc.dg/tree-prof/update-tailcall.c compilation,  -fprofile-use -D_PROFILE_USE
UNRESOLVED: gcc.dg/tree-prof/update-tailcall.c execution,    -fprofile-use -D_PROFILE_USE
FAIL: gcc.dg/tree-prof/val-prof-1.c compilation,  -fprofile-generate -D_PROFILE_GENERATE
UNRESOLVED: gcc.dg/tree-prof/val-prof-1.c execution,    -fprofile-generate -D_PROFILE_GENERATE
UNRESOLVED: gcc.dg/tree-prof/val-prof-1.c compilation,  -fprofile-use -D_PROFILE_USE
UNRESOLVED: gcc.dg/tree-prof/val-prof-1.c execution,    -fprofile-use -D_PROFILE_USE
FAIL: gcc.dg/tree-prof/val-prof-2.c compilation,  -fprofile-generate -D_PROFILE_GENERATE
UNRESOLVED: gcc.dg/tree-prof/val-prof-2.c execution,    -fprofile-generate -D_PROFILE_GENERATE
UNRESOLVED: gcc.dg/tree-prof/val-prof-2.c compilation,  -fprofile-use -D_PROFILE_USE
UNRESOLVED: gcc.dg/tree-prof/val-prof-2.c execution,    -fprofile-use -D_PROFILE_USE
FAIL: gcc.dg/tree-prof/val-prof-3.c compilation,  -fprofile-generate -D_PROFILE_GENERATE
UNRESOLVED: gcc.dg/tree-prof/val-prof-3.c execution,    -fprofile-generate -D_PROFILE_GENERATE
UNRESOLVED: gcc.dg/tree-prof/val-prof-3.c compilation,  -fprofile-use -D_PROFILE_USE
UNRESOLVED: gcc.dg/tree-prof/val-prof-3.c execution,    -fprofile-use -D_PROFILE_USE
FAIL: gcc.dg/tree-prof/val-prof-4.c compilation,  -fprofile-generate -D_PROFILE_GENERATE
UNRESOLVED: gcc.dg/tree-prof/val-prof-4.c execution,    -fprofile-generate -D_PROFILE_GENERATE
UNRESOLVED: gcc.dg/tree-prof/val-prof-4.c compilation,  -fprofile-use -D_PROFILE_USE
UNRESOLVED: gcc.dg/tree-prof/val-prof-4.c execution,    -fprofile-use -D_PROFILE_USE
FAIL: gcc.dg/tree-prof/val-prof-5.c compilation,  -fprofile-generate -D_PROFILE_GENERATE
UNRESOLVED: gcc.dg/tree-prof/val-prof-5.c execution,    -fprofile-generate -D_PROFILE_GENERATE
UNRESOLVED: gcc.dg/tree-prof/val-prof-5.c compilation,  -fprofile-use -D_PROFILE_USE
UNRESOLVED: gcc.dg/tree-prof/val-prof-5.c execution,    -fprofile-use -D_PROFILE_USE
FAIL: gcc.dg/tree-prof/val-prof-6.c compilation,  -fprofile-generate -D_PROFILE_GENERATE
UNRESOLVED: gcc.dg/tree-prof/val-prof-6.c execution,    -fprofile-generate -D_PROFILE_GENERATE
UNRESOLVED: gcc.dg/tree-prof/val-prof-6.c compilation,  -fprofile-use -D_PROFILE_USE
UNRESOLVED: gcc.dg/tree-prof/val-prof-6.c execution,    -fprofile-use -D_PROFILE_USE
FAIL: gcc.dg/tree-prof/wcoverage-mismatch.c compilation,  -fprofile-generate -D_PROFILE_GENERATE
UNRESOLVED: gcc.dg/tree-prof/wcoverage-mismatch.c execution,    -fprofile-generate -D_PROFILE_GENERATE
UNRESOLVED: gcc.dg/tree-prof/wcoverage-mismatch.c compilation,  -fprofile-use -D_PROFILE_USE
UNRESOLVED: gcc.dg/tree-prof/wcoverage-mismatch.c execution,    -fprofile-use -D_PROFILE_USE
FAIL: gcc.dg/tree-ssa/alias-15.c scan-tree-dump salias "SFT.5 created for var m offset 128"
FAIL: gcc.dg/tree-ssa/gen-vect-11.c scan-tree-dump-times vect "vectorized 1 loops" 1
FAIL: gcc.dg/tree-ssa/gen-vect-25.c scan-tree-dump-times vect "vectorized 2 loops" 1
FAIL: gcc.dg/tree-ssa/ifc-20040816-2.c (test for excess errors)
FAIL: gcc.dg/tree-ssa/ifc-20040816-2.c scan-tree-dump-times ifcvt "Applying if-conversion" 1
FAIL: gcc.dg/tree-ssa/pr22591.c (internal compiler error)
FAIL: gcc.dg/tree-ssa/pr22591.c (test for excess errors)
UNRESOLVED: gcc.dg/tree-ssa/pr22591.c compilation failed to produce executable
FAIL: gcc.dg/tree-ssa/pr32540-1.c (test for excess errors)
FAIL: gcc.dg/tree-ssa/pr32540-2.c (test for excess errors)
FAIL: gcc.dg/tree-ssa/pr32540.c (test for excess errors)
FAIL: gcc.dg/tree-ssa/pr33920.c (test for excess errors)
FAIL: gcc.dg/tree-ssa/ssa-ccp-3.c (internal compiler error)
FAIL: gcc.dg/tree-ssa/ssa-ccp-3.c (test for excess errors)
FAIL: gcc.misc-tests/bprob-1.c execution: file bprob-1.gcda does not exist,  -fprofile-arcs
UNRESOLVED: gcc.misc-tests/bprob-1.c compilation,  -fbranch-probabilities
UNRESOLVED: gcc.misc-tests/bprob-1.c execution,    -fbranch-probabilities
FAIL: gcc.misc-tests/bprob-2.c execution: file bprob-2.gcda does not exist,  -fprofile-arcs
UNRESOLVED: gcc.misc-tests/bprob-2.c compilation,  -fbranch-probabilities
UNRESOLVED: gcc.misc-tests/bprob-2.c execution,    -fbranch-probabilities
FAIL: gcc.target/xstormy16/below100.S (test for excess errors)
ERROR: gcc.target/xstormy16/below_100.c --save-temps -fno-inline-functions -L/work/sources/gcc/current/gcc/testsuite/gcc.target/xstormy16: error executing dg-final: couldn't open "xstormy16.s": no such file or directory
UNRESOLVED: gcc.target/xstormy16/below_100.c --save-temps -fno-inline-functions -L/work/sources/gcc/current/gcc/testsuite/gcc.target/xstormy16: error executing dg-final: couldn't open "xstormy16.s": no such file or directory
ERROR: gcc.target/xstormy16/bp.c --save-temps -fno-inline-functions -L/work/sources/gcc/current/gcc/testsuite/gcc.target/xstormy16: error executing dg-final: couldn't open "xstormy16.s": no such file or directory
UNRESOLVED: gcc.target/xstormy16/bp.c --save-temps -fno-inline-functions -L/work/sources/gcc/current/gcc/testsuite/gcc.target/xstormy16: error executing dg-final: couldn't open "xstormy16.s": no such file or directory
FAIL: gcc.target/xstormy16/bss_below100/01_const_to_b100b.c --save-temps -fno-inline-functions -L/work/sources/gcc/current/gcc/testsuite/gcc.target/xstormy16 (test for excess errors)
UNRESOLVED: gcc.target/xstormy16/bss_below100/01_const_to_b100b.c --save-temps -fno-inline-functions -L/work/sources/gcc/current/gcc/testsuite/gcc.target/xstormy16 compilation failed to produce executable
ERROR: gcc.target/xstormy16/bss_below100/01_const_to_b100b.c --save-temps -fno-inline-functions -L/work/sources/gcc/current/gcc/testsuite/gcc.target/xstormy16: error executing dg-final: couldn't open "xstormy16.s": no such file or directory
UNRESOLVED: gcc.target/xstormy16/bss_below100/01_const_to_b100b.c --save-temps -fno-inline-functions -L/work/sources/gcc/current/gcc/testsuite/gcc.target/xstormy16: error executing dg-final: couldn't open "xstormy16.s": no such file or directory
FAIL: gcc.target/xstormy16/bss_below100/02_const_to_b100w.c --save-temps -fno-inline-functions -L/work/sources/gcc/current/gcc/testsuite/gcc.target/xstormy16 (test for excess errors)
UNRESOLVED: gcc.target/xstormy16/bss_below100/02_const_to_b100w.c --save-temps -fno-inline-functions -L/work/sources/gcc/current/gcc/testsuite/gcc.target/xstormy16 compilation failed to produce executable
ERROR: gcc.target/xstormy16/bss_below100/02_const_to_b100w.c --save-temps -fno-inline-functions -L/work/sources/gcc/current/gcc/testsuite/gcc.target/xstormy16: error executing dg-final: couldn't open "xstormy16.s": no such file or directory
UNRESOLVED: gcc.target/xstormy16/bss_below100/02_const_to_b100w.c --save-temps -fno-inline-functions -L/work/sources/gcc/current/gcc/testsuite/gcc.target/xstormy16: error executing dg-final: couldn't open "xstormy16.s": no such file or directory
FAIL: gcc.target/xstormy16/bss_below100/03_var_to_b100b.c --save-temps -fno-inline-functions -L/work/sources/gcc/current/gcc/testsuite/gcc.target/xstormy16 (test for excess errors)
UNRESOLVED: gcc.target/xstormy16/bss_below100/03_var_to_b100b.c --save-temps -fno-inline-functions -L/work/sources/gcc/current/gcc/testsuite/gcc.target/xstormy16 compilation failed to produce executable
ERROR: gcc.target/xstormy16/bss_below100/03_var_to_b100b.c --save-temps -fno-inline-functions -L/work/sources/gcc/current/gcc/testsuite/gcc.target/xstormy16: error executing dg-final: couldn't open "xstormy16.s": no such file or directory
UNRESOLVED: gcc.target/xstormy16/bss_below100/03_var_to_b100b.c --save-temps -fno-inline-functions -L/work/sources/gcc/current/gcc/testsuite/gcc.target/xstormy16: error executing dg-final: couldn't open "xstormy16.s": no such file or directory
FAIL: gcc.target/xstormy16/bss_below100/04_var_to_b100w.c --save-temps -fno-inline-functions -L/work/sources/gcc/current/gcc/testsuite/gcc.target/xstormy16 (test for excess errors)
UNRESOLVED: gcc.target/xstormy16/bss_below100/04_var_to_b100w.c --save-temps -fno-inline-functions -L/work/sources/gcc/current/gcc/testsuite/gcc.target/xstormy16 compilation failed to produce executable
ERROR: gcc.target/xstormy16/bss_below100/04_var_to_b100w.c --save-temps -fno-inline-functions -L/work/sources/gcc/current/gcc/testsuite/gcc.target/xstormy16: error executing dg-final: couldn't open "xstormy16.s": no such file or directory
UNRESOLVED: gcc.target/xstormy16/bss_below100/04_var_to_b100w.c --save-temps -fno-inline-functions -L/work/sources/gcc/current/gcc/testsuite/gcc.target/xstormy16: error executing dg-final: couldn't open "xstormy16.s": no such file or directory
FAIL: gcc.target/xstormy16/bss_below100/05_b100b_to_var.c --save-temps -fno-inline-functions -L/work/sources/gcc/current/gcc/testsuite/gcc.target/xstormy16 (test for excess errors)
UNRESOLVED: gcc.target/xstormy16/bss_below100/05_b100b_to_var.c --save-temps -fno-inline-functions -L/work/sources/gcc/current/gcc/testsuite/gcc.target/xstormy16 compilation failed to produce executable
ERROR: gcc.target/xstormy16/bss_below100/05_b100b_to_var.c --save-temps -fno-inline-functions -L/work/sources/gcc/current/gcc/testsuite/gcc.target/xstormy16: error executing dg-final: couldn't open "xstormy16.s": no such file or directory
UNRESOLVED: gcc.target/xstormy16/bss_below100/05_b100b_to_var.c --save-temps -fno-inline-functions -L/work/sources/gcc/current/gcc/testsuite/gcc.target/xstormy16: error executing dg-final: couldn't open "xstormy16.s": no such file or directory
FAIL: gcc.target/xstormy16/bss_below100/06_b100w_to_var.c --save-temps -fno-inline-functions -L/work/sources/gcc/current/gcc/testsuite/gcc.target/xstormy16 (test for excess errors)
UNRESOLVED: gcc.target/xstormy16/bss_below100/06_b100w_to_var.c --save-temps -fno-inline-functions -L/work/sources/gcc/current/gcc/testsuite/gcc.target/xstormy16 compilation failed to produce executable
ERROR: gcc.target/xstormy16/bss_below100/06_b100w_to_var.c --save-temps -fno-inline-functions -L/work/sources/gcc/current/gcc/testsuite/gcc.target/xstormy16: error executing dg-final: couldn't open "xstormy16.s": no such file or directory
UNRESOLVED: gcc.target/xstormy16/bss_below100/06_b100w_to_var.c --save-temps -fno-inline-functions -L/work/sources/gcc/current/gcc/testsuite/gcc.target/xstormy16: error executing dg-final: couldn't open "xstormy16.s": no such file or directory
FAIL: gcc.target/xstormy16/bss_below100/10_set_b100b_bit_0.c --save-temps -fno-inline-functions -L/work/sources/gcc/current/gcc/testsuite/gcc.target/xstormy16 (test for excess errors)
UNRESOLVED: gcc.target/xstormy16/bss_below100/10_set_b100b_bit_0.c --save-temps -fno-inline-functions -L/work/sources/gcc/current/gcc/testsuite/gcc.target/xstormy16 compilation failed to produce executable
ERROR: gcc.target/xstormy16/bss_below100/10_set_b100b_bit_0.c --save-temps -fno-inline-functions -L/work/sources/gcc/current/gcc/testsuite/gcc.target/xstormy16: error executing dg-final: couldn't open "xstormy16.s": no such file or directory
UNRESOLVED: gcc.target/xstormy16/bss_below100/10_set_b100b_bit_0.c --save-temps -fno-inline-functions -L/work/sources/gcc/current/gcc/testsuite/gcc.target/xstormy16: error executing dg-final: couldn't open "xstormy16.s": no such file or directory
FAIL: gcc.target/xstormy16/bss_below100/10_set_b100b_bit_7.c --save-temps -fno-inline-functions -L/work/sources/gcc/current/gcc/testsuite/gcc.target/xstormy16 (test for excess errors)
UNRESOLVED: gcc.target/xstormy16/bss_below100/10_set_b100b_bit_7.c --save-temps -fno-inline-functions -L/work/sources/gcc/current/gcc/testsuite/gcc.target/xstormy16 compilation failed to produce executable
ERROR: gcc.target/xstormy16/bss_below100/10_set_b100b_bit_7.c --save-temps -fno-inline-functions -L/work/sources/gcc/current/gcc/testsuite/gcc.target/xstormy16: error executing dg-final: couldn't open "xstormy16.s": no such file or directory
UNRESOLVED: gcc.target/xstormy16/bss_below100/10_set_b100b_bit_7.c --save-temps -fno-inline-functions -L/work/sources/gcc/current/gcc/testsuite/gcc.target/xstormy16: error executing dg-final: couldn't open "xstormy16.s": no such file or directory
FAIL: gcc.target/xstormy16/bss_below100/11_clr_b100b_bit_0.c --save-temps -fno-inline-functions -L/work/sources/gcc/current/gcc/testsuite/gcc.target/xstormy16 (test for excess errors)
UNRESOLVED: gcc.target/xstormy16/bss_below100/11_clr_b100b_bit_0.c --save-temps -fno-inline-functions -L/work/sources/gcc/current/gcc/testsuite/gcc.target/xstormy16 compilation failed to produce executable
ERROR: gcc.target/xstormy16/bss_below100/11_clr_b100b_bit_0.c --save-temps -fno-inline-functions -L/work/sources/gcc/current/gcc/testsuite/gcc.target/xstormy16: error executing dg-final: couldn't open "xstormy16.s": no such file or directory
UNRESOLVED: gcc.target/xstormy16/bss_below100/11_clr_b100b_bit_0.c --save-temps -fno-inline-functions -L/work/sources/gcc/current/gcc/testsuite/gcc.target/xstormy16: error executing dg-final: couldn't open "xstormy16.s": no such file or directory
FAIL: gcc.target/xstormy16/bss_below100/11_clr_b100b_bit_7.c --save-temps -fno-inline-functions -L/work/sources/gcc/current/gcc/testsuite/gcc.target/xstormy16 (test for excess errors)
UNRESOLVED: gcc.target/xstormy16/bss_below100/11_clr_b100b_bit_7.c --save-temps -fno-inline-functions -L/work/sources/gcc/current/gcc/testsuite/gcc.target/xstormy16 compilation failed to produce executable
ERROR: gcc.target/xstormy16/bss_below100/11_clr_b100b_bit_7.c --save-temps -fno-inline-functions -L/work/sources/gcc/current/gcc/testsuite/gcc.target/xstormy16: error executing dg-final: couldn't open "xstormy16.s": no such file or directory
UNRESOLVED: gcc.target/xstormy16/bss_below100/11_clr_b100b_bit_7.c --save-temps -fno-inline-functions -L/work/sources/gcc/current/gcc/testsuite/gcc.target/xstormy16: error executing dg-final: couldn't open "xstormy16.s": no such file or directory
FAIL: gcc.target/xstormy16/bss_below100/12_if1_b100b_bit_0.c --save-temps -fno-inline-functions -L/work/sources/gcc/current/gcc/testsuite/gcc.target/xstormy16 (test for excess errors)
UNRESOLVED: gcc.target/xstormy16/bss_below100/12_if1_b100b_bit_0.c --save-temps -fno-inline-functions -L/work/sources/gcc/current/gcc/testsuite/gcc.target/xstormy16 compilation failed to produce executable
ERROR: gcc.target/xstormy16/bss_below100/12_if1_b100b_bit_0.c --save-temps -fno-inline-functions -L/work/sources/gcc/current/gcc/testsuite/gcc.target/xstormy16: error executing dg-final: couldn't open "xstormy16.s": no such file or directory
UNRESOLVED: gcc.target/xstormy16/bss_below100/12_if1_b100b_bit_0.c --save-temps -fno-inline-functions -L/work/sources/gcc/current/gcc/testsuite/gcc.target/xstormy16: error executing dg-final: couldn't open "xstormy16.s": no such file or directory
FAIL: gcc.target/xstormy16/bss_below100/12_if1_b100b_bit_3.c --save-temps -fno-inline-functions -L/work/sources/gcc/current/gcc/testsuite/gcc.target/xstormy16 (internal compiler error)
FAIL: gcc.target/xstormy16/bss_below100/12_if1_b100b_bit_3.c --save-temps -fno-inline-functions -L/work/sources/gcc/current/gcc/testsuite/gcc.target/xstormy16 (test for excess errors)
UNRESOLVED: gcc.target/xstormy16/bss_below100/12_if1_b100b_bit_3.c --save-temps -fno-inline-functions -L/work/sources/gcc/current/gcc/testsuite/gcc.target/xstormy16 compilation failed to produce executable
ERROR: gcc.target/xstormy16/bss_below100/12_if1_b100b_bit_3.c --save-temps -fno-inline-functions -L/work/sources/gcc/current/gcc/testsuite/gcc.target/xstormy16: error executing dg-final: couldn't open "xstormy16.s": no such file or directory
UNRESOLVED: gcc.target/xstormy16/bss_below100/12_if1_b100b_bit_3.c --save-temps -fno-inline-functions -L/work/sources/gcc/current/gcc/testsuite/gcc.target/xstormy16: error executing dg-final: couldn't open "xstormy16.s": no such file or directory
FAIL: gcc.target/xstormy16/bss_below100/12_if1_b100b_bit_7.c --save-temps -fno-inline-functions -L/work/sources/gcc/current/gcc/testsuite/gcc.target/xstormy16 (test for excess errors)
UNRESOLVED: gcc.target/xstormy16/bss_below100/12_if1_b100b_bit_7.c --save-temps -fno-inline-functions -L/work/sources/gcc/current/gcc/testsuite/gcc.target/xstormy16 compilation failed to produce executable
ERROR: gcc.target/xstormy16/bss_below100/12_if1_b100b_bit_7.c --save-temps -fno-inline-functions -L/work/sources/gcc/current/gcc/testsuite/gcc.target/xstormy16: error executing dg-final: couldn't open "xstormy16.s": no such file or directory
UNRESOLVED: gcc.target/xstormy16/bss_below100/12_if1_b100b_bit_7.c --save-temps -fno-inline-functions -L/work/sources/gcc/current/gcc/testsuite/gcc.target/xstormy16: error executing dg-final: couldn't open "xstormy16.s": no such file or directory
FAIL: gcc.target/xstormy16/bss_below100/13_if0_b100b_bit_0.c --save-temps -fno-inline-functions -L/work/sources/gcc/current/gcc/testsuite/gcc.target/xstormy16 (test for excess errors)
UNRESOLVED: gcc.target/xstormy16/bss_below100/13_if0_b100b_bit_0.c --save-temps -fno-inline-functions -L/work/sources/gcc/current/gcc/testsuite/gcc.target/xstormy16 compilation failed to produce executable
ERROR: gcc.target/xstormy16/bss_below100/13_if0_b100b_bit_0.c --save-temps -fno-inline-functions -L/work/sources/gcc/current/gcc/testsuite/gcc.target/xstormy16: error executing dg-final: couldn't open "xstormy16.s": no such file or directory
UNRESOLVED: gcc.target/xstormy16/bss_below100/13_if0_b100b_bit_0.c --save-temps -fno-inline-functions -L/work/sources/gcc/current/gcc/testsuite/gcc.target/xstormy16: error executing dg-final: couldn't open "xstormy16.s": no such file or directory
FAIL: gcc.target/xstormy16/bss_below100/13_if0_b100b_bit_3.c --save-temps -fno-inline-functions -L/work/sources/gcc/current/gcc/testsuite/gcc.target/xstormy16 (internal compiler error)
FAIL: gcc.target/xstormy16/bss_below100/13_if0_b100b_bit_3.c --save-temps -fno-inline-functions -L/work/sources/gcc/current/gcc/testsuite/gcc.target/xstormy16 (test for excess errors)
UNRESOLVED: gcc.target/xstormy16/bss_below100/13_if0_b100b_bit_3.c --save-temps -fno-inline-functions -L/work/sources/gcc/current/gcc/testsuite/gcc.target/xstormy16 compilation failed to produce executable
ERROR: gcc.target/xstormy16/bss_below100/13_if0_b100b_bit_3.c --save-temps -fno-inline-functions -L/work/sources/gcc/current/gcc/testsuite/gcc.target/xstormy16: error executing dg-final: couldn't open "xstormy16.s": no such file or directory
UNRESOLVED: gcc.target/xstormy16/bss_below100/13_if0_b100b_bit_3.c --save-temps -fno-inline-functions -L/work/sources/gcc/current/gcc/testsuite/gcc.target/xstormy16: error executing dg-final: couldn't open "xstormy16.s": no such file or directory
FAIL: gcc.target/xstormy16/bss_below100/13_if0_b100b_bit_7.c --save-temps -fno-inline-functions -L/work/sources/gcc/current/gcc/testsuite/gcc.target/xstormy16 (test for excess errors)
UNRESOLVED: gcc.target/xstormy16/bss_below100/13_if0_b100b_bit_7.c --save-temps -fno-inline-functions -L/work/sources/gcc/current/gcc/testsuite/gcc.target/xstormy16 compilation failed to produce executable
ERROR: gcc.target/xstormy16/bss_below100/13_if0_b100b_bit_7.c --save-temps -fno-inline-functions -L/work/sources/gcc/current/gcc/testsuite/gcc.target/xstormy16: error executing dg-final: couldn't open "xstormy16.s": no such file or directory
UNRESOLVED: gcc.target/xstormy16/bss_below100/13_if0_b100b_bit_7.c --save-temps -fno-inline-functions -L/work/sources/gcc/current/gcc/testsuite/gcc.target/xstormy16: error executing dg-final: couldn't open "xstormy16.s": no such file or directory
FAIL: gcc.target/xstormy16/bss_below100/14_set_b100w_bit_0.c --save-temps -fno-inline-functions -L/work/sources/gcc/current/gcc/testsuite/gcc.target/xstormy16 (test for excess errors)
UNRESOLVED: gcc.target/xstormy16/bss_below100/14_set_b100w_bit_0.c --save-temps -fno-inline-functions -L/work/sources/gcc/current/gcc/testsuite/gcc.target/xstormy16 compilation failed to produce executable
ERROR: gcc.target/xstormy16/bss_below100/14_set_b100w_bit_0.c --save-temps -fno-inline-functions -L/work/sources/gcc/current/gcc/testsuite/gcc.target/xstormy16: error executing dg-final: couldn't open "xstormy16.s": no such file or directory
UNRESOLVED: gcc.target/xstormy16/bss_below100/14_set_b100w_bit_0.c --save-temps -fno-inline-functions -L/work/sources/gcc/current/gcc/testsuite/gcc.target/xstormy16: error executing dg-final: couldn't open "xstormy16.s": no such file or directory
FAIL: gcc.target/xstormy16/bss_below100/14_set_b100w_bit_7.c --save-temps -fno-inline-functions -L/work/sources/gcc/current/gcc/testsuite/gcc.target/xstormy16 (test for excess errors)
UNRESOLVED: gcc.target/xstormy16/bss_below100/14_set_b100w_bit_7.c --save-temps -fno-inline-functions -L/work/sources/gcc/current/gcc/testsuite/gcc.target/xstormy16 compilation failed to produce executable
ERROR: gcc.target/xstormy16/bss_below100/14_set_b100w_bit_7.c --save-temps -fno-inline-functions -L/work/sources/gcc/current/gcc/testsuite/gcc.target/xstormy16: error executing dg-final: couldn't open "xstormy16.s": no such file or directory
UNRESOLVED: gcc.target/xstormy16/bss_below100/14_set_b100w_bit_7.c --save-temps -fno-inline-functions -L/work/sources/gcc/current/gcc/testsuite/gcc.target/xstormy16: error executing dg-final: couldn't open "xstormy16.s": no such file or directory
FAIL: gcc.target/xstormy16/bss_below100/14_set_b100w_bit_8.c --save-temps -fno-inline-functions -L/work/sources/gcc/current/gcc/testsuite/gcc.target/xstormy16 (test for excess errors)
UNRESOLVED: gcc.target/xstormy16/bss_below100/14_set_b100w_bit_8.c --save-temps -fno-inline-functions -L/work/sources/gcc/current/gcc/testsuite/gcc.target/xstormy16 compilation failed to produce executable
ERROR: gcc.target/xstormy16/bss_below100/14_set_b100w_bit_8.c --save-temps -fno-inline-functions -L/work/sources/gcc/current/gcc/testsuite/gcc.target/xstormy16: error executing dg-final: couldn't open "xstormy16.s": no such file or directory
UNRESOLVED: gcc.target/xstormy16/bss_below100/14_set_b100w_bit_8.c --save-temps -fno-inline-functions -L/work/sources/gcc/current/gcc/testsuite/gcc.target/xstormy16: error executing dg-final: couldn't open "xstormy16.s": no such file or directory
FAIL: gcc.target/xstormy16/bss_below100/14_set_b100w_bit_f.c --save-temps -fno-inline-functions -L/work/sources/gcc/current/gcc/testsuite/gcc.target/xstormy16 (test for excess errors)
UNRESOLVED: gcc.target/xstormy16/bss_below100/14_set_b100w_bit_f.c --save-temps -fno-inline-functions -L/work/sources/gcc/current/gcc/testsuite/gcc.target/xstormy16 compilation failed to produce executable
ERROR: gcc.target/xstormy16/bss_below100/14_set_b100w_bit_f.c --save-temps -fno-inline-functions -L/work/sources/gcc/current/gcc/testsuite/gcc.target/xstormy16: error executing dg-final: couldn't open "xstormy16.s": no such file or directory
UNRESOLVED: gcc.target/xstormy16/bss_below100/14_set_b100w_bit_f.c --save-temps -fno-inline-functions -L/work/sources/gcc/current/gcc/testsuite/gcc.target/xstormy16: error executing dg-final: couldn't open "xstormy16.s": no such file or directory
FAIL: gcc.target/xstormy16/bss_below100/15_clr_b100w_bit_0.c --save-temps -fno-inline-functions -L/work/sources/gcc/current/gcc/testsuite/gcc.target/xstormy16 (test for excess errors)
UNRESOLVED: gcc.target/xstormy16/bss_below100/15_clr_b100w_bit_0.c --save-temps -fno-inline-functions -L/work/sources/gcc/current/gcc/testsuite/gcc.target/xstormy16 compilation failed to produce executable
ERROR: gcc.target/xstormy16/bss_below100/15_clr_b100w_bit_0.c --save-temps -fno-inline-functions -L/work/sources/gcc/current/gcc/testsuite/gcc.target/xstormy16: error executing dg-final: couldn't open "xstormy16.s": no such file or directory
UNRESOLVED: gcc.target/xstormy16/bss_below100/15_clr_b100w_bit_0.c --save-temps -fno-inline-functions -L/work/sources/gcc/current/gcc/testsuite/gcc.target/xstormy16: error executing dg-final: couldn't open "xstormy16.s": no such file or directory
FAIL: gcc.target/xstormy16/bss_below100/15_clr_b100w_bit_7.c --save-temps -fno-inline-functions -L/work/sources/gcc/current/gcc/testsuite/gcc.target/xstormy16 (test for excess errors)
UNRESOLVED: gcc.target/xstormy16/bss_below100/15_clr_b100w_bit_7.c --save-temps -fno-inline-functions -L/work/sources/gcc/current/gcc/testsuite/gcc.target/xstormy16 compilation failed to produce executable
ERROR: gcc.target/xstormy16/bss_below100/15_clr_b100w_bit_7.c --save-temps -fno-inline-functions -L/work/sources/gcc/current/gcc/testsuite/gcc.target/xstormy16: error executing dg-final: couldn't open "xstormy16.s": no such file or directory
UNRESOLVED: gcc.target/xstormy16/bss_below100/15_clr_b100w_bit_7.c --save-temps -fno-inline-functions -L/work/sources/gcc/current/gcc/testsuite/gcc.target/xstormy16: error executing dg-final: couldn't open "xstormy16.s": no such file or directory
FAIL: gcc.target/xstormy16/bss_below100/15_clr_b100w_bit_8.c --save-temps -fno-inline-functions -L/work/sources/gcc/current/gcc/testsuite/gcc.target/xstormy16 (test for excess errors)
UNRESOLVED: gcc.target/xstormy16/bss_below100/15_clr_b100w_bit_8.c --save-temps -fno-inline-functions -L/work/sources/gcc/current/gcc/testsuite/gcc.target/xstormy16 compilation failed to produce executable
ERROR: gcc.target/xstormy16/bss_below100/15_clr_b100w_bit_8.c --save-temps -fno-inline-functions -L/work/sources/gcc/current/gcc/testsuite/gcc.target/xstormy16: error executing dg-final: couldn't open "xstormy16.s": no such file or directory
UNRESOLVED: gcc.target/xstormy16/bss_below100/15_clr_b100w_bit_8.c --save-temps -fno-inline-functions -L/work/sources/gcc/current/gcc/testsuite/gcc.target/xstormy16: error executing dg-final: couldn't open "xstormy16.s": no such file or directory
FAIL: gcc.target/xstormy16/bss_below100/15_clr_b100w_bit_f.c --save-temps -fno-inline-functions -L/work/sources/gcc/current/gcc/testsuite/gcc.target/xstormy16 (test for excess errors)
UNRESOLVED: gcc.target/xstormy16/bss_below100/15_clr_b100w_bit_f.c --save-temps -fno-inline-functions -L/work/sources/gcc/current/gcc/testsuite/gcc.target/xstormy16 compilation failed to produce executable
ERROR: gcc.target/xstormy16/bss_below100/15_clr_b100w_bit_f.c --save-temps -fno-inline-functions -L/work/sources/gcc/current/gcc/testsuite/gcc.target/xstormy16: error executing dg-final: couldn't open "xstormy16.s": no such file or directory
UNRESOLVED: gcc.target/xstormy16/bss_below100/15_clr_b100w_bit_f.c --save-temps -fno-inline-functions -L/work/sources/gcc/current/gcc/testsuite/gcc.target/xstormy16: error executing dg-final: couldn't open "xstormy16.s": no such file or directory
FAIL: gcc.target/xstormy16/bss_below100/16_if1_b100w_bit_0.c --save-temps -fno-inline-functions -L/work/sources/gcc/current/gcc/testsuite/gcc.target/xstormy16 (test for excess errors)
UNRESOLVED: gcc.target/xstormy16/bss_below100/16_if1_b100w_bit_0.c --save-temps -fno-inline-functions -L/work/sources/gcc/current/gcc/testsuite/gcc.target/xstormy16 compilation failed to produce executable
ERROR: gcc.target/xstormy16/bss_below100/16_if1_b100w_bit_0.c --save-temps -fno-inline-functions -L/work/sources/gcc/current/gcc/testsuite/gcc.target/xstormy16: error executing dg-final: couldn't open "xstormy16.s": no such file or directory
UNRESOLVED: gcc.target/xstormy16/bss_below100/16_if1_b100w_bit_0.c --save-temps -fno-inline-functions -L/work/sources/gcc/current/gcc/testsuite/gcc.target/xstormy16: error executing dg-final: couldn't open "xstormy16.s": no such file or directory
FAIL: gcc.target/xstormy16/bss_below100/16_if1_b100w_bit_3.c --save-temps -fno-inline-functions -L/work/sources/gcc/current/gcc/testsuite/gcc.target/xstormy16 (internal compiler error)
FAIL: gcc.target/xstormy16/bss_below100/16_if1_b100w_bit_3.c --save-temps -fno-inline-functions -L/work/sources/gcc/current/gcc/testsuite/gcc.target/xstormy16 (test for excess errors)
UNRESOLVED: gcc.target/xstormy16/bss_below100/16_if1_b100w_bit_3.c --save-temps -fno-inline-functions -L/work/sources/gcc/current/gcc/testsuite/gcc.target/xstormy16 compilation failed to produce executable
ERROR: gcc.target/xstormy16/bss_below100/16_if1_b100w_bit_3.c --save-temps -fno-inline-functions -L/work/sources/gcc/current/gcc/testsuite/gcc.target/xstormy16: error executing dg-final: couldn't open "xstormy16.s": no such file or directory
UNRESOLVED: gcc.target/xstormy16/bss_below100/16_if1_b100w_bit_3.c --save-temps -fno-inline-functions -L/work/sources/gcc/current/gcc/testsuite/gcc.target/xstormy16: error executing dg-final: couldn't open "xstormy16.s": no such file or directory
FAIL: gcc.target/xstormy16/bss_below100/16_if1_b100w_bit_7.c --save-temps -fno-inline-functions -L/work/sources/gcc/current/gcc/testsuite/gcc.target/xstormy16 (test for excess errors)
UNRESOLVED: gcc.target/xstormy16/bss_below100/16_if1_b100w_bit_7.c --save-temps -fno-inline-functions -L/work/sources/gcc/current/gcc/testsuite/gcc.target/xstormy16 compilation failed to produce executable
ERROR: gcc.target/xstormy16/bss_below100/16_if1_b100w_bit_7.c --save-temps -fno-inline-functions -L/work/sources/gcc/current/gcc/testsuite/gcc.target/xstormy16: error executing dg-final: couldn't open "xstormy16.s": no such file or directory
UNRESOLVED: gcc.target/xstormy16/bss_below100/16_if1_b100w_bit_7.c --save-temps -fno-inline-functions -L/work/sources/gcc/current/gcc/testsuite/gcc.target/xstormy16: error executing dg-final: couldn't open "xstormy16.s": no such file or directory
FAIL: gcc.target/xstormy16/bss_below100/16_if1_b100w_bit_8.c --save-temps -fno-inline-functions -L/work/sources/gcc/current/gcc/testsuite/gcc.target/xstormy16 (test for excess errors)
UNRESOLVED: gcc.target/xstormy16/bss_below100/16_if1_b100w_bit_8.c --save-temps -fno-inline-functions -L/work/sources/gcc/current/gcc/testsuite/gcc.target/xstormy16 compilation failed to produce executable
ERROR: gcc.target/xstormy16/bss_below100/16_if1_b100w_bit_8.c --save-temps -fno-inline-functions -L/work/sources/gcc/current/gcc/testsuite/gcc.target/xstormy16: error executing dg-final: couldn't open "xstormy16.s": no such file or directory
UNRESOLVED: gcc.target/xstormy16/bss_below100/16_if1_b100w_bit_8.c --save-temps -fno-inline-functions -L/work/sources/gcc/current/gcc/testsuite/gcc.target/xstormy16: error executing dg-final: couldn't open "xstormy16.s": no such file or directory
FAIL: gcc.target/xstormy16/bss_below100/16_if1_b100w_bit_b.c --save-temps -fno-inline-functions -L/work/sources/gcc/current/gcc/testsuite/gcc.target/xstormy16 (internal compiler error)
FAIL: gcc.target/xstormy16/bss_below100/16_if1_b100w_bit_b.c --save-temps -fno-inline-functions -L/work/sources/gcc/current/gcc/testsuite/gcc.target/xstormy16 (test for excess errors)
UNRESOLVED: gcc.target/xstormy16/bss_below100/16_if1_b100w_bit_b.c --save-temps -fno-inline-functions -L/work/sources/gcc/current/gcc/testsuite/gcc.target/xstormy16 compilation failed to produce executable
ERROR: gcc.target/xstormy16/bss_below100/16_if1_b100w_bit_b.c --save-temps -fno-inline-functions -L/work/sources/gcc/current/gcc/testsuite/gcc.target/xstormy16: error executing dg-final: couldn't open "xstormy16.s": no such file or directory
UNRESOLVED: gcc.target/xstormy16/bss_below100/16_if1_b100w_bit_b.c --save-temps -fno-inline-functions -L/work/sources/gcc/current/gcc/testsuite/gcc.target/xstormy16: error executing dg-final: couldn't open "xstormy16.s": no such file or directory
FAIL: gcc.target/xstormy16/bss_below100/16_if1_b100w_bit_f.c --save-temps -fno-inline-functions -L/work/sources/gcc/current/gcc/testsuite/gcc.target/xstormy16 (test for excess errors)
UNRESOLVED: gcc.target/xstormy16/bss_below100/16_if1_b100w_bit_f.c --save-temps -fno-inline-functions -L/work/sources/gcc/current/gcc/testsuite/gcc.target/xstormy16 compilation failed to produce executable
ERROR: gcc.target/xstormy16/bss_below100/16_if1_b100w_bit_f.c --save-temps -fno-inline-functions -L/work/sources/gcc/current/gcc/testsuite/gcc.target/xstormy16: error executing dg-final: couldn't open "xstormy16.s": no such file or directory
UNRESOLVED: gcc.target/xstormy16/bss_below100/16_if1_b100w_bit_f.c --save-temps -fno-inline-functions -L/work/sources/gcc/current/gcc/testsuite/gcc.target/xstormy16: error executing dg-final: couldn't open "xstormy16.s": no such file or directory
FAIL: gcc.target/xstormy16/bss_below100/17_if0_b100w_bit_0.c --save-temps -fno-inline-functions -L/work/sources/gcc/current/gcc/testsuite/gcc.target/xstormy16 (test for excess errors)
UNRESOLVED: gcc.target/xstormy16/bss_below100/17_if0_b100w_bit_0.c --save-temps -fno-inline-functions -L/work/sources/gcc/current/gcc/testsuite/gcc.target/xstormy16 compilation failed to produce executable
ERROR: gcc.target/xstormy16/bss_below100/17_if0_b100w_bit_0.c --save-temps -fno-inline-functions -L/work/sources/gcc/current/gcc/testsuite/gcc.target/xstormy16: error executing dg-final: couldn't open "xstormy16.s": no such file or directory
UNRESOLVED: gcc.target/xstormy16/bss_below100/17_if0_b100w_bit_0.c --save-temps -fno-inline-functions -L/work/sources/gcc/current/gcc/testsuite/gcc.target/xstormy16: error executing dg-final: couldn't open "xstormy16.s": no such file or directory
FAIL: gcc.target/xstormy16/bss_below100/17_if0_b100w_bit_3.c --save-temps -fno-inline-functions -L/work/sources/gcc/current/gcc/testsuite/gcc.target/xstormy16 (internal compiler error)
FAIL: gcc.target/xstormy16/bss_below100/17_if0_b100w_bit_3.c --save-temps -fno-inline-functions -L/work/sources/gcc/current/gcc/testsuite/gcc.target/xstormy16 (test for excess errors)
UNRESOLVED: gcc.target/xstormy16/bss_below100/17_if0_b100w_bit_3.c --save-temps -fno-inline-functions -L/work/sources/gcc/current/gcc/testsuite/gcc.target/xstormy16 compilation failed to produce executable
ERROR: gcc.target/xstormy16/bss_below100/17_if0_b100w_bit_3.c --save-temps -fno-inline-functions -L/work/sources/gcc/current/gcc/testsuite/gcc.target/xstormy16: error executing dg-final: couldn't open "xstormy16.s": no such file or directory
UNRESOLVED: gcc.target/xstormy16/bss_below100/17_if0_b100w_bit_3.c --save-temps -fno-inline-functions -L/work/sources/gcc/current/gcc/testsuite/gcc.target/xstormy16: error executing dg-final: couldn't open "xstormy16.s": no such file or directory
FAIL: gcc.target/xstormy16/bss_below100/17_if0_b100w_bit_7.c --save-temps -fno-inline-functions -L/work/sources/gcc/current/gcc/testsuite/gcc.target/xstormy16 (test for excess errors)
UNRESOLVED: gcc.target/xstormy16/bss_below100/17_if0_b100w_bit_7.c --save-temps -fno-inline-functions -L/work/sources/gcc/current/gcc/testsuite/gcc.target/xstormy16 compilation failed to produce executable
ERROR: gcc.target/xstormy16/bss_below100/17_if0_b100w_bit_7.c --save-temps -fno-inline-functions -L/work/sources/gcc/current/gcc/testsuite/gcc.target/xstormy16: error executing dg-final: couldn't open "xstormy16.s": no such file or directory
UNRESOLVED: gcc.target/xstormy16/bss_below100/17_if0_b100w_bit_7.c --save-temps -fno-inline-functions -L/work/sources/gcc/current/gcc/testsuite/gcc.target/xstormy16: error executing dg-final: couldn't open "xstormy16.s": no such file or directory
FAIL: gcc.target/xstormy16/bss_below100/17_if0_b100w_bit_8.c --save-temps -fno-inline-functions -L/work/sources/gcc/current/gcc/testsuite/gcc.target/xstormy16 (test for excess errors)
UNRESOLVED: gcc.target/xstormy16/bss_below100/17_if0_b100w_bit_8.c --save-temps -fno-inline-functions -L/work/sources/gcc/current/gcc/testsuite/gcc.target/xstormy16 compilation failed to produce executable
ERROR: gcc.target/xstormy16/bss_below100/17_if0_b100w_bit_8.c --save-temps -fno-inline-functions -L/work/sources/gcc/current/gcc/testsuite/gcc.target/xstormy16: error executing dg-final: couldn't open "xstormy16.s": no such file or directory
UNRESOLVED: gcc.target/xstormy16/bss_below100/17_if0_b100w_bit_8.c --save-temps -fno-inline-functions -L/work/sources/gcc/current/gcc/testsuite/gcc.target/xstormy16: error executing dg-final: couldn't open "xstormy16.s": no such file or directory
FAIL: gcc.target/xstormy16/bss_below100/17_if0_b100w_bit_b.c --save-temps -fno-inline-functions -L/work/sources/gcc/current/gcc/testsuite/gcc.target/xstormy16 (internal compiler error)
FAIL: gcc.target/xstormy16/bss_below100/17_if0_b100w_bit_b.c --save-temps -fno-inline-functions -L/work/sources/gcc/current/gcc/testsuite/gcc.target/xstormy16 (test for excess errors)
UNRESOLVED: gcc.target/xstormy16/bss_below100/17_if0_b100w_bit_b.c --save-temps -fno-inline-functions -L/work/sources/gcc/current/gcc/testsuite/gcc.target/xstormy16 compilation failed to produce executable
ERROR: gcc.target/xstormy16/bss_below100/17_if0_b100w_bit_b.c --save-temps -fno-inline-functions -L/work/sources/gcc/current/gcc/testsuite/gcc.target/xstormy16: error executing dg-final: couldn't open "xstormy16.s": no such file or directory
UNRESOLVED: gcc.target/xstormy16/bss_below100/17_if0_b100w_bit_b.c --save-temps -fno-inline-functions -L/work/sources/gcc/current/gcc/testsuite/gcc.target/xstormy16: error executing dg-final: couldn't open "xstormy16.s": no such file or directory
FAIL: gcc.target/xstormy16/bss_below100/17_if0_b100w_bit_f.c --save-temps -fno-inline-functions -L/work/sources/gcc/current/gcc/testsuite/gcc.target/xstormy16 (test for excess errors)
UNRESOLVED: gcc.target/xstormy16/bss_below100/17_if0_b100w_bit_f.c --save-temps -fno-inline-functions -L/work/sources/gcc/current/gcc/testsuite/gcc.target/xstormy16 compilation failed to produce executable
ERROR: gcc.target/xstormy16/bss_below100/17_if0_b100w_bit_f.c --save-temps -fno-inline-functions -L/work/sources/gcc/current/gcc/testsuite/gcc.target/xstormy16: error executing dg-final: couldn't open "xstormy16.s": no such file or directory
UNRESOLVED: gcc.target/xstormy16/bss_below100/17_if0_b100w_bit_f.c --save-temps -fno-inline-functions -L/work/sources/gcc/current/gcc/testsuite/gcc.target/xstormy16: error executing dg-final: couldn't open "xstormy16.s": no such file or directory
FAIL: gcc.target/xstormy16/bss_below100/20_set_b100b_bitfield_0.c --save-temps -fno-inline-functions -L/work/sources/gcc/current/gcc/testsuite/gcc.target/xstormy16 (test for excess errors)
UNRESOLVED: gcc.target/xstormy16/bss_below100/20_set_b100b_bitfield_0.c --save-temps -fno-inline-functions -L/work/sources/gcc/current/gcc/testsuite/gcc.target/xstormy16 compilation failed to produce executable
ERROR: gcc.target/xstormy16/bss_below100/20_set_b100b_bitfield_0.c --save-temps -fno-inline-functions -L/work/sources/gcc/current/gcc/testsuite/gcc.target/xstormy16: error executing dg-final: couldn't open "xstormy16.s": no such file or directory
UNRESOLVED: gcc.target/xstormy16/bss_below100/20_set_b100b_bitfield_0.c --save-temps -fno-inline-functions -L/work/sources/gcc/current/gcc/testsuite/gcc.target/xstormy16: error executing dg-final: couldn't open "xstormy16.s": no such file or directory
FAIL: gcc.target/xstormy16/bss_below100/20_set_b100b_bitfield_7.c --save-temps -fno-inline-functions -L/work/sources/gcc/current/gcc/testsuite/gcc.target/xstormy16 (test for excess errors)
UNRESOLVED: gcc.target/xstormy16/bss_below100/20_set_b100b_bitfield_7.c --save-temps -fno-inline-functions -L/work/sources/gcc/current/gcc/testsuite/gcc.target/xstormy16 compilation failed to produce executable
ERROR: gcc.target/xstormy16/bss_below100/20_set_b100b_bitfield_7.c --save-temps -fno-inline-functions -L/work/sources/gcc/current/gcc/testsuite/gcc.target/xstormy16: error executing dg-final: couldn't open "xstormy16.s": no such file or directory
UNRESOLVED: gcc.target/xstormy16/bss_below100/20_set_b100b_bitfield_7.c --save-temps -fno-inline-functions -L/work/sources/gcc/current/gcc/testsuite/gcc.target/xstormy16: error executing dg-final: couldn't open "xstormy16.s": no such file or directory
FAIL: gcc.target/xstormy16/bss_below100/21_clr_b100b_bitfield_0.c --save-temps -fno-inline-functions -L/work/sources/gcc/current/gcc/testsuite/gcc.target/xstormy16 (test for excess errors)
UNRESOLVED: gcc.target/xstormy16/bss_below100/21_clr_b100b_bitfield_0.c --save-temps -fno-inline-functions -L/work/sources/gcc/current/gcc/testsuite/gcc.target/xstormy16 compilation failed to produce executable
ERROR: gcc.target/xstormy16/bss_below100/21_clr_b100b_bitfield_0.c --save-temps -fno-inline-functions -L/work/sources/gcc/current/gcc/testsuite/gcc.target/xstormy16: error executing dg-final: couldn't open "xstormy16.s": no such file or directory
UNRESOLVED: gcc.target/xstormy16/bss_below100/21_clr_b100b_bitfield_0.c --save-temps -fno-inline-functions -L/work/sources/gcc/current/gcc/testsuite/gcc.target/xstormy16: error executing dg-final: couldn't open "xstormy16.s": no such file or directory
FAIL: gcc.target/xstormy16/bss_below100/21_clr_b100b_bitfield_7.c --save-temps -fno-inline-functions -L/work/sources/gcc/current/gcc/testsuite/gcc.target/xstormy16 (test for excess errors)
UNRESOLVED: gcc.target/xstormy16/bss_below100/21_clr_b100b_bitfield_7.c --save-temps -fno-inline-functions -L/work/sources/gcc/current/gcc/testsuite/gcc.target/xstormy16 compilation failed to produce executable
ERROR: gcc.target/xstormy16/bss_below100/21_clr_b100b_bitfield_7.c --save-temps -fno-inline-functions -L/work/sources/gcc/current/gcc/testsuite/gcc.target/xstormy16: error executing dg-final: couldn't open "xstormy16.s": no such file or directory
UNRESOLVED: gcc.target/xstormy16/bss_below100/21_clr_b100b_bitfield_7.c --save-temps -fno-inline-functions -L/work/sources/gcc/current/gcc/testsuite/gcc.target/xstormy16: error executing dg-final: couldn't open "xstormy16.s": no such file or directory
FAIL: gcc.target/xstormy16/bss_below100/22_if1_b100b_bitfield_0.c --save-temps -fno-inline-functions -L/work/sources/gcc/current/gcc/testsuite/gcc.target/xstormy16 (test for excess errors)
UNRESOLVED: gcc.target/xstormy16/bss_below100/22_if1_b100b_bitfield_0.c --save-temps -fno-inline-functions -L/work/sources/gcc/current/gcc/testsuite/gcc.target/xstormy16 compilation failed to produce executable
ERROR: gcc.target/xstormy16/bss_below100/22_if1_b100b_bitfield_0.c --save-temps -fno-inline-functions -L/work/sources/gcc/current/gcc/testsuite/gcc.target/xstormy16: error executing dg-final: couldn't open "xstormy16.s": no such file or directory
UNRESOLVED: gcc.target/xstormy16/bss_below100/22_if1_b100b_bitfield_0.c --save-temps -fno-inline-functions -L/work/sources/gcc/current/gcc/testsuite/gcc.target/xstormy16: error executing dg-final: couldn't open "xstormy16.s": no such file or directory
FAIL: gcc.target/xstormy16/bss_below100/22_if1_b100b_bitfield_3.c --save-temps -fno-inline-functions -L/work/sources/gcc/current/gcc/testsuite/gcc.target/xstormy16 (internal compiler error)
FAIL: gcc.target/xstormy16/bss_below100/22_if1_b100b_bitfield_3.c --save-temps -fno-inline-functions -L/work/sources/gcc/current/gcc/testsuite/gcc.target/xstormy16 (test for excess errors)
UNRESOLVED: gcc.target/xstormy16/bss_below100/22_if1_b100b_bitfield_3.c --save-temps -fno-inline-functions -L/work/sources/gcc/current/gcc/testsuite/gcc.target/xstormy16 compilation failed to produce executable
ERROR: gcc.target/xstormy16/bss_below100/22_if1_b100b_bitfield_3.c --save-temps -fno-inline-functions -L/work/sources/gcc/current/gcc/testsuite/gcc.target/xstormy16: error executing dg-final: couldn't open "xstormy16.s": no such file or directory
UNRESOLVED: gcc.target/xstormy16/bss_below100/22_if1_b100b_bitfield_3.c --save-temps -fno-inline-functions -L/work/sources/gcc/current/gcc/testsuite/gcc.target/xstormy16: error executing dg-final: couldn't open "xstormy16.s": no such file or directory
FAIL: gcc.target/xstormy16/bss_below100/22_if1_b100b_bitfield_7.c --save-temps -fno-inline-functions -L/work/sources/gcc/current/gcc/testsuite/gcc.target/xstormy16 (test for excess errors)
UNRESOLVED: gcc.target/xstormy16/bss_below100/22_if1_b100b_bitfield_7.c --save-temps -fno-inline-functions -L/work/sources/gcc/current/gcc/testsuite/gcc.target/xstormy16 compilation failed to produce executable
ERROR: gcc.target/xstormy16/bss_below100/22_if1_b100b_bitfield_7.c --save-temps -fno-inline-functions -L/work/sources/gcc/current/gcc/testsuite/gcc.target/xstormy16: error executing dg-final: couldn't open "xstormy16.s": no such file or directory
UNRESOLVED: gcc.target/xstormy16/bss_below100/22_if1_b100b_bitfield_7.c --save-temps -fno-inline-functions -L/work/sources/gcc/current/gcc/testsuite/gcc.target/xstormy16: error executing dg-final: couldn't open "xstormy16.s": no such file or directory
FAIL: gcc.target/xstormy16/bss_below100/23_if0_b100b_bitfield_0.c --save-temps -fno-inline-functions -L/work/sources/gcc/current/gcc/testsuite/gcc.target/xstormy16 (test for excess errors)
UNRESOLVED: gcc.target/xstormy16/bss_below100/23_if0_b100b_bitfield_0.c --save-temps -fno-inline-functions -L/work/sources/gcc/current/gcc/testsuite/gcc.target/xstormy16 compilation failed to produce executable
ERROR: gcc.target/xstormy16/bss_below100/23_if0_b100b_bitfield_0.c --save-temps -fno-inline-functions -L/work/sources/gcc/current/gcc/testsuite/gcc.target/xstormy16: error executing dg-final: couldn't open "xstormy16.s": no such file or directory
UNRESOLVED: gcc.target/xstormy16/bss_below100/23_if0_b100b_bitfield_0.c --save-temps -fno-inline-functions -L/work/sources/gcc/current/gcc/testsuite/gcc.target/xstormy16: error executing dg-final: couldn't open "xstormy16.s": no such file or directory
FAIL: gcc.target/xstormy16/bss_below100/23_if0_b100b_bitfield_3.c --save-temps -fno-inline-functions -L/work/sources/gcc/current/gcc/testsuite/gcc.target/xstormy16 (test for excess errors)
UNRESOLVED: gcc.target/xstormy16/bss_below100/23_if0_b100b_bitfield_3.c --save-temps -fno-inline-functions -L/work/sources/gcc/current/gcc/testsuite/gcc.target/xstormy16 compilation failed to produce executable
ERROR: gcc.target/xstormy16/bss_below100/23_if0_b100b_bitfield_3.c --save-temps -fno-inline-functions -L/work/sources/gcc/current/gcc/testsuite/gcc.target/xstormy16: error executing dg-final: couldn't open "xstormy16.s": no such file or directory
UNRESOLVED: gcc.target/xstormy16/bss_below100/23_if0_b100b_bitfield_3.c --save-temps -fno-inline-functions -L/work/sources/gcc/current/gcc/testsuite/gcc.target/xstormy16: error executing dg-final: couldn't open "xstormy16.s": no such file or directory
FAIL: gcc.target/xstormy16/bss_below100/23_if0_b100b_bitfield_7.c --save-temps -fno-inline-functions -L/work/sources/gcc/current/gcc/testsuite/gcc.target/xstormy16 (test for excess errors)
UNRESOLVED: gcc.target/xstormy16/bss_below100/23_if0_b100b_bitfield_7.c --save-temps -fno-inline-functions -L/work/sources/gcc/current/gcc/testsuite/gcc.target/xstormy16 compilation failed to produce executable
ERROR: gcc.target/xstormy16/bss_below100/23_if0_b100b_bitfield_7.c --save-temps -fno-inline-functions -L/work/sources/gcc/current/gcc/testsuite/gcc.target/xstormy16: error executing dg-final: couldn't open "xstormy16.s": no such file or directory
UNRESOLVED: gcc.target/xstormy16/bss_below100/23_if0_b100b_bitfield_7.c --save-temps -fno-inline-functions -L/work/sources/gcc/current/gcc/testsuite/gcc.target/xstormy16: error executing dg-final: couldn't open "xstormy16.s": no such file or directory
FAIL: gcc.target/xstormy16/bss_below100/24_set_b100w_bitfield_0.c --save-temps -fno-inline-functions -L/work/sources/gcc/current/gcc/testsuite/gcc.target/xstormy16 (test for excess errors)
UNRESOLVED: gcc.target/xstormy16/bss_below100/24_set_b100w_bitfield_0.c --save-temps -fno-inline-functions -L/work/sources/gcc/current/gcc/testsuite/gcc.target/xstormy16 compilation failed to produce executable
ERROR: gcc.target/xstormy16/bss_below100/24_set_b100w_bitfield_0.c --save-temps -fno-inline-functions -L/work/sources/gcc/current/gcc/testsuite/gcc.target/xstormy16: error executing dg-final: couldn't open "xstormy16.s": no such file or directory
UNRESOLVED: gcc.target/xstormy16/bss_below100/24_set_b100w_bitfield_0.c --save-temps -fno-inline-functions -L/work/sources/gcc/current/gcc/testsuite/gcc.target/xstormy16: error executing dg-final: couldn't open "xstormy16.s": no such file or directory
FAIL: gcc.target/xstormy16/bss_below100/24_set_b100w_bitfield_7.c --save-temps -fno-inline-functions -L/work/sources/gcc/current/gcc/testsuite/gcc.target/xstormy16 (test for excess errors)
UNRESOLVED: gcc.target/xstormy16/bss_below100/24_set_b100w_bitfield_7.c --save-temps -fno-inline-functions -L/work/sources/gcc/current/gcc/testsuite/gcc.target/xstormy16 compilation failed to produce executable
ERROR: gcc.target/xstormy16/bss_below100/24_set_b100w_bitfield_7.c --save-temps -fno-inline-functions -L/work/sources/gcc/current/gcc/testsuite/gcc.target/xstormy16: error executing dg-final: couldn't open "xstormy16.s": no such file or directory
UNRESOLVED: gcc.target/xstormy16/bss_below100/24_set_b100w_bitfield_7.c --save-temps -fno-inline-functions -L/work/sources/gcc/current/gcc/testsuite/gcc.target/xstormy16: error executing dg-final: couldn't open "xstormy16.s": no such file or directory
FAIL: gcc.target/xstormy16/bss_below100/24_set_b100w_bitfield_8.c --save-temps -fno-inline-functions -L/work/sources/gcc/current/gcc/testsuite/gcc.target/xstormy16 (test for excess errors)
UNRESOLVED: gcc.target/xstormy16/bss_below100/24_set_b100w_bitfield_8.c --save-temps -fno-inline-functions -L/work/sources/gcc/current/gcc/testsuite/gcc.target/xstormy16 compilation failed to produce executable
ERROR: gcc.target/xstormy16/bss_below100/24_set_b100w_bitfield_8.c --save-temps -fno-inline-functions -L/work/sources/gcc/current/gcc/testsuite/gcc.target/xstormy16: error executing dg-final: couldn't open "xstormy16.s": no such file or directory
UNRESOLVED: gcc.target/xstormy16/bss_below100/24_set_b100w_bitfield_8.c --save-temps -fno-inline-functions -L/work/sources/gcc/current/gcc/testsuite/gcc.target/xstormy16: error executing dg-final: couldn't open "xstormy16.s": no such file or directory
FAIL: gcc.target/xstormy16/bss_below100/24_set_b100w_bitfield_f.c --save-temps -fno-inline-functions -L/work/sources/gcc/current/gcc/testsuite/gcc.target/xstormy16 (test for excess errors)
UNRESOLVED: gcc.target/xstormy16/bss_below100/24_set_b100w_bitfield_f.c --save-temps -fno-inline-functions -L/work/sources/gcc/current/gcc/testsuite/gcc.target/xstormy16 compilation failed to produce executable
ERROR: gcc.target/xstormy16/bss_below100/24_set_b100w_bitfield_f.c --save-temps -fno-inline-functions -L/work/sources/gcc/current/gcc/testsuite/gcc.target/xstormy16: error executing dg-final: couldn't open "xstormy16.s": no such file or directory
UNRESOLVED: gcc.target/xstormy16/bss_below100/24_set_b100w_bitfield_f.c --save-temps -fno-inline-functions -L/work/sources/gcc/current/gcc/testsuite/gcc.target/xstormy16: error executing dg-final: couldn't open "xstormy16.s": no such file or directory
FAIL: gcc.target/xstormy16/bss_below100/25_clr_b100w_bitfield_0.c --save-temps -fno-inline-functions -L/work/sources/gcc/current/gcc/testsuite/gcc.target/xstormy16 (test for excess errors)
UNRESOLVED: gcc.target/xstormy16/bss_below100/25_clr_b100w_bitfield_0.c --save-temps -fno-inline-functions -L/work/sources/gcc/current/gcc/testsuite/gcc.target/xstormy16 compilation failed to produce executable
ERROR: gcc.target/xstormy16/bss_below100/25_clr_b100w_bitfield_0.c --save-temps -fno-inline-functions -L/work/sources/gcc/current/gcc/testsuite/gcc.target/xstormy16: error executing dg-final: couldn't open "xstormy16.s": no such file or directory
UNRESOLVED: gcc.target/xstormy16/bss_below100/25_clr_b100w_bitfield_0.c --save-temps -fno-inline-functions -L/work/sources/gcc/current/gcc/testsuite/gcc.target/xstormy16: error executing dg-final: couldn't open "xstormy16.s": no such file or directory
FAIL: gcc.target/xstormy16/bss_below100/25_clr_b100w_bitfield_7.c --save-temps -fno-inline-functions -L/work/sources/gcc/current/gcc/testsuite/gcc.target/xstormy16 (test for excess errors)
UNRESOLVED: gcc.target/xstormy16/bss_below100/25_clr_b100w_bitfield_7.c --save-temps -fno-inline-functions -L/work/sources/gcc/current/gcc/testsuite/gcc.target/xstormy16 compilation failed to produce executable
ERROR: gcc.target/xstormy16/bss_below100/25_clr_b100w_bitfield_7.c --save-temps -fno-inline-functions -L/work/sources/gcc/current/gcc/testsuite/gcc.target/xstormy16: error executing dg-final: couldn't open "xstormy16.s": no such file or directory
UNRESOLVED: gcc.target/xstormy16/bss_below100/25_clr_b100w_bitfield_7.c --save-temps -fno-inline-functions -L/work/sources/gcc/current/gcc/testsuite/gcc.target/xstormy16: error executing dg-final: couldn't open "xstormy16.s": no such file or directory
FAIL: gcc.target/xstormy16/bss_below100/25_clr_b100w_bitfield_8.c --save-temps -fno-inline-functions -L/work/sources/gcc/current/gcc/testsuite/gcc.target/xstormy16 (test for excess errors)
UNRESOLVED: gcc.target/xstormy16/bss_below100/25_clr_b100w_bitfield_8.c --save-temps -fno-inline-functions -L/work/sources/gcc/current/gcc/testsuite/gcc.target/xstormy16 compilation failed to produce executable
ERROR: gcc.target/xstormy16/bss_below100/25_clr_b100w_bitfield_8.c --save-temps -fno-inline-functions -L/work/sources/gcc/current/gcc/testsuite/gcc.target/xstormy16: error executing dg-final: couldn't open "xstormy16.s": no such file or directory
UNRESOLVED: gcc.target/xstormy16/bss_below100/25_clr_b100w_bitfield_8.c --save-temps -fno-inline-functions -L/work/sources/gcc/current/gcc/testsuite/gcc.target/xstormy16: error executing dg-final: couldn't open "xstormy16.s": no such file or directory
FAIL: gcc.target/xstormy16/bss_below100/25_clr_b100w_bitfield_f.c --save-temps -fno-inline-functions -L/work/sources/gcc/current/gcc/testsuite/gcc.target/xstormy16 (test for excess errors)
UNRESOLVED: gcc.target/xstormy16/bss_below100/25_clr_b100w_bitfield_f.c --save-temps -fno-inline-functions -L/work/sources/gcc/current/gcc/testsuite/gcc.target/xstormy16 compilation failed to produce executable
ERROR: gcc.target/xstormy16/bss_below100/25_clr_b100w_bitfield_f.c --save-temps -fno-inline-functions -L/work/sources/gcc/current/gcc/testsuite/gcc.target/xstormy16: error executing dg-final: couldn't open "xstormy16.s": no such file or directory
UNRESOLVED: gcc.target/xstormy16/bss_below100/25_clr_b100w_bitfield_f.c --save-temps -fno-inline-functions -L/work/sources/gcc/current/gcc/testsuite/gcc.target/xstormy16: error executing dg-final: couldn't open "xstormy16.s": no such file or directory
FAIL: gcc.target/xstormy16/bss_below100/26_if1_b100w_bitfield_0.c --save-temps -fno-inline-functions -L/work/sources/gcc/current/gcc/testsuite/gcc.target/xstormy16 (test for excess errors)
UNRESOLVED: gcc.target/xstormy16/bss_below100/26_if1_b100w_bitfield_0.c --save-temps -fno-inline-functions -L/work/sources/gcc/current/gcc/testsuite/gcc.target/xstormy16 compilation failed to produce executable
ERROR: gcc.target/xstormy16/bss_below100/26_if1_b100w_bitfield_0.c --save-temps -fno-inline-functions -L/work/sources/gcc/current/gcc/testsuite/gcc.target/xstormy16: error executing dg-final: couldn't open "xstormy16.s": no such file or directory
UNRESOLVED: gcc.target/xstormy16/bss_below100/26_if1_b100w_bitfield_0.c --save-temps -fno-inline-functions -L/work/sources/gcc/current/gcc/testsuite/gcc.target/xstormy16: error executing dg-final: couldn't open "xstormy16.s": no such file or directory
FAIL: gcc.target/xstormy16/bss_below100/26_if1_b100w_bitfield_3.c --save-temps -fno-inline-functions -L/work/sources/gcc/current/gcc/testsuite/gcc.target/xstormy16 (internal compiler error)
FAIL: gcc.target/xstormy16/bss_below100/26_if1_b100w_bitfield_3.c --save-temps -fno-inline-functions -L/work/sources/gcc/current/gcc/testsuite/gcc.target/xstormy16 (test for excess errors)
UNRESOLVED: gcc.target/xstormy16/bss_below100/26_if1_b100w_bitfield_3.c --save-temps -fno-inline-functions -L/work/sources/gcc/current/gcc/testsuite/gcc.target/xstormy16 compilation failed to produce executable
ERROR: gcc.target/xstormy16/bss_below100/26_if1_b100w_bitfield_3.c --save-temps -fno-inline-functions -L/work/sources/gcc/current/gcc/testsuite/gcc.target/xstormy16: error executing dg-final: couldn't open "xstormy16.s": no such file or directory
UNRESOLVED: gcc.target/xstormy16/bss_below100/26_if1_b100w_bitfield_3.c --save-temps -fno-inline-functions -L/work/sources/gcc/current/gcc/testsuite/gcc.target/xstormy16: error executing dg-final: couldn't open "xstormy16.s": no such file or directory
FAIL: gcc.target/xstormy16/bss_below100/26_if1_b100w_bitfield_7.c --save-temps -fno-inline-functions -L/work/sources/gcc/current/gcc/testsuite/gcc.target/xstormy16 (test for excess errors)
UNRESOLVED: gcc.target/xstormy16/bss_below100/26_if1_b100w_bitfield_7.c --save-temps -fno-inline-functions -L/work/sources/gcc/current/gcc/testsuite/gcc.target/xstormy16 compilation failed to produce executable
ERROR: gcc.target/xstormy16/bss_below100/26_if1_b100w_bitfield_7.c --save-temps -fno-inline-functions -L/work/sources/gcc/current/gcc/testsuite/gcc.target/xstormy16: error executing dg-final: couldn't open "xstormy16.s": no such file or directory
UNRESOLVED: gcc.target/xstormy16/bss_below100/26_if1_b100w_bitfield_7.c --save-temps -fno-inline-functions -L/work/sources/gcc/current/gcc/testsuite/gcc.target/xstormy16: error executing dg-final: couldn't open "xstormy16.s": no such file or directory
FAIL: gcc.target/xstormy16/bss_below100/26_if1_b100w_bitfield_8.c --save-temps -fno-inline-functions -L/work/sources/gcc/current/gcc/testsuite/gcc.target/xstormy16 (test for excess errors)
UNRESOLVED: gcc.target/xstormy16/bss_below100/26_if1_b100w_bitfield_8.c --save-temps -fno-inline-functions -L/work/sources/gcc/current/gcc/testsuite/gcc.target/xstormy16 compilation failed to produce executable
ERROR: gcc.target/xstormy16/bss_below100/26_if1_b100w_bitfield_8.c --save-temps -fno-inline-functions -L/work/sources/gcc/current/gcc/testsuite/gcc.target/xstormy16: error executing dg-final: couldn't open "xstormy16.s": no such file or directory
UNRESOLVED: gcc.target/xstormy16/bss_below100/26_if1_b100w_bitfield_8.c --save-temps -fno-inline-functions -L/work/sources/gcc/current/gcc/testsuite/gcc.target/xstormy16: error executing dg-final: couldn't open "xstormy16.s": no such file or directory
FAIL: gcc.target/xstormy16/bss_below100/26_if1_b100w_bitfield_b.c --save-temps -fno-inline-functions -L/work/sources/gcc/current/gcc/testsuite/gcc.target/xstormy16 (internal compiler error)
FAIL: gcc.target/xstormy16/bss_below100/26_if1_b100w_bitfield_b.c --save-temps -fno-inline-functions -L/work/sources/gcc/current/gcc/testsuite/gcc.target/xstormy16 (test for excess errors)
UNRESOLVED: gcc.target/xstormy16/bss_below100/26_if1_b100w_bitfield_b.c --save-temps -fno-inline-functions -L/work/sources/gcc/current/gcc/testsuite/gcc.target/xstormy16 compilation failed to produce executable
ERROR: gcc.target/xstormy16/bss_below100/26_if1_b100w_bitfield_b.c --save-temps -fno-inline-functions -L/work/sources/gcc/current/gcc/testsuite/gcc.target/xstormy16: error executing dg-final: couldn't open "xstormy16.s": no such file or directory
UNRESOLVED: gcc.target/xstormy16/bss_below100/26_if1_b100w_bitfield_b.c --save-temps -fno-inline-functions -L/work/sources/gcc/current/gcc/testsuite/gcc.target/xstormy16: error executing dg-final: couldn't open "xstormy16.s": no such file or directory
FAIL: gcc.target/xstormy16/bss_below100/26_if1_b100w_bitfield_f.c --save-temps -fno-inline-functions -L/work/sources/gcc/current/gcc/testsuite/gcc.target/xstormy16 (test for excess errors)
UNRESOLVED: gcc.target/xstormy16/bss_below100/26_if1_b100w_bitfield_f.c --save-temps -fno-inline-functions -L/work/sources/gcc/current/gcc/testsuite/gcc.target/xstormy16 compilation failed to produce executable
ERROR: gcc.target/xstormy16/bss_below100/26_if1_b100w_bitfield_f.c --save-temps -fno-inline-functions -L/work/sources/gcc/current/gcc/testsuite/gcc.target/xstormy16: error executing dg-final: couldn't open "xstormy16.s": no such file or directory
UNRESOLVED: gcc.target/xstormy16/bss_below100/26_if1_b100w_bitfield_f.c --save-temps -fno-inline-functions -L/work/sources/gcc/current/gcc/testsuite/gcc.target/xstormy16: error executing dg-final: couldn't open "xstormy16.s": no such file or directory
FAIL: gcc.target/xstormy16/bss_below100/27_if0_b100w_bitfield_0.c --save-temps -fno-inline-functions -L/work/sources/gcc/current/gcc/testsuite/gcc.target/xstormy16 (test for excess errors)
UNRESOLVED: gcc.target/xstormy16/bss_below100/27_if0_b100w_bitfield_0.c --save-temps -fno-inline-functions -L/work/sources/gcc/current/gcc/testsuite/gcc.target/xstormy16 compilation failed to produce executable
ERROR: gcc.target/xstormy16/bss_below100/27_if0_b100w_bitfield_0.c --save-temps -fno-inline-functions -L/work/sources/gcc/current/gcc/testsuite/gcc.target/xstormy16: error executing dg-final: couldn't open "xstormy16.s": no such file or directory
UNRESOLVED: gcc.target/xstormy16/bss_below100/27_if0_b100w_bitfield_0.c --save-temps -fno-inline-functions -L/work/sources/gcc/current/gcc/testsuite/gcc.target/xstormy16: error executing dg-final: couldn't open "xstormy16.s": no such file or directory
FAIL: gcc.target/xstormy16/bss_below100/27_if0_b100w_bitfield_3.c --save-temps -fno-inline-functions -L/work/sources/gcc/current/gcc/testsuite/gcc.target/xstormy16 (test for excess errors)
UNRESOLVED: gcc.target/xstormy16/bss_below100/27_if0_b100w_bitfield_3.c --save-temps -fno-inline-functions -L/work/sources/gcc/current/gcc/testsuite/gcc.target/xstormy16 compilation failed to produce executable
ERROR: gcc.target/xstormy16/bss_below100/27_if0_b100w_bitfield_3.c --save-temps -fno-inline-functions -L/work/sources/gcc/current/gcc/testsuite/gcc.target/xstormy16: error executing dg-final: couldn't open "xstormy16.s": no such file or directory
UNRESOLVED: gcc.target/xstormy16/bss_below100/27_if0_b100w_bitfield_3.c --save-temps -fno-inline-functions -L/work/sources/gcc/current/gcc/testsuite/gcc.target/xstormy16: error executing dg-final: couldn't open "xstormy16.s": no such file or directory
FAIL: gcc.target/xstormy16/bss_below100/27_if0_b100w_bitfield_7.c --save-temps -fno-inline-functions -L/work/sources/gcc/current/gcc/testsuite/gcc.target/xstormy16 (test for excess errors)
UNRESOLVED: gcc.target/xstormy16/bss_below100/27_if0_b100w_bitfield_7.c --save-temps -fno-inline-functions -L/work/sources/gcc/current/gcc/testsuite/gcc.target/xstormy16 compilation failed to produce executable
ERROR: gcc.target/xstormy16/bss_below100/27_if0_b100w_bitfield_7.c --save-temps -fno-inline-functions -L/work/sources/gcc/current/gcc/testsuite/gcc.target/xstormy16: error executing dg-final: couldn't open "xstormy16.s": no such file or directory
UNRESOLVED: gcc.target/xstormy16/bss_below100/27_if0_b100w_bitfield_7.c --save-temps -fno-inline-functions -L/work/sources/gcc/current/gcc/testsuite/gcc.target/xstormy16: error executing dg-final: couldn't open "xstormy16.s": no such file or directory
FAIL: gcc.target/xstormy16/bss_below100/27_if0_b100w_bitfield_8.c --save-temps -fno-inline-functions -L/work/sources/gcc/current/gcc/testsuite/gcc.target/xstormy16 (test for excess errors)
UNRESOLVED: gcc.target/xstormy16/bss_below100/27_if0_b100w_bitfield_8.c --save-temps -fno-inline-functions -L/work/sources/gcc/current/gcc/testsuite/gcc.target/xstormy16 compilation failed to produce executable
ERROR: gcc.target/xstormy16/bss_below100/27_if0_b100w_bitfield_8.c --save-temps -fno-inline-functions -L/work/sources/gcc/current/gcc/testsuite/gcc.target/xstormy16: error executing dg-final: couldn't open "xstormy16.s": no such file or directory
UNRESOLVED: gcc.target/xstormy16/bss_below100/27_if0_b100w_bitfield_8.c --save-temps -fno-inline-functions -L/work/sources/gcc/current/gcc/testsuite/gcc.target/xstormy16: error executing dg-final: couldn't open "xstormy16.s": no such file or directory
FAIL: gcc.target/xstormy16/bss_below100/27_if0_b100w_bitfield_b.c --save-temps -fno-inline-functions -L/work/sources/gcc/current/gcc/testsuite/gcc.target/xstormy16 (test for excess errors)
UNRESOLVED: gcc.target/xstormy16/bss_below100/27_if0_b100w_bitfield_b.c --save-temps -fno-inline-functions -L/work/sources/gcc/current/gcc/testsuite/gcc.target/xstormy16 compilation failed to produce executable
ERROR: gcc.target/xstormy16/bss_below100/27_if0_b100w_bitfield_b.c --save-temps -fno-inline-functions -L/work/sources/gcc/current/gcc/testsuite/gcc.target/xstormy16: error executing dg-final: couldn't open "xstormy16.s": no such file or directory
UNRESOLVED: gcc.target/xstormy16/bss_below100/27_if0_b100w_bitfield_b.c --save-temps -fno-inline-functions -L/work/sources/gcc/current/gcc/testsuite/gcc.target/xstormy16: error executing dg-final: couldn't open "xstormy16.s": no such file or directory
FAIL: gcc.target/xstormy16/bss_below100/27_if0_b100w_bitfield_f.c --save-temps -fno-inline-functions -L/work/sources/gcc/current/gcc/testsuite/gcc.target/xstormy16 (test for excess errors)
UNRESOLVED: gcc.target/xstormy16/bss_below100/27_if0_b100w_bitfield_f.c --save-temps -fno-inline-functions -L/work/sources/gcc/current/gcc/testsuite/gcc.target/xstormy16 compilation failed to produce executable
ERROR: gcc.target/xstormy16/bss_below100/27_if0_b100w_bitfield_f.c --save-temps -fno-inline-functions -L/work/sources/gcc/current/gcc/testsuite/gcc.target/xstormy16: error executing dg-final: couldn't open "xstormy16.s": no such file or directory
UNRESOLVED: gcc.target/xstormy16/bss_below100/27_if0_b100w_bitfield_f.c --save-temps -fno-inline-functions -L/work/sources/gcc/current/gcc/testsuite/gcc.target/xstormy16: error executing dg-final: couldn't open "xstormy16.s": no such file or directory
FAIL: gcc.target/xstormy16/data_below100/01_const_to_b100b.c --save-temps -fno-inline-functions -L/work/sources/gcc/current/gcc/testsuite/gcc.target/xstormy16 (test for excess errors)
UNRESOLVED: gcc.target/xstormy16/data_below100/01_const_to_b100b.c --save-temps -fno-inline-functions -L/work/sources/gcc/current/gcc/testsuite/gcc.target/xstormy16 compilation failed to produce executable
ERROR: gcc.target/xstormy16/data_below100/01_const_to_b100b.c --save-temps -fno-inline-functions -L/work/sources/gcc/current/gcc/testsuite/gcc.target/xstormy16: error executing dg-final: couldn't open "xstormy16.s": no such file or directory
UNRESOLVED: gcc.target/xstormy16/data_below100/01_const_to_b100b.c --save-temps -fno-inline-functions -L/work/sources/gcc/current/gcc/testsuite/gcc.target/xstormy16: error executing dg-final: couldn't open "xstormy16.s": no such file or directory
FAIL: gcc.target/xstormy16/data_below100/02_const_to_b100w.c --save-temps -fno-inline-functions -L/work/sources/gcc/current/gcc/testsuite/gcc.target/xstormy16 (test for excess errors)
UNRESOLVED: gcc.target/xstormy16/data_below100/02_const_to_b100w.c --save-temps -fno-inline-functions -L/work/sources/gcc/current/gcc/testsuite/gcc.target/xstormy16 compilation failed to produce executable
ERROR: gcc.target/xstormy16/data_below100/02_const_to_b100w.c --save-temps -fno-inline-functions -L/work/sources/gcc/current/gcc/testsuite/gcc.target/xstormy16: error executing dg-final: couldn't open "xstormy16.s": no such file or directory
UNRESOLVED: gcc.target/xstormy16/data_below100/02_const_to_b100w.c --save-temps -fno-inline-functions -L/work/sources/gcc/current/gcc/testsuite/gcc.target/xstormy16: error executing dg-final: couldn't open "xstormy16.s": no such file or directory
FAIL: gcc.target/xstormy16/data_below100/03_var_to_b100b.c --save-temps -fno-inline-functions -L/work/sources/gcc/current/gcc/testsuite/gcc.target/xstormy16 (test for excess errors)
UNRESOLVED: gcc.target/xstormy16/data_below100/03_var_to_b100b.c --save-temps -fno-inline-functions -L/work/sources/gcc/current/gcc/testsuite/gcc.target/xstormy16 compilation failed to produce executable
ERROR: gcc.target/xstormy16/data_below100/03_var_to_b100b.c --save-temps -fno-inline-functions -L/work/sources/gcc/current/gcc/testsuite/gcc.target/xstormy16: error executing dg-final: couldn't open "xstormy16.s": no such file or directory
UNRESOLVED: gcc.target/xstormy16/data_below100/03_var_to_b100b.c --save-temps -fno-inline-functions -L/work/sources/gcc/current/gcc/testsuite/gcc.target/xstormy16: error executing dg-final: couldn't open "xstormy16.s": no such file or directory
FAIL: gcc.target/xstormy16/data_below100/04_var_to_b100w.c --save-temps -fno-inline-functions -L/work/sources/gcc/current/gcc/testsuite/gcc.target/xstormy16 (test for excess errors)
UNRESOLVED: gcc.target/xstormy16/data_below100/04_var_to_b100w.c --save-temps -fno-inline-functions -L/work/sources/gcc/current/gcc/testsuite/gcc.target/xstormy16 compilation failed to produce executable
ERROR: gcc.target/xstormy16/data_below100/04_var_to_b100w.c --save-temps -fno-inline-functions -L/work/sources/gcc/current/gcc/testsuite/gcc.target/xstormy16: error executing dg-final: couldn't open "xstormy16.s": no such file or directory
UNRESOLVED: gcc.target/xstormy16/data_below100/04_var_to_b100w.c --save-temps -fno-inline-functions -L/work/sources/gcc/current/gcc/testsuite/gcc.target/xstormy16: error executing dg-final: couldn't open "xstormy16.s": no such file or directory
FAIL: gcc.target/xstormy16/data_below100/05_b100b_to_var.c --save-temps -fno-inline-functions -L/work/sources/gcc/current/gcc/testsuite/gcc.target/xstormy16 (test for excess errors)
UNRESOLVED: gcc.target/xstormy16/data_below100/05_b100b_to_var.c --save-temps -fno-inline-functions -L/work/sources/gcc/current/gcc/testsuite/gcc.target/xstormy16 compilation failed to produce executable
ERROR: gcc.target/xstormy16/data_below100/05_b100b_to_var.c --save-temps -fno-inline-functions -L/work/sources/gcc/current/gcc/testsuite/gcc.target/xstormy16: error executing dg-final: couldn't open "xstormy16.s": no such file or directory
UNRESOLVED: gcc.target/xstormy16/data_below100/05_b100b_to_var.c --save-temps -fno-inline-functions -L/work/sources/gcc/current/gcc/testsuite/gcc.target/xstormy16: error executing dg-final: couldn't open "xstormy16.s": no such file or directory
FAIL: gcc.target/xstormy16/data_below100/06_b100w_to_var.c --save-temps -fno-inline-functions -L/work/sources/gcc/current/gcc/testsuite/gcc.target/xstormy16 (test for excess errors)
UNRESOLVED: gcc.target/xstormy16/data_below100/06_b100w_to_var.c --save-temps -fno-inline-functions -L/work/sources/gcc/current/gcc/testsuite/gcc.target/xstormy16 compilation failed to produce executable
ERROR: gcc.target/xstormy16/data_below100/06_b100w_to_var.c --save-temps -fno-inline-functions -L/work/sources/gcc/current/gcc/testsuite/gcc.target/xstormy16: error executing dg-final: couldn't open "xstormy16.s": no such file or directory
UNRESOLVED: gcc.target/xstormy16/data_below100/06_b100w_to_var.c --save-temps -fno-inline-functions -L/work/sources/gcc/current/gcc/testsuite/gcc.target/xstormy16: error executing dg-final: couldn't open "xstormy16.s": no such file or directory
FAIL: gcc.target/xstormy16/data_below100/10_set_b100b_bit_0.c --save-temps -fno-inline-functions -L/work/sources/gcc/current/gcc/testsuite/gcc.target/xstormy16 (test for excess errors)
UNRESOLVED: gcc.target/xstormy16/data_below100/10_set_b100b_bit_0.c --save-temps -fno-inline-functions -L/work/sources/gcc/current/gcc/testsuite/gcc.target/xstormy16 compilation failed to produce executable
ERROR: gcc.target/xstormy16/data_below100/10_set_b100b_bit_0.c --save-temps -fno-inline-functions -L/work/sources/gcc/current/gcc/testsuite/gcc.target/xstormy16: error executing dg-final: couldn't open "xstormy16.s": no such file or directory
UNRESOLVED: gcc.target/xstormy16/data_below100/10_set_b100b_bit_0.c --save-temps -fno-inline-functions -L/work/sources/gcc/current/gcc/testsuite/gcc.target/xstormy16: error executing dg-final: couldn't open "xstormy16.s": no such file or directory
FAIL: gcc.target/xstormy16/data_below100/10_set_b100b_bit_7.c --save-temps -fno-inline-functions -L/work/sources/gcc/current/gcc/testsuite/gcc.target/xstormy16 (test for excess errors)
UNRESOLVED: gcc.target/xstormy16/data_below100/10_set_b100b_bit_7.c --save-temps -fno-inline-functions -L/work/sources/gcc/current/gcc/testsuite/gcc.target/xstormy16 compilation failed to produce executable
ERROR: gcc.target/xstormy16/data_below100/10_set_b100b_bit_7.c --save-temps -fno-inline-functions -L/work/sources/gcc/current/gcc/testsuite/gcc.target/xstormy16: error executing dg-final: couldn't open "xstormy16.s": no such file or directory
UNRESOLVED: gcc.target/xstormy16/data_below100/10_set_b100b_bit_7.c --save-temps -fno-inline-functions -L/work/sources/gcc/current/gcc/testsuite/gcc.target/xstormy16: error executing dg-final: couldn't open "xstormy16.s": no such file or directory
FAIL: gcc.target/xstormy16/data_below100/11_clr_b100b_bit_0.c --save-temps -fno-inline-functions -L/work/sources/gcc/current/gcc/testsuite/gcc.target/xstormy16 (test for excess errors)
UNRESOLVED: gcc.target/xstormy16/data_below100/11_clr_b100b_bit_0.c --save-temps -fno-inline-functions -L/work/sources/gcc/current/gcc/testsuite/gcc.target/xstormy16 compilation failed to produce executable
ERROR: gcc.target/xstormy16/data_below100/11_clr_b100b_bit_0.c --save-temps -fno-inline-functions -L/work/sources/gcc/current/gcc/testsuite/gcc.target/xstormy16: error executing dg-final: couldn't open "xstormy16.s": no such file or directory
UNRESOLVED: gcc.target/xstormy16/data_below100/11_clr_b100b_bit_0.c --save-temps -fno-inline-functions -L/work/sources/gcc/current/gcc/testsuite/gcc.target/xstormy16: error executing dg-final: couldn't open "xstormy16.s": no such file or directory
FAIL: gcc.target/xstormy16/data_below100/11_clr_b100b_bit_7.c --save-temps -fno-inline-functions -L/work/sources/gcc/current/gcc/testsuite/gcc.target/xstormy16 (test for excess errors)
UNRESOLVED: gcc.target/xstormy16/data_below100/11_clr_b100b_bit_7.c --save-temps -fno-inline-functions -L/work/sources/gcc/current/gcc/testsuite/gcc.target/xstormy16 compilation failed to produce executable
ERROR: gcc.target/xstormy16/data_below100/11_clr_b100b_bit_7.c --save-temps -fno-inline-functions -L/work/sources/gcc/current/gcc/testsuite/gcc.target/xstormy16: error executing dg-final: couldn't open "xstormy16.s": no such file or directory
UNRESOLVED: gcc.target/xstormy16/data_below100/11_clr_b100b_bit_7.c --save-temps -fno-inline-functions -L/work/sources/gcc/current/gcc/testsuite/gcc.target/xstormy16: error executing dg-final: couldn't open "xstormy16.s": no such file or directory
FAIL: gcc.target/xstormy16/data_below100/12_if1_b100b_bit_0.c --save-temps -fno-inline-functions -L/work/sources/gcc/current/gcc/testsuite/gcc.target/xstormy16 (test for excess errors)
UNRESOLVED: gcc.target/xstormy16/data_below100/12_if1_b100b_bit_0.c --save-temps -fno-inline-functions -L/work/sources/gcc/current/gcc/testsuite/gcc.target/xstormy16 compilation failed to produce executable
ERROR: gcc.target/xstormy16/data_below100/12_if1_b100b_bit_0.c --save-temps -fno-inline-functions -L/work/sources/gcc/current/gcc/testsuite/gcc.target/xstormy16: error executing dg-final: couldn't open "xstormy16.s": no such file or directory
UNRESOLVED: gcc.target/xstormy16/data_below100/12_if1_b100b_bit_0.c --save-temps -fno-inline-functions -L/work/sources/gcc/current/gcc/testsuite/gcc.target/xstormy16: error executing dg-final: couldn't open "xstormy16.s": no such file or directory
FAIL: gcc.target/xstormy16/data_below100/12_if1_b100b_bit_3.c --save-temps -fno-inline-functions -L/work/sources/gcc/current/gcc/testsuite/gcc.target/xstormy16 (internal compiler error)
FAIL: gcc.target/xstormy16/data_below100/12_if1_b100b_bit_3.c --save-temps -fno-inline-functions -L/work/sources/gcc/current/gcc/testsuite/gcc.target/xstormy16 (test for excess errors)
UNRESOLVED: gcc.target/xstormy16/data_below100/12_if1_b100b_bit_3.c --save-temps -fno-inline-functions -L/work/sources/gcc/current/gcc/testsuite/gcc.target/xstormy16 compilation failed to produce executable
ERROR: gcc.target/xstormy16/data_below100/12_if1_b100b_bit_3.c --save-temps -fno-inline-functions -L/work/sources/gcc/current/gcc/testsuite/gcc.target/xstormy16: error executing dg-final: couldn't open "xstormy16.s": no such file or directory
UNRESOLVED: gcc.target/xstormy16/data_below100/12_if1_b100b_bit_3.c --save-temps -fno-inline-functions -L/work/sources/gcc/current/gcc/testsuite/gcc.target/xstormy16: error executing dg-final: couldn't open "xstormy16.s": no such file or directory
FAIL: gcc.target/xstormy16/data_below100/12_if1_b100b_bit_7.c --save-temps -fno-inline-functions -L/work/sources/gcc/current/gcc/testsuite/gcc.target/xstormy16 (test for excess errors)
UNRESOLVED: gcc.target/xstormy16/data_below100/12_if1_b100b_bit_7.c --save-temps -fno-inline-functions -L/work/sources/gcc/current/gcc/testsuite/gcc.target/xstormy16 compilation failed to produce executable
ERROR: gcc.target/xstormy16/data_below100/12_if1_b100b_bit_7.c --save-temps -fno-inline-functions -L/work/sources/gcc/current/gcc/testsuite/gcc.target/xstormy16: error executing dg-final: couldn't open "xstormy16.s": no such file or directory
UNRESOLVED: gcc.target/xstormy16/data_below100/12_if1_b100b_bit_7.c --save-temps -fno-inline-functions -L/work/sources/gcc/current/gcc/testsuite/gcc.target/xstormy16: error executing dg-final: couldn't open "xstormy16.s": no such file or directory
FAIL: gcc.target/xstormy16/data_below100/13_if0_b100b_bit_0.c --save-temps -fno-inline-functions -L/work/sources/gcc/current/gcc/testsuite/gcc.target/xstormy16 (test for excess errors)
UNRESOLVED: gcc.target/xstormy16/data_below100/13_if0_b100b_bit_0.c --save-temps -fno-inline-functions -L/work/sources/gcc/current/gcc/testsuite/gcc.target/xstormy16 compilation failed to produce executable
ERROR: gcc.target/xstormy16/data_below100/13_if0_b100b_bit_0.c --save-temps -fno-inline-functions -L/work/sources/gcc/current/gcc/testsuite/gcc.target/xstormy16: error executing dg-final: couldn't open "xstormy16.s": no such file or directory
UNRESOLVED: gcc.target/xstormy16/data_below100/13_if0_b100b_bit_0.c --save-temps -fno-inline-functions -L/work/sources/gcc/current/gcc/testsuite/gcc.target/xstormy16: error executing dg-final: couldn't open "xstormy16.s": no such file or directory
FAIL: gcc.target/xstormy16/data_below100/13_if0_b100b_bit_3.c --save-temps -fno-inline-functions -L/work/sources/gcc/current/gcc/testsuite/gcc.target/xstormy16 (internal compiler error)
FAIL: gcc.target/xstormy16/data_below100/13_if0_b100b_bit_3.c --save-temps -fno-inline-functions -L/work/sources/gcc/current/gcc/testsuite/gcc.target/xstormy16 (test for excess errors)
UNRESOLVED: gcc.target/xstormy16/data_below100/13_if0_b100b_bit_3.c --save-temps -fno-inline-functions -L/work/sources/gcc/current/gcc/testsuite/gcc.target/xstormy16 compilation failed to produce executable
ERROR: gcc.target/xstormy16/data_below100/13_if0_b100b_bit_3.c --save-temps -fno-inline-functions -L/work/sources/gcc/current/gcc/testsuite/gcc.target/xstormy16: error executing dg-final: couldn't open "xstormy16.s": no such file or directory
UNRESOLVED: gcc.target/xstormy16/data_below100/13_if0_b100b_bit_3.c --save-temps -fno-inline-functions -L/work/sources/gcc/current/gcc/testsuite/gcc.target/xstormy16: error executing dg-final: couldn't open "xstormy16.s": no such file or directory
FAIL: gcc.target/xstormy16/data_below100/13_if0_b100b_bit_7.c --save-temps -fno-inline-functions -L/work/sources/gcc/current/gcc/testsuite/gcc.target/xstormy16 (test for excess errors)
UNRESOLVED: gcc.target/xstormy16/data_below100/13_if0_b100b_bit_7.c --save-temps -fno-inline-functions -L/work/sources/gcc/current/gcc/testsuite/gcc.target/xstormy16 compilation failed to produce executable
ERROR: gcc.target/xstormy16/data_below100/13_if0_b100b_bit_7.c --save-temps -fno-inline-functions -L/work/sources/gcc/current/gcc/testsuite/gcc.target/xstormy16: error executing dg-final: couldn't open "xstormy16.s": no such file or directory
UNRESOLVED: gcc.target/xstormy16/data_below100/13_if0_b100b_bit_7.c --save-temps -fno-inline-functions -L/work/sources/gcc/current/gcc/testsuite/gcc.target/xstormy16: error executing dg-final: couldn't open "xstormy16.s": no such file or directory
FAIL: gcc.target/xstormy16/data_below100/14_set_b100w_bit_0.c --save-temps -fno-inline-functions -L/work/sources/gcc/current/gcc/testsuite/gcc.target/xstormy16 (test for excess errors)
UNRESOLVED: gcc.target/xstormy16/data_below100/14_set_b100w_bit_0.c --save-temps -fno-inline-functions -L/work/sources/gcc/current/gcc/testsuite/gcc.target/xstormy16 compilation failed to produce executable
ERROR: gcc.target/xstormy16/data_below100/14_set_b100w_bit_0.c --save-temps -fno-inline-functions -L/work/sources/gcc/current/gcc/testsuite/gcc.target/xstormy16: error executing dg-final: couldn't open "xstormy16.s": no such file or directory
UNRESOLVED: gcc.target/xstormy16/data_below100/14_set_b100w_bit_0.c --save-temps -fno-inline-functions -L/work/sources/gcc/current/gcc/testsuite/gcc.target/xstormy16: error executing dg-final: couldn't open "xstormy16.s": no such file or directory
FAIL: gcc.target/xstormy16/data_below100/14_set_b100w_bit_7.c --save-temps -fno-inline-functions -L/work/sources/gcc/current/gcc/testsuite/gcc.target/xstormy16 (test for excess errors)
UNRESOLVED: gcc.target/xstormy16/data_below100/14_set_b100w_bit_7.c --save-temps -fno-inline-functions -L/work/sources/gcc/current/gcc/testsuite/gcc.target/xstormy16 compilation failed to produce executable
ERROR: gcc.target/xstormy16/data_below100/14_set_b100w_bit_7.c --save-temps -fno-inline-functions -L/work/sources/gcc/current/gcc/testsuite/gcc.target/xstormy16: error executing dg-final: couldn't open "xstormy16.s": no such file or directory
UNRESOLVED: gcc.target/xstormy16/data_below100/14_set_b100w_bit_7.c --save-temps -fno-inline-functions -L/work/sources/gcc/current/gcc/testsuite/gcc.target/xstormy16: error executing dg-final: couldn't open "xstormy16.s": no such file or directory
FAIL: gcc.target/xstormy16/data_below100/14_set_b100w_bit_8.c --save-temps -fno-inline-functions -L/work/sources/gcc/current/gcc/testsuite/gcc.target/xstormy16 (test for excess errors)
UNRESOLVED: gcc.target/xstormy16/data_below100/14_set_b100w_bit_8.c --save-temps -fno-inline-functions -L/work/sources/gcc/current/gcc/testsuite/gcc.target/xstormy16 compilation failed to produce executable
ERROR: gcc.target/xstormy16/data_below100/14_set_b100w_bit_8.c --save-temps -fno-inline-functions -L/work/sources/gcc/current/gcc/testsuite/gcc.target/xstormy16: error executing dg-final: couldn't open "xstormy16.s": no such file or directory
UNRESOLVED: gcc.target/xstormy16/data_below100/14_set_b100w_bit_8.c --save-temps -fno-inline-functions -L/work/sources/gcc/current/gcc/testsuite/gcc.target/xstormy16: error executing dg-final: couldn't open "xstormy16.s": no such file or directory
FAIL: gcc.target/xstormy16/data_below100/14_set_b100w_bit_f.c --save-temps -fno-inline-functions -L/work/sources/gcc/current/gcc/testsuite/gcc.target/xstormy16 (test for excess errors)
UNRESOLVED: gcc.target/xstormy16/data_below100/14_set_b100w_bit_f.c --save-temps -fno-inline-functions -L/work/sources/gcc/current/gcc/testsuite/gcc.target/xstormy16 compilation failed to produce executable
ERROR: gcc.target/xstormy16/data_below100/14_set_b100w_bit_f.c --save-temps -fno-inline-functions -L/work/sources/gcc/current/gcc/testsuite/gcc.target/xstormy16: error executing dg-final: couldn't open "xstormy16.s": no such file or directory
UNRESOLVED: gcc.target/xstormy16/data_below100/14_set_b100w_bit_f.c --save-temps -fno-inline-functions -L/work/sources/gcc/current/gcc/testsuite/gcc.target/xstormy16: error executing dg-final: couldn't open "xstormy16.s": no such file or directory
FAIL: gcc.target/xstormy16/data_below100/15_clr_b100w_bit_0.c --save-temps -fno-inline-functions -L/work/sources/gcc/current/gcc/testsuite/gcc.target/xstormy16 (test for excess errors)
UNRESOLVED: gcc.target/xstormy16/data_below100/15_clr_b100w_bit_0.c --save-temps -fno-inline-functions -L/work/sources/gcc/current/gcc/testsuite/gcc.target/xstormy16 compilation failed to produce executable
ERROR: gcc.target/xstormy16/data_below100/15_clr_b100w_bit_0.c --save-temps -fno-inline-functions -L/work/sources/gcc/current/gcc/testsuite/gcc.target/xstormy16: error executing dg-final: couldn't open "xstormy16.s": no such file or directory
UNRESOLVED: gcc.target/xstormy16/data_below100/15_clr_b100w_bit_0.c --save-temps -fno-inline-functions -L/work/sources/gcc/current/gcc/testsuite/gcc.target/xstormy16: error executing dg-final: couldn't open "xstormy16.s": no such file or directory
FAIL: gcc.target/xstormy16/data_below100/15_clr_b100w_bit_7.c --save-temps -fno-inline-functions -L/work/sources/gcc/current/gcc/testsuite/gcc.target/xstormy16 (test for excess errors)
UNRESOLVED: gcc.target/xstormy16/data_below100/15_clr_b100w_bit_7.c --save-temps -fno-inline-functions -L/work/sources/gcc/current/gcc/testsuite/gcc.target/xstormy16 compilation failed to produce executable
ERROR: gcc.target/xstormy16/data_below100/15_clr_b100w_bit_7.c --save-temps -fno-inline-functions -L/work/sources/gcc/current/gcc/testsuite/gcc.target/xstormy16: error executing dg-final: couldn't open "xstormy16.s": no such file or directory
UNRESOLVED: gcc.target/xstormy16/data_below100/15_clr_b100w_bit_7.c --save-temps -fno-inline-functions -L/work/sources/gcc/current/gcc/testsuite/gcc.target/xstormy16: error executing dg-final: couldn't open "xstormy16.s": no such file or directory
FAIL: gcc.target/xstormy16/data_below100/15_clr_b100w_bit_8.c --save-temps -fno-inline-functions -L/work/sources/gcc/current/gcc/testsuite/gcc.target/xstormy16 (test for excess errors)
UNRESOLVED: gcc.target/xstormy16/data_below100/15_clr_b100w_bit_8.c --save-temps -fno-inline-functions -L/work/sources/gcc/current/gcc/testsuite/gcc.target/xstormy16 compilation failed to produce executable
ERROR: gcc.target/xstormy16/data_below100/15_clr_b100w_bit_8.c --save-temps -fno-inline-functions -L/work/sources/gcc/current/gcc/testsuite/gcc.target/xstormy16: error executing dg-final: couldn't open "xstormy16.s": no such file or directory
UNRESOLVED: gcc.target/xstormy16/data_below100/15_clr_b100w_bit_8.c --save-temps -fno-inline-functions -L/work/sources/gcc/current/gcc/testsuite/gcc.target/xstormy16: error executing dg-final: couldn't open "xstormy16.s": no such file or directory
FAIL: gcc.target/xstormy16/data_below100/15_clr_b100w_bit_f.c --save-temps -fno-inline-functions -L/work/sources/gcc/current/gcc/testsuite/gcc.target/xstormy16 (test for excess errors)
UNRESOLVED: gcc.target/xstormy16/data_below100/15_clr_b100w_bit_f.c --save-temps -fno-inline-functions -L/work/sources/gcc/current/gcc/testsuite/gcc.target/xstormy16 compilation failed to produce executable
ERROR: gcc.target/xstormy16/data_below100/15_clr_b100w_bit_f.c --save-temps -fno-inline-functions -L/work/sources/gcc/current/gcc/testsuite/gcc.target/xstormy16: error executing dg-final: couldn't open "xstormy16.s": no such file or directory
UNRESOLVED: gcc.target/xstormy16/data_below100/15_clr_b100w_bit_f.c --save-temps -fno-inline-functions -L/work/sources/gcc/current/gcc/testsuite/gcc.target/xstormy16: error executing dg-final: couldn't open "xstormy16.s": no such file or directory
FAIL: gcc.target/xstormy16/data_below100/16_if1_b100w_bit_0.c --save-temps -fno-inline-functions -L/work/sources/gcc/current/gcc/testsuite/gcc.target/xstormy16 (test for excess errors)
UNRESOLVED: gcc.target/xstormy16/data_below100/16_if1_b100w_bit_0.c --save-temps -fno-inline-functions -L/work/sources/gcc/current/gcc/testsuite/gcc.target/xstormy16 compilation failed to produce executable
ERROR: gcc.target/xstormy16/data_below100/16_if1_b100w_bit_0.c --save-temps -fno-inline-functions -L/work/sources/gcc/current/gcc/testsuite/gcc.target/xstormy16: error executing dg-final: couldn't open "xstormy16.s": no such file or directory
UNRESOLVED: gcc.target/xstormy16/data_below100/16_if1_b100w_bit_0.c --save-temps -fno-inline-functions -L/work/sources/gcc/current/gcc/testsuite/gcc.target/xstormy16: error executing dg-final: couldn't open "xstormy16.s": no such file or directory
FAIL: gcc.target/xstormy16/data_below100/16_if1_b100w_bit_3.c --save-temps -fno-inline-functions -L/work/sources/gcc/current/gcc/testsuite/gcc.target/xstormy16 (internal compiler error)
FAIL: gcc.target/xstormy16/data_below100/16_if1_b100w_bit_3.c --save-temps -fno-inline-functions -L/work/sources/gcc/current/gcc/testsuite/gcc.target/xstormy16 (test for excess errors)
UNRESOLVED: gcc.target/xstormy16/data_below100/16_if1_b100w_bit_3.c --save-temps -fno-inline-functions -L/work/sources/gcc/current/gcc/testsuite/gcc.target/xstormy16 compilation failed to produce executable
ERROR: gcc.target/xstormy16/data_below100/16_if1_b100w_bit_3.c --save-temps -fno-inline-functions -L/work/sources/gcc/current/gcc/testsuite/gcc.target/xstormy16: error executing dg-final: couldn't open "xstormy16.s": no such file or directory
UNRESOLVED: gcc.target/xstormy16/data_below100/16_if1_b100w_bit_3.c --save-temps -fno-inline-functions -L/work/sources/gcc/current/gcc/testsuite/gcc.target/xstormy16: error executing dg-final: couldn't open "xstormy16.s": no such file or directory
FAIL: gcc.target/xstormy16/data_below100/16_if1_b100w_bit_7.c --save-temps -fno-inline-functions -L/work/sources/gcc/current/gcc/testsuite/gcc.target/xstormy16 (test for excess errors)
UNRESOLVED: gcc.target/xstormy16/data_below100/16_if1_b100w_bit_7.c --save-temps -fno-inline-functions -L/work/sources/gcc/current/gcc/testsuite/gcc.target/xstormy16 compilation failed to produce executable
ERROR: gcc.target/xstormy16/data_below100/16_if1_b100w_bit_7.c --save-temps -fno-inline-functions -L/work/sources/gcc/current/gcc/testsuite/gcc.target/xstormy16: error executing dg-final: couldn't open "xstormy16.s": no such file or directory
UNRESOLVED: gcc.target/xstormy16/data_below100/16_if1_b100w_bit_7.c --save-temps -fno-inline-functions -L/work/sources/gcc/current/gcc/testsuite/gcc.target/xstormy16: error executing dg-final: couldn't open "xstormy16.s": no such file or directory
FAIL: gcc.target/xstormy16/data_below100/16_if1_b100w_bit_8.c --save-temps -fno-inline-functions -L/work/sources/gcc/current/gcc/testsuite/gcc.target/xstormy16 (test for excess errors)
UNRESOLVED: gcc.target/xstormy16/data_below100/16_if1_b100w_bit_8.c --save-temps -fno-inline-functions -L/work/sources/gcc/current/gcc/testsuite/gcc.target/xstormy16 compilation failed to produce executable
ERROR: gcc.target/xstormy16/data_below100/16_if1_b100w_bit_8.c --save-temps -fno-inline-functions -L/work/sources/gcc/current/gcc/testsuite/gcc.target/xstormy16: error executing dg-final: couldn't open "xstormy16.s": no such file or directory
UNRESOLVED: gcc.target/xstormy16/data_below100/16_if1_b100w_bit_8.c --save-temps -fno-inline-functions -L/work/sources/gcc/current/gcc/testsuite/gcc.target/xstormy16: error executing dg-final: couldn't open "xstormy16.s": no such file or directory
FAIL: gcc.target/xstormy16/data_below100/16_if1_b100w_bit_b.c --save-temps -fno-inline-functions -L/work/sources/gcc/current/gcc/testsuite/gcc.target/xstormy16 (internal compiler error)
FAIL: gcc.target/xstormy16/data_below100/16_if1_b100w_bit_b.c --save-temps -fno-inline-functions -L/work/sources/gcc/current/gcc/testsuite/gcc.target/xstormy16 (test for excess errors)
UNRESOLVED: gcc.target/xstormy16/data_below100/16_if1_b100w_bit_b.c --save-temps -fno-inline-functions -L/work/sources/gcc/current/gcc/testsuite/gcc.target/xstormy16 compilation failed to produce executable
ERROR: gcc.target/xstormy16/data_below100/16_if1_b100w_bit_b.c --save-temps -fno-inline-functions -L/work/sources/gcc/current/gcc/testsuite/gcc.target/xstormy16: error executing dg-final: couldn't open "xstormy16.s": no such file or directory
UNRESOLVED: gcc.target/xstormy16/data_below100/16_if1_b100w_bit_b.c --save-temps -fno-inline-functions -L/work/sources/gcc/current/gcc/testsuite/gcc.target/xstormy16: error executing dg-final: couldn't open "xstormy16.s": no such file or directory
FAIL: gcc.target/xstormy16/data_below100/16_if1_b100w_bit_f.c --save-temps -fno-inline-functions -L/work/sources/gcc/current/gcc/testsuite/gcc.target/xstormy16 (test for excess errors)
UNRESOLVED: gcc.target/xstormy16/data_below100/16_if1_b100w_bit_f.c --save-temps -fno-inline-functions -L/work/sources/gcc/current/gcc/testsuite/gcc.target/xstormy16 compilation failed to produce executable
ERROR: gcc.target/xstormy16/data_below100/16_if1_b100w_bit_f.c --save-temps -fno-inline-functions -L/work/sources/gcc/current/gcc/testsuite/gcc.target/xstormy16: error executing dg-final: couldn't open "xstormy16.s": no such file or directory
UNRESOLVED: gcc.target/xstormy16/data_below100/16_if1_b100w_bit_f.c --save-temps -fno-inline-functions -L/work/sources/gcc/current/gcc/testsuite/gcc.target/xstormy16: error executing dg-final: couldn't open "xstormy16.s": no such file or directory
FAIL: gcc.target/xstormy16/data_below100/17_if0_b100w_bit_0.c --save-temps -fno-inline-functions -L/work/sources/gcc/current/gcc/testsuite/gcc.target/xstormy16 (test for excess errors)
UNRESOLVED: gcc.target/xstormy16/data_below100/17_if0_b100w_bit_0.c --save-temps -fno-inline-functions -L/work/sources/gcc/current/gcc/testsuite/gcc.target/xstormy16 compilation failed to produce executable
ERROR: gcc.target/xstormy16/data_below100/17_if0_b100w_bit_0.c --save-temps -fno-inline-functions -L/work/sources/gcc/current/gcc/testsuite/gcc.target/xstormy16: error executing dg-final: couldn't open "xstormy16.s": no such file or directory
UNRESOLVED: gcc.target/xstormy16/data_below100/17_if0_b100w_bit_0.c --save-temps -fno-inline-functions -L/work/sources/gcc/current/gcc/testsuite/gcc.target/xstormy16: error executing dg-final: couldn't open "xstormy16.s": no such file or directory
FAIL: gcc.target/xstormy16/data_below100/17_if0_b100w_bit_3.c --save-temps -fno-inline-functions -L/work/sources/gcc/current/gcc/testsuite/gcc.target/xstormy16 (internal compiler error)
FAIL: gcc.target/xstormy16/data_below100/17_if0_b100w_bit_3.c --save-temps -fno-inline-functions -L/work/sources/gcc/current/gcc/testsuite/gcc.target/xstormy16 (test for excess errors)
UNRESOLVED: gcc.target/xstormy16/data_below100/17_if0_b100w_bit_3.c --save-temps -fno-inline-functions -L/work/sources/gcc/current/gcc/testsuite/gcc.target/xstormy16 compilation failed to produce executable
ERROR: gcc.target/xstormy16/data_below100/17_if0_b100w_bit_3.c --save-temps -fno-inline-functions -L/work/sources/gcc/current/gcc/testsuite/gcc.target/xstormy16: error executing dg-final: couldn't open "xstormy16.s": no such file or directory
UNRESOLVED: gcc.target/xstormy16/data_below100/17_if0_b100w_bit_3.c --save-temps -fno-inline-functions -L/work/sources/gcc/current/gcc/testsuite/gcc.target/xstormy16: error executing dg-final: couldn't open "xstormy16.s": no such file or directory
FAIL: gcc.target/xstormy16/data_below100/17_if0_b100w_bit_7.c --save-temps -fno-inline-functions -L/work/sources/gcc/current/gcc/testsuite/gcc.target/xstormy16 (test for excess errors)
UNRESOLVED: gcc.target/xstormy16/data_below100/17_if0_b100w_bit_7.c --save-temps -fno-inline-functions -L/work/sources/gcc/current/gcc/testsuite/gcc.target/xstormy16 compilation failed to produce executable
ERROR: gcc.target/xstormy16/data_below100/17_if0_b100w_bit_7.c --save-temps -fno-inline-functions -L/work/sources/gcc/current/gcc/testsuite/gcc.target/xstormy16: error executing dg-final: couldn't open "xstormy16.s": no such file or directory
UNRESOLVED: gcc.target/xstormy16/data_below100/17_if0_b100w_bit_7.c --save-temps -fno-inline-functions -L/work/sources/gcc/current/gcc/testsuite/gcc.target/xstormy16: error executing dg-final: couldn't open "xstormy16.s": no such file or directory
FAIL: gcc.target/xstormy16/data_below100/17_if0_b100w_bit_8.c --save-temps -fno-inline-functions -L/work/sources/gcc/current/gcc/testsuite/gcc.target/xstormy16 (test for excess errors)
UNRESOLVED: gcc.target/xstormy16/data_below100/17_if0_b100w_bit_8.c --save-temps -fno-inline-functions -L/work/sources/gcc/current/gcc/testsuite/gcc.target/xstormy16 compilation failed to produce executable
ERROR: gcc.target/xstormy16/data_below100/17_if0_b100w_bit_8.c --save-temps -fno-inline-functions -L/work/sources/gcc/current/gcc/testsuite/gcc.target/xstormy16: error executing dg-final: couldn't open "xstormy16.s": no such file or directory
UNRESOLVED: gcc.target/xstormy16/data_below100/17_if0_b100w_bit_8.c --save-temps -fno-inline-functions -L/work/sources/gcc/current/gcc/testsuite/gcc.target/xstormy16: error executing dg-final: couldn't open "xstormy16.s": no such file or directory
FAIL: gcc.target/xstormy16/data_below100/17_if0_b100w_bit_b.c --save-temps -fno-inline-functions -L/work/sources/gcc/current/gcc/testsuite/gcc.target/xstormy16 (internal compiler error)
FAIL: gcc.target/xstormy16/data_below100/17_if0_b100w_bit_b.c --save-temps -fno-inline-functions -L/work/sources/gcc/current/gcc/testsuite/gcc.target/xstormy16 (test for excess errors)
UNRESOLVED: gcc.target/xstormy16/data_below100/17_if0_b100w_bit_b.c --save-temps -fno-inline-functions -L/work/sources/gcc/current/gcc/testsuite/gcc.target/xstormy16 compilation failed to produce executable
ERROR: gcc.target/xstormy16/data_below100/17_if0_b100w_bit_b.c --save-temps -fno-inline-functions -L/work/sources/gcc/current/gcc/testsuite/gcc.target/xstormy16: error executing dg-final: couldn't open "xstormy16.s": no such file or directory
UNRESOLVED: gcc.target/xstormy16/data_below100/17_if0_b100w_bit_b.c --save-temps -fno-inline-functions -L/work/sources/gcc/current/gcc/testsuite/gcc.target/xstormy16: error executing dg-final: couldn't open "xstormy16.s": no such file or directory
FAIL: gcc.target/xstormy16/data_below100/17_if0_b100w_bit_f.c --save-temps -fno-inline-functions -L/work/sources/gcc/current/gcc/testsuite/gcc.target/xstormy16 (test for excess errors)
UNRESOLVED: gcc.target/xstormy16/data_below100/17_if0_b100w_bit_f.c --save-temps -fno-inline-functions -L/work/sources/gcc/current/gcc/testsuite/gcc.target/xstormy16 compilation failed to produce executable
ERROR: gcc.target/xstormy16/data_below100/17_if0_b100w_bit_f.c --save-temps -fno-inline-functions -L/work/sources/gcc/current/gcc/testsuite/gcc.target/xstormy16: error executing dg-final: couldn't open "xstormy16.s": no such file or directory
UNRESOLVED: gcc.target/xstormy16/data_below100/17_if0_b100w_bit_f.c --save-temps -fno-inline-functions -L/work/sources/gcc/current/gcc/testsuite/gcc.target/xstormy16: error executing dg-final: couldn't open "xstormy16.s": no such file or directory
FAIL: gcc.target/xstormy16/data_below100/20_set_b100b_bitfield_0.c --save-temps -fno-inline-functions -L/work/sources/gcc/current/gcc/testsuite/gcc.target/xstormy16 (test for excess errors)
UNRESOLVED: gcc.target/xstormy16/data_below100/20_set_b100b_bitfield_0.c --save-temps -fno-inline-functions -L/work/sources/gcc/current/gcc/testsuite/gcc.target/xstormy16 compilation failed to produce executable
ERROR: gcc.target/xstormy16/data_below100/20_set_b100b_bitfield_0.c --save-temps -fno-inline-functions -L/work/sources/gcc/current/gcc/testsuite/gcc.target/xstormy16: error executing dg-final: couldn't open "xstormy16.s": no such file or directory
UNRESOLVED: gcc.target/xstormy16/data_below100/20_set_b100b_bitfield_0.c --save-temps -fno-inline-functions -L/work/sources/gcc/current/gcc/testsuite/gcc.target/xstormy16: error executing dg-final: couldn't open "xstormy16.s": no such file or directory
FAIL: gcc.target/xstormy16/data_below100/20_set_b100b_bitfield_7.c --save-temps -fno-inline-functions -L/work/sources/gcc/current/gcc/testsuite/gcc.target/xstormy16 (test for excess errors)
UNRESOLVED: gcc.target/xstormy16/data_below100/20_set_b100b_bitfield_7.c --save-temps -fno-inline-functions -L/work/sources/gcc/current/gcc/testsuite/gcc.target/xstormy16 compilation failed to produce executable
ERROR: gcc.target/xstormy16/data_below100/20_set_b100b_bitfield_7.c --save-temps -fno-inline-functions -L/work/sources/gcc/current/gcc/testsuite/gcc.target/xstormy16: error executing dg-final: couldn't open "xstormy16.s": no such file or directory
UNRESOLVED: gcc.target/xstormy16/data_below100/20_set_b100b_bitfield_7.c --save-temps -fno-inline-functions -L/work/sources/gcc/current/gcc/testsuite/gcc.target/xstormy16: error executing dg-final: couldn't open "xstormy16.s": no such file or directory
FAIL: gcc.target/xstormy16/data_below100/21_clr_b100b_bitfield_0.c --save-temps -fno-inline-functions -L/work/sources/gcc/current/gcc/testsuite/gcc.target/xstormy16 (test for excess errors)
UNRESOLVED: gcc.target/xstormy16/data_below100/21_clr_b100b_bitfield_0.c --save-temps -fno-inline-functions -L/work/sources/gcc/current/gcc/testsuite/gcc.target/xstormy16 compilation failed to produce executable
ERROR: gcc.target/xstormy16/data_below100/21_clr_b100b_bitfield_0.c --save-temps -fno-inline-functions -L/work/sources/gcc/current/gcc/testsuite/gcc.target/xstormy16: error executing dg-final: couldn't open "xstormy16.s": no such file or directory
UNRESOLVED: gcc.target/xstormy16/data_below100/21_clr_b100b_bitfield_0.c --save-temps -fno-inline-functions -L/work/sources/gcc/current/gcc/testsuite/gcc.target/xstormy16: error executing dg-final: couldn't open "xstormy16.s": no such file or directory
FAIL: gcc.target/xstormy16/data_below100/21_clr_b100b_bitfield_7.c --save-temps -fno-inline-functions -L/work/sources/gcc/current/gcc/testsuite/gcc.target/xstormy16 (test for excess errors)
UNRESOLVED: gcc.target/xstormy16/data_below100/21_clr_b100b_bitfield_7.c --save-temps -fno-inline-functions -L/work/sources/gcc/current/gcc/testsuite/gcc.target/xstormy16 compilation failed to produce executable
ERROR: gcc.target/xstormy16/data_below100/21_clr_b100b_bitfield_7.c --save-temps -fno-inline-functions -L/work/sources/gcc/current/gcc/testsuite/gcc.target/xstormy16: error executing dg-final: couldn't open "xstormy16.s": no such file or directory
UNRESOLVED: gcc.target/xstormy16/data_below100/21_clr_b100b_bitfield_7.c --save-temps -fno-inline-functions -L/work/sources/gcc/current/gcc/testsuite/gcc.target/xstormy16: error executing dg-final: couldn't open "xstormy16.s": no such file or directory
FAIL: gcc.target/xstormy16/data_below100/22_if1_b100b_bitfield_0.c --save-temps -fno-inline-functions -L/work/sources/gcc/current/gcc/testsuite/gcc.target/xstormy16 (test for excess errors)
UNRESOLVED: gcc.target/xstormy16/data_below100/22_if1_b100b_bitfield_0.c --save-temps -fno-inline-functions -L/work/sources/gcc/current/gcc/testsuite/gcc.target/xstormy16 compilation failed to produce executable
ERROR: gcc.target/xstormy16/data_below100/22_if1_b100b_bitfield_0.c --save-temps -fno-inline-functions -L/work/sources/gcc/current/gcc/testsuite/gcc.target/xstormy16: error executing dg-final: couldn't open "xstormy16.s": no such file or directory
UNRESOLVED: gcc.target/xstormy16/data_below100/22_if1_b100b_bitfield_0.c --save-temps -fno-inline-functions -L/work/sources/gcc/current/gcc/testsuite/gcc.target/xstormy16: error executing dg-final: couldn't open "xstormy16.s": no such file or directory
FAIL: gcc.target/xstormy16/data_below100/22_if1_b100b_bitfield_3.c --save-temps -fno-inline-functions -L/work/sources/gcc/current/gcc/testsuite/gcc.target/xstormy16 (internal compiler error)
FAIL: gcc.target/xstormy16/data_below100/22_if1_b100b_bitfield_3.c --save-temps -fno-inline-functions -L/work/sources/gcc/current/gcc/testsuite/gcc.target/xstormy16 (test for excess errors)
UNRESOLVED: gcc.target/xstormy16/data_below100/22_if1_b100b_bitfield_3.c --save-temps -fno-inline-functions -L/work/sources/gcc/current/gcc/testsuite/gcc.target/xstormy16 compilation failed to produce executable
ERROR: gcc.target/xstormy16/data_below100/22_if1_b100b_bitfield_3.c --save-temps -fno-inline-functions -L/work/sources/gcc/current/gcc/testsuite/gcc.target/xstormy16: error executing dg-final: couldn't open "xstormy16.s": no such file or directory
UNRESOLVED: gcc.target/xstormy16/data_below100/22_if1_b100b_bitfield_3.c --save-temps -fno-inline-functions -L/work/sources/gcc/current/gcc/testsuite/gcc.target/xstormy16: error executing dg-final: couldn't open "xstormy16.s": no such file or directory
FAIL: gcc.target/xstormy16/data_below100/22_if1_b100b_bitfield_7.c --save-temps -fno-inline-functions -L/work/sources/gcc/current/gcc/testsuite/gcc.target/xstormy16 (test for excess errors)
UNRESOLVED: gcc.target/xstormy16/data_below100/22_if1_b100b_bitfield_7.c --save-temps -fno-inline-functions -L/work/sources/gcc/current/gcc/testsuite/gcc.target/xstormy16 compilation failed to produce executable
ERROR: gcc.target/xstormy16/data_below100/22_if1_b100b_bitfield_7.c --save-temps -fno-inline-functions -L/work/sources/gcc/current/gcc/testsuite/gcc.target/xstormy16: error executing dg-final: couldn't open "xstormy16.s": no such file or directory
UNRESOLVED: gcc.target/xstormy16/data_below100/22_if1_b100b_bitfield_7.c --save-temps -fno-inline-functions -L/work/sources/gcc/current/gcc/testsuite/gcc.target/xstormy16: error executing dg-final: couldn't open "xstormy16.s": no such file or directory
FAIL: gcc.target/xstormy16/data_below100/23_if0_b100b_bitfield_0.c --save-temps -fno-inline-functions -L/work/sources/gcc/current/gcc/testsuite/gcc.target/xstormy16 (test for excess errors)
UNRESOLVED: gcc.target/xstormy16/data_below100/23_if0_b100b_bitfield_0.c --save-temps -fno-inline-functions -L/work/sources/gcc/current/gcc/testsuite/gcc.target/xstormy16 compilation failed to produce executable
ERROR: gcc.target/xstormy16/data_below100/23_if0_b100b_bitfield_0.c --save-temps -fno-inline-functions -L/work/sources/gcc/current/gcc/testsuite/gcc.target/xstormy16: error executing dg-final: couldn't open "xstormy16.s": no such file or directory
UNRESOLVED: gcc.target/xstormy16/data_below100/23_if0_b100b_bitfield_0.c --save-temps -fno-inline-functions -L/work/sources/gcc/current/gcc/testsuite/gcc.target/xstormy16: error executing dg-final: couldn't open "xstormy16.s": no such file or directory
FAIL: gcc.target/xstormy16/data_below100/23_if0_b100b_bitfield_3.c --save-temps -fno-inline-functions -L/work/sources/gcc/current/gcc/testsuite/gcc.target/xstormy16 (test for excess errors)
UNRESOLVED: gcc.target/xstormy16/data_below100/23_if0_b100b_bitfield_3.c --save-temps -fno-inline-functions -L/work/sources/gcc/current/gcc/testsuite/gcc.target/xstormy16 compilation failed to produce executable
ERROR: gcc.target/xstormy16/data_below100/23_if0_b100b_bitfield_3.c --save-temps -fno-inline-functions -L/work/sources/gcc/current/gcc/testsuite/gcc.target/xstormy16: error executing dg-final: couldn't open "xstormy16.s": no such file or directory
UNRESOLVED: gcc.target/xstormy16/data_below100/23_if0_b100b_bitfield_3.c --save-temps -fno-inline-functions -L/work/sources/gcc/current/gcc/testsuite/gcc.target/xstormy16: error executing dg-final: couldn't open "xstormy16.s": no such file or directory
FAIL: gcc.target/xstormy16/data_below100/23_if0_b100b_bitfield_7.c --save-temps -fno-inline-functions -L/work/sources/gcc/current/gcc/testsuite/gcc.target/xstormy16 (test for excess errors)
UNRESOLVED: gcc.target/xstormy16/data_below100/23_if0_b100b_bitfield_7.c --save-temps -fno-inline-functions -L/work/sources/gcc/current/gcc/testsuite/gcc.target/xstormy16 compilation failed to produce executable
ERROR: gcc.target/xstormy16/data_below100/23_if0_b100b_bitfield_7.c --save-temps -fno-inline-functions -L/work/sources/gcc/current/gcc/testsuite/gcc.target/xstormy16: error executing dg-final: couldn't open "xstormy16.s": no such file or directory
UNRESOLVED: gcc.target/xstormy16/data_below100/23_if0_b100b_bitfield_7.c --save-temps -fno-inline-functions -L/work/sources/gcc/current/gcc/testsuite/gcc.target/xstormy16: error executing dg-final: couldn't open "xstormy16.s": no such file or directory
FAIL: gcc.target/xstormy16/data_below100/24_set_b100w_bitfield_0.c --save-temps -fno-inline-functions -L/work/sources/gcc/current/gcc/testsuite/gcc.target/xstormy16 (test for excess errors)
UNRESOLVED: gcc.target/xstormy16/data_below100/24_set_b100w_bitfield_0.c --save-temps -fno-inline-functions -L/work/sources/gcc/current/gcc/testsuite/gcc.target/xstormy16 compilation failed to produce executable
ERROR: gcc.target/xstormy16/data_below100/24_set_b100w_bitfield_0.c --save-temps -fno-inline-functions -L/work/sources/gcc/current/gcc/testsuite/gcc.target/xstormy16: error executing dg-final: couldn't open "xstormy16.s": no such file or directory
UNRESOLVED: gcc.target/xstormy16/data_below100/24_set_b100w_bitfield_0.c --save-temps -fno-inline-functions -L/work/sources/gcc/current/gcc/testsuite/gcc.target/xstormy16: error executing dg-final: couldn't open "xstormy16.s": no such file or directory
FAIL: gcc.target/xstormy16/data_below100/24_set_b100w_bitfield_7.c --save-temps -fno-inline-functions -L/work/sources/gcc/current/gcc/testsuite/gcc.target/xstormy16 (test for excess errors)
UNRESOLVED: gcc.target/xstormy16/data_below100/24_set_b100w_bitfield_7.c --save-temps -fno-inline-functions -L/work/sources/gcc/current/gcc/testsuite/gcc.target/xstormy16 compilation failed to produce executable
ERROR: gcc.target/xstormy16/data_below100/24_set_b100w_bitfield_7.c --save-temps -fno-inline-functions -L/work/sources/gcc/current/gcc/testsuite/gcc.target/xstormy16: error executing dg-final: couldn't open "xstormy16.s": no such file or directory
UNRESOLVED: gcc.target/xstormy16/data_below100/24_set_b100w_bitfield_7.c --save-temps -fno-inline-functions -L/work/sources/gcc/current/gcc/testsuite/gcc.target/xstormy16: error executing dg-final: couldn't open "xstormy16.s": no such file or directory
FAIL: gcc.target/xstormy16/data_below100/24_set_b100w_bitfield_8.c --save-temps -fno-inline-functions -L/work/sources/gcc/current/gcc/testsuite/gcc.target/xstormy16 (test for excess errors)
UNRESOLVED: gcc.target/xstormy16/data_below100/24_set_b100w_bitfield_8.c --save-temps -fno-inline-functions -L/work/sources/gcc/current/gcc/testsuite/gcc.target/xstormy16 compilation failed to produce executable
ERROR: gcc.target/xstormy16/data_below100/24_set_b100w_bitfield_8.c --save-temps -fno-inline-functions -L/work/sources/gcc/current/gcc/testsuite/gcc.target/xstormy16: error executing dg-final: couldn't open "xstormy16.s": no such file or directory
UNRESOLVED: gcc.target/xstormy16/data_below100/24_set_b100w_bitfield_8.c --save-temps -fno-inline-functions -L/work/sources/gcc/current/gcc/testsuite/gcc.target/xstormy16: error executing dg-final: couldn't open "xstormy16.s": no such file or directory
FAIL: gcc.target/xstormy16/data_below100/24_set_b100w_bitfield_f.c --save-temps -fno-inline-functions -L/work/sources/gcc/current/gcc/testsuite/gcc.target/xstormy16 (test for excess errors)
UNRESOLVED: gcc.target/xstormy16/data_below100/24_set_b100w_bitfield_f.c --save-temps -fno-inline-functions -L/work/sources/gcc/current/gcc/testsuite/gcc.target/xstormy16 compilation failed to produce executable
ERROR: gcc.target/xstormy16/data_below100/24_set_b100w_bitfield_f.c --save-temps -fno-inline-functions -L/work/sources/gcc/current/gcc/testsuite/gcc.target/xstormy16: error executing dg-final: couldn't open "xstormy16.s": no such file or directory
UNRESOLVED: gcc.target/xstormy16/data_below100/24_set_b100w_bitfield_f.c --save-temps -fno-inline-functions -L/work/sources/gcc/current/gcc/testsuite/gcc.target/xstormy16: error executing dg-final: couldn't open "xstormy16.s": no such file or directory
FAIL: gcc.target/xstormy16/data_below100/25_clr_b100w_bitfield_0.c --save-temps -fno-inline-functions -L/work/sources/gcc/current/gcc/testsuite/gcc.target/xstormy16 (test for excess errors)
UNRESOLVED: gcc.target/xstormy16/data_below100/25_clr_b100w_bitfield_0.c --save-temps -fno-inline-functions -L/work/sources/gcc/current/gcc/testsuite/gcc.target/xstormy16 compilation failed to produce executable
ERROR: gcc.target/xstormy16/data_below100/25_clr_b100w_bitfield_0.c --save-temps -fno-inline-functions -L/work/sources/gcc/current/gcc/testsuite/gcc.target/xstormy16: error executing dg-final: couldn't open "xstormy16.s": no such file or directory
UNRESOLVED: gcc.target/xstormy16/data_below100/25_clr_b100w_bitfield_0.c --save-temps -fno-inline-functions -L/work/sources/gcc/current/gcc/testsuite/gcc.target/xstormy16: error executing dg-final: couldn't open "xstormy16.s": no such file or directory
FAIL: gcc.target/xstormy16/data_below100/25_clr_b100w_bitfield_7.c --save-temps -fno-inline-functions -L/work/sources/gcc/current/gcc/testsuite/gcc.target/xstormy16 (test for excess errors)
UNRESOLVED: gcc.target/xstormy16/data_below100/25_clr_b100w_bitfield_7.c --save-temps -fno-inline-functions -L/work/sources/gcc/current/gcc/testsuite/gcc.target/xstormy16 compilation failed to produce executable
ERROR: gcc.target/xstormy16/data_below100/25_clr_b100w_bitfield_7.c --save-temps -fno-inline-functions -L/work/sources/gcc/current/gcc/testsuite/gcc.target/xstormy16: error executing dg-final: couldn't open "xstormy16.s": no such file or directory
UNRESOLVED: gcc.target/xstormy16/data_below100/25_clr_b100w_bitfield_7.c --save-temps -fno-inline-functions -L/work/sources/gcc/current/gcc/testsuite/gcc.target/xstormy16: error executing dg-final: couldn't open "xstormy16.s": no such file or directory
FAIL: gcc.target/xstormy16/data_below100/25_clr_b100w_bitfield_8.c --save-temps -fno-inline-functions -L/work/sources/gcc/current/gcc/testsuite/gcc.target/xstormy16 (test for excess errors)
UNRESOLVED: gcc.target/xstormy16/data_below100/25_clr_b100w_bitfield_8.c --save-temps -fno-inline-functions -L/work/sources/gcc/current/gcc/testsuite/gcc.target/xstormy16 compilation failed to produce executable
ERROR: gcc.target/xstormy16/data_below100/25_clr_b100w_bitfield_8.c --save-temps -fno-inline-functions -L/work/sources/gcc/current/gcc/testsuite/gcc.target/xstormy16: error executing dg-final: couldn't open "xstormy16.s": no such file or directory
UNRESOLVED: gcc.target/xstormy16/data_below100/25_clr_b100w_bitfield_8.c --save-temps -fno-inline-functions -L/work/sources/gcc/current/gcc/testsuite/gcc.target/xstormy16: error executing dg-final: couldn't open "xstormy16.s": no such file or directory
FAIL: gcc.target/xstormy16/data_below100/25_clr_b100w_bitfield_f.c --save-temps -fno-inline-functions -L/work/sources/gcc/current/gcc/testsuite/gcc.target/xstormy16 (test for excess errors)
UNRESOLVED: gcc.target/xstormy16/data_below100/25_clr_b100w_bitfield_f.c --save-temps -fno-inline-functions -L/work/sources/gcc/current/gcc/testsuite/gcc.target/xstormy16 compilation failed to produce executable
ERROR: gcc.target/xstormy16/data_below100/25_clr_b100w_bitfield_f.c --save-temps -fno-inline-functions -L/work/sources/gcc/current/gcc/testsuite/gcc.target/xstormy16: error executing dg-final: couldn't open "xstormy16.s": no such file or directory
UNRESOLVED: gcc.target/xstormy16/data_below100/25_clr_b100w_bitfield_f.c --save-temps -fno-inline-functions -L/work/sources/gcc/current/gcc/testsuite/gcc.target/xstormy16: error executing dg-final: couldn't open "xstormy16.s": no such file or directory
FAIL: gcc.target/xstormy16/data_below100/26_if1_b100w_bitfield_0.c --save-temps -fno-inline-functions -L/work/sources/gcc/current/gcc/testsuite/gcc.target/xstormy16 (test for excess errors)
UNRESOLVED: gcc.target/xstormy16/data_below100/26_if1_b100w_bitfield_0.c --save-temps -fno-inline-functions -L/work/sources/gcc/current/gcc/testsuite/gcc.target/xstormy16 compilation failed to produce executable
ERROR: gcc.target/xstormy16/data_below100/26_if1_b100w_bitfield_0.c --save-temps -fno-inline-functions -L/work/sources/gcc/current/gcc/testsuite/gcc.target/xstormy16: error executing dg-final: couldn't open "xstormy16.s": no such file or directory
UNRESOLVED: gcc.target/xstormy16/data_below100/26_if1_b100w_bitfield_0.c --save-temps -fno-inline-functions -L/work/sources/gcc/current/gcc/testsuite/gcc.target/xstormy16: error executing dg-final: couldn't open "xstormy16.s": no such file or directory
FAIL: gcc.target/xstormy16/data_below100/26_if1_b100w_bitfield_3.c --save-temps -fno-inline-functions -L/work/sources/gcc/current/gcc/testsuite/gcc.target/xstormy16 (internal compiler error)
FAIL: gcc.target/xstormy16/data_below100/26_if1_b100w_bitfield_3.c --save-temps -fno-inline-functions -L/work/sources/gcc/current/gcc/testsuite/gcc.target/xstormy16 (test for excess errors)
UNRESOLVED: gcc.target/xstormy16/data_below100/26_if1_b100w_bitfield_3.c --save-temps -fno-inline-functions -L/work/sources/gcc/current/gcc/testsuite/gcc.target/xstormy16 compilation failed to produce executable
ERROR: gcc.target/xstormy16/data_below100/26_if1_b100w_bitfield_3.c --save-temps -fno-inline-functions -L/work/sources/gcc/current/gcc/testsuite/gcc.target/xstormy16: error executing dg-final: couldn't open "xstormy16.s": no such file or directory
UNRESOLVED: gcc.target/xstormy16/data_below100/26_if1_b100w_bitfield_3.c --save-temps -fno-inline-functions -L/work/sources/gcc/current/gcc/testsuite/gcc.target/xstormy16: error executing dg-final: couldn't open "xstormy16.s": no such file or directory
FAIL: gcc.target/xstormy16/data_below100/26_if1_b100w_bitfield_7.c --save-temps -fno-inline-functions -L/work/sources/gcc/current/gcc/testsuite/gcc.target/xstormy16 (test for excess errors)
UNRESOLVED: gcc.target/xstormy16/data_below100/26_if1_b100w_bitfield_7.c --save-temps -fno-inline-functions -L/work/sources/gcc/current/gcc/testsuite/gcc.target/xstormy16 compilation failed to produce executable
ERROR: gcc.target/xstormy16/data_below100/26_if1_b100w_bitfield_7.c --save-temps -fno-inline-functions -L/work/sources/gcc/current/gcc/testsuite/gcc.target/xstormy16: error executing dg-final: couldn't open "xstormy16.s": no such file or directory
UNRESOLVED: gcc.target/xstormy16/data_below100/26_if1_b100w_bitfield_7.c --save-temps -fno-inline-functions -L/work/sources/gcc/current/gcc/testsuite/gcc.target/xstormy16: error executing dg-final: couldn't open "xstormy16.s": no such file or directory
FAIL: gcc.target/xstormy16/data_below100/26_if1_b100w_bitfield_8.c --save-temps -fno-inline-functions -L/work/sources/gcc/current/gcc/testsuite/gcc.target/xstormy16 (test for excess errors)
UNRESOLVED: gcc.target/xstormy16/data_below100/26_if1_b100w_bitfield_8.c --save-temps -fno-inline-functions -L/work/sources/gcc/current/gcc/testsuite/gcc.target/xstormy16 compilation failed to produce executable
ERROR: gcc.target/xstormy16/data_below100/26_if1_b100w_bitfield_8.c --save-temps -fno-inline-functions -L/work/sources/gcc/current/gcc/testsuite/gcc.target/xstormy16: error executing dg-final: couldn't open "xstormy16.s": no such file or directory
UNRESOLVED: gcc.target/xstormy16/data_below100/26_if1_b100w_bitfield_8.c --save-temps -fno-inline-functions -L/work/sources/gcc/current/gcc/testsuite/gcc.target/xstormy16: error executing dg-final: couldn't open "xstormy16.s": no such file or directory
FAIL: gcc.target/xstormy16/data_below100/26_if1_b100w_bitfield_b.c --save-temps -fno-inline-functions -L/work/sources/gcc/current/gcc/testsuite/gcc.target/xstormy16 (internal compiler error)
FAIL: gcc.target/xstormy16/data_below100/26_if1_b100w_bitfield_b.c --save-temps -fno-inline-functions -L/work/sources/gcc/current/gcc/testsuite/gcc.target/xstormy16 (test for excess errors)
UNRESOLVED: gcc.target/xstormy16/data_below100/26_if1_b100w_bitfield_b.c --save-temps -fno-inline-functions -L/work/sources/gcc/current/gcc/testsuite/gcc.target/xstormy16 compilation failed to produce executable
ERROR: gcc.target/xstormy16/data_below100/26_if1_b100w_bitfield_b.c --save-temps -fno-inline-functions -L/work/sources/gcc/current/gcc/testsuite/gcc.target/xstormy16: error executing dg-final: couldn't open "xstormy16.s": no such file or directory
UNRESOLVED: gcc.target/xstormy16/data_below100/26_if1_b100w_bitfield_b.c --save-temps -fno-inline-functions -L/work/sources/gcc/current/gcc/testsuite/gcc.target/xstormy16: error executing dg-final: couldn't open "xstormy16.s": no such file or directory
FAIL: gcc.target/xstormy16/data_below100/26_if1_b100w_bitfield_f.c --save-temps -fno-inline-functions -L/work/sources/gcc/current/gcc/testsuite/gcc.target/xstormy16 (test for excess errors)
UNRESOLVED: gcc.target/xstormy16/data_below100/26_if1_b100w_bitfield_f.c --save-temps -fno-inline-functions -L/work/sources/gcc/current/gcc/testsuite/gcc.target/xstormy16 compilation failed to produce executable
ERROR: gcc.target/xstormy16/data_below100/26_if1_b100w_bitfield_f.c --save-temps -fno-inline-functions -L/work/sources/gcc/current/gcc/testsuite/gcc.target/xstormy16: error executing dg-final: couldn't open "xstormy16.s": no such file or directory
UNRESOLVED: gcc.target/xstormy16/data_below100/26_if1_b100w_bitfield_f.c --save-temps -fno-inline-functions -L/work/sources/gcc/current/gcc/testsuite/gcc.target/xstormy16: error executing dg-final: couldn't open "xstormy16.s": no such file or directory
FAIL: gcc.target/xstormy16/data_below100/27_if0_b100w_bitfield_0.c --save-temps -fno-inline-functions -L/work/sources/gcc/current/gcc/testsuite/gcc.target/xstormy16 (test for excess errors)
UNRESOLVED: gcc.target/xstormy16/data_below100/27_if0_b100w_bitfield_0.c --save-temps -fno-inline-functions -L/work/sources/gcc/current/gcc/testsuite/gcc.target/xstormy16 compilation failed to produce executable
ERROR: gcc.target/xstormy16/data_below100/27_if0_b100w_bitfield_0.c --save-temps -fno-inline-functions -L/work/sources/gcc/current/gcc/testsuite/gcc.target/xstormy16: error executing dg-final: couldn't open "xstormy16.s": no such file or directory
UNRESOLVED: gcc.target/xstormy16/data_below100/27_if0_b100w_bitfield_0.c --save-temps -fno-inline-functions -L/work/sources/gcc/current/gcc/testsuite/gcc.target/xstormy16: error executing dg-final: couldn't open "xstormy16.s": no such file or directory
FAIL: gcc.target/xstormy16/data_below100/27_if0_b100w_bitfield_3.c --save-temps -fno-inline-functions -L/work/sources/gcc/current/gcc/testsuite/gcc.target/xstormy16 (test for excess errors)
UNRESOLVED: gcc.target/xstormy16/data_below100/27_if0_b100w_bitfield_3.c --save-temps -fno-inline-functions -L/work/sources/gcc/current/gcc/testsuite/gcc.target/xstormy16 compilation failed to produce executable
ERROR: gcc.target/xstormy16/data_below100/27_if0_b100w_bitfield_3.c --save-temps -fno-inline-functions -L/work/sources/gcc/current/gcc/testsuite/gcc.target/xstormy16: error executing dg-final: couldn't open "xstormy16.s": no such file or directory
UNRESOLVED: gcc.target/xstormy16/data_below100/27_if0_b100w_bitfield_3.c --save-temps -fno-inline-functions -L/work/sources/gcc/current/gcc/testsuite/gcc.target/xstormy16: error executing dg-final: couldn't open "xstormy16.s": no such file or directory
FAIL: gcc.target/xstormy16/data_below100/27_if0_b100w_bitfield_7.c --save-temps -fno-inline-functions -L/work/sources/gcc/current/gcc/testsuite/gcc.target/xstormy16 (test for excess errors)
UNRESOLVED: gcc.target/xstormy16/data_below100/27_if0_b100w_bitfield_7.c --save-temps -fno-inline-functions -L/work/sources/gcc/current/gcc/testsuite/gcc.target/xstormy16 compilation failed to produce executable
ERROR: gcc.target/xstormy16/data_below100/27_if0_b100w_bitfield_7.c --save-temps -fno-inline-functions -L/work/sources/gcc/current/gcc/testsuite/gcc.target/xstormy16: error executing dg-final: couldn't open "xstormy16.s": no such file or directory
UNRESOLVED: gcc.target/xstormy16/data_below100/27_if0_b100w_bitfield_7.c --save-temps -fno-inline-functions -L/work/sources/gcc/current/gcc/testsuite/gcc.target/xstormy16: error executing dg-final: couldn't open "xstormy16.s": no such file or directory
FAIL: gcc.target/xstormy16/data_below100/27_if0_b100w_bitfield_8.c --save-temps -fno-inline-functions -L/work/sources/gcc/current/gcc/testsuite/gcc.target/xstormy16 (test for excess errors)
UNRESOLVED: gcc.target/xstormy16/data_below100/27_if0_b100w_bitfield_8.c --save-temps -fno-inline-functions -L/work/sources/gcc/current/gcc/testsuite/gcc.target/xstormy16 compilation failed to produce executable
ERROR: gcc.target/xstormy16/data_below100/27_if0_b100w_bitfield_8.c --save-temps -fno-inline-functions -L/work/sources/gcc/current/gcc/testsuite/gcc.target/xstormy16: error executing dg-final: couldn't open "xstormy16.s": no such file or directory
UNRESOLVED: gcc.target/xstormy16/data_below100/27_if0_b100w_bitfield_8.c --save-temps -fno-inline-functions -L/work/sources/gcc/current/gcc/testsuite/gcc.target/xstormy16: error executing dg-final: couldn't open "xstormy16.s": no such file or directory
FAIL: gcc.target/xstormy16/data_below100/27_if0_b100w_bitfield_b.c --save-temps -fno-inline-functions -L/work/sources/gcc/current/gcc/testsuite/gcc.target/xstormy16 (test for excess errors)
UNRESOLVED: gcc.target/xstormy16/data_below100/27_if0_b100w_bitfield_b.c --save-temps -fno-inline-functions -L/work/sources/gcc/current/gcc/testsuite/gcc.target/xstormy16 compilation failed to produce executable
ERROR: gcc.target/xstormy16/data_below100/27_if0_b100w_bitfield_b.c --save-temps -fno-inline-functions -L/work/sources/gcc/current/gcc/testsuite/gcc.target/xstormy16: error executing dg-final: couldn't open "xstormy16.s": no such file or directory
UNRESOLVED: gcc.target/xstormy16/data_below100/27_if0_b100w_bitfield_b.c --save-temps -fno-inline-functions -L/work/sources/gcc/current/gcc/testsuite/gcc.target/xstormy16: error executing dg-final: couldn't open "xstormy16.s": no such file or directory
FAIL: gcc.target/xstormy16/data_below100/27_if0_b100w_bitfield_f.c --save-temps -fno-inline-functions -L/work/sources/gcc/current/gcc/testsuite/gcc.target/xstormy16 (test for excess errors)
UNRESOLVED: gcc.target/xstormy16/data_below100/27_if0_b100w_bitfield_f.c --save-temps -fno-inline-functions -L/work/sources/gcc/current/gcc/testsuite/gcc.target/xstormy16 compilation failed to produce executable
ERROR: gcc.target/xstormy16/data_below100/27_if0_b100w_bitfield_f.c --save-temps -fno-inline-functions -L/work/sources/gcc/current/gcc/testsuite/gcc.target/xstormy16: error executing dg-final: couldn't open "xstormy16.s": no such file or directory
UNRESOLVED: gcc.target/xstormy16/data_below100/27_if0_b100w_bitfield_f.c --save-temps -fno-inline-functions -L/work/sources/gcc/current/gcc/testsuite/gcc.target/xstormy16: error executing dg-final: couldn't open "xstormy16.s": no such file or directory
FAIL: gcc.target/xstormy16/sfr/01_const_to_sfrb.c --save-temps -fno-inline-functions -L/work/sources/gcc/current/gcc/testsuite/gcc.target/xstormy16 (test for excess errors)
UNRESOLVED: gcc.target/xstormy16/sfr/01_const_to_sfrb.c --save-temps -fno-inline-functions -L/work/sources/gcc/current/gcc/testsuite/gcc.target/xstormy16 compilation failed to produce executable
ERROR: gcc.target/xstormy16/sfr/01_const_to_sfrb.c --save-temps -fno-inline-functions -L/work/sources/gcc/current/gcc/testsuite/gcc.target/xstormy16: error executing dg-final: couldn't open "xstormy16.s": no such file or directory
UNRESOLVED: gcc.target/xstormy16/sfr/01_const_to_sfrb.c --save-temps -fno-inline-functions -L/work/sources/gcc/current/gcc/testsuite/gcc.target/xstormy16: error executing dg-final: couldn't open "xstormy16.s": no such file or directory
FAIL: gcc.target/xstormy16/sfr/02_const_to_sfrw.c --save-temps -fno-inline-functions -L/work/sources/gcc/current/gcc/testsuite/gcc.target/xstormy16 (test for excess errors)
UNRESOLVED: gcc.target/xstormy16/sfr/02_const_to_sfrw.c --save-temps -fno-inline-functions -L/work/sources/gcc/current/gcc/testsuite/gcc.target/xstormy16 compilation failed to produce executable
ERROR: gcc.target/xstormy16/sfr/02_const_to_sfrw.c --save-temps -fno-inline-functions -L/work/sources/gcc/current/gcc/testsuite/gcc.target/xstormy16: error executing dg-final: couldn't open "xstormy16.s": no such file or directory
UNRESOLVED: gcc.target/xstormy16/sfr/02_const_to_sfrw.c --save-temps -fno-inline-functions -L/work/sources/gcc/current/gcc/testsuite/gcc.target/xstormy16: error executing dg-final: couldn't open "xstormy16.s": no such file or directory
FAIL: gcc.target/xstormy16/sfr/03_var_to_sfrb.c --save-temps -fno-inline-functions -L/work/sources/gcc/current/gcc/testsuite/gcc.target/xstormy16 (test for excess errors)
UNRESOLVED: gcc.target/xstormy16/sfr/03_var_to_sfrb.c --save-temps -fno-inline-functions -L/work/sources/gcc/current/gcc/testsuite/gcc.target/xstormy16 compilation failed to produce executable
ERROR: gcc.target/xstormy16/sfr/03_var_to_sfrb.c --save-temps -fno-inline-functions -L/work/sources/gcc/current/gcc/testsuite/gcc.target/xstormy16: error executing dg-final: couldn't open "xstormy16.s": no such file or directory
UNRESOLVED: gcc.target/xstormy16/sfr/03_var_to_sfrb.c --save-temps -fno-inline-functions -L/work/sources/gcc/current/gcc/testsuite/gcc.target/xstormy16: error executing dg-final: couldn't open "xstormy16.s": no such file or directory
FAIL: gcc.target/xstormy16/sfr/04_var_to_sfrw.c --save-temps -fno-inline-functions -L/work/sources/gcc/current/gcc/testsuite/gcc.target/xstormy16 (test for excess errors)
UNRESOLVED: gcc.target/xstormy16/sfr/04_var_to_sfrw.c --save-temps -fno-inline-functions -L/work/sources/gcc/current/gcc/testsuite/gcc.target/xstormy16 compilation failed to produce executable
ERROR: gcc.target/xstormy16/sfr/04_var_to_sfrw.c --save-temps -fno-inline-functions -L/work/sources/gcc/current/gcc/testsuite/gcc.target/xstormy16: error executing dg-final: couldn't open "xstormy16.s": no such file or directory
UNRESOLVED: gcc.target/xstormy16/sfr/04_var_to_sfrw.c --save-temps -fno-inline-functions -L/work/sources/gcc/current/gcc/testsuite/gcc.target/xstormy16: error executing dg-final: couldn't open "xstormy16.s": no such file or directory
FAIL: gcc.target/xstormy16/sfr/05_sfrb_to_var.c --save-temps -fno-inline-functions -L/work/sources/gcc/current/gcc/testsuite/gcc.target/xstormy16 (test for excess errors)
UNRESOLVED: gcc.target/xstormy16/sfr/05_sfrb_to_var.c --save-temps -fno-inline-functions -L/work/sources/gcc/current/gcc/testsuite/gcc.target/xstormy16 compilation failed to produce executable
ERROR: gcc.target/xstormy16/sfr/05_sfrb_to_var.c --save-temps -fno-inline-functions -L/work/sources/gcc/current/gcc/testsuite/gcc.target/xstormy16: error executing dg-final: couldn't open "xstormy16.s": no such file or directory
UNRESOLVED: gcc.target/xstormy16/sfr/05_sfrb_to_var.c --save-temps -fno-inline-functions -L/work/sources/gcc/current/gcc/testsuite/gcc.target/xstormy16: error executing dg-final: couldn't open "xstormy16.s": no such file or directory
FAIL: gcc.target/xstormy16/sfr/06_sfrw_to_var.c --save-temps -fno-inline-functions -L/work/sources/gcc/current/gcc/testsuite/gcc.target/xstormy16 (test for excess errors)
UNRESOLVED: gcc.target/xstormy16/sfr/06_sfrw_to_var.c --save-temps -fno-inline-functions -L/work/sources/gcc/current/gcc/testsuite/gcc.target/xstormy16 compilation failed to produce executable
ERROR: gcc.target/xstormy16/sfr/06_sfrw_to_var.c --save-temps -fno-inline-functions -L/work/sources/gcc/current/gcc/testsuite/gcc.target/xstormy16: error executing dg-final: couldn't open "xstormy16.s": no such file or directory
UNRESOLVED: gcc.target/xstormy16/sfr/06_sfrw_to_var.c --save-temps -fno-inline-functions -L/work/sources/gcc/current/gcc/testsuite/gcc.target/xstormy16: error executing dg-final: couldn't open "xstormy16.s": no such file or directory
FAIL: gcc.target/xstormy16/sfr/10_set_sfrb_bit_0.c --save-temps -fno-inline-functions -L/work/sources/gcc/current/gcc/testsuite/gcc.target/xstormy16 (test for excess errors)
UNRESOLVED: gcc.target/xstormy16/sfr/10_set_sfrb_bit_0.c --save-temps -fno-inline-functions -L/work/sources/gcc/current/gcc/testsuite/gcc.target/xstormy16 compilation failed to produce executable
ERROR: gcc.target/xstormy16/sfr/10_set_sfrb_bit_0.c --save-temps -fno-inline-functions -L/work/sources/gcc/current/gcc/testsuite/gcc.target/xstormy16: error executing dg-final: couldn't open "xstormy16.s": no such file or directory
UNRESOLVED: gcc.target/xstormy16/sfr/10_set_sfrb_bit_0.c --save-temps -fno-inline-functions -L/work/sources/gcc/current/gcc/testsuite/gcc.target/xstormy16: error executing dg-final: couldn't open "xstormy16.s": no such file or directory
FAIL: gcc.target/xstormy16/sfr/10_set_sfrb_bit_7.c --save-temps -fno-inline-functions -L/work/sources/gcc/current/gcc/testsuite/gcc.target/xstormy16 (test for excess errors)
UNRESOLVED: gcc.target/xstormy16/sfr/10_set_sfrb_bit_7.c --save-temps -fno-inline-functions -L/work/sources/gcc/current/gcc/testsuite/gcc.target/xstormy16 compilation failed to produce executable
ERROR: gcc.target/xstormy16/sfr/10_set_sfrb_bit_7.c --save-temps -fno-inline-functions -L/work/sources/gcc/current/gcc/testsuite/gcc.target/xstormy16: error executing dg-final: couldn't open "xstormy16.s": no such file or directory
UNRESOLVED: gcc.target/xstormy16/sfr/10_set_sfrb_bit_7.c --save-temps -fno-inline-functions -L/work/sources/gcc/current/gcc/testsuite/gcc.target/xstormy16: error executing dg-final: couldn't open "xstormy16.s": no such file or directory
FAIL: gcc.target/xstormy16/sfr/11_clr_sfrb_bit_0.c --save-temps -fno-inline-functions -L/work/sources/gcc/current/gcc/testsuite/gcc.target/xstormy16 (test for excess errors)
UNRESOLVED: gcc.target/xstormy16/sfr/11_clr_sfrb_bit_0.c --save-temps -fno-inline-functions -L/work/sources/gcc/current/gcc/testsuite/gcc.target/xstormy16 compilation failed to produce executable
ERROR: gcc.target/xstormy16/sfr/11_clr_sfrb_bit_0.c --save-temps -fno-inline-functions -L/work/sources/gcc/current/gcc/testsuite/gcc.target/xstormy16: error executing dg-final: couldn't open "xstormy16.s": no such file or directory
UNRESOLVED: gcc.target/xstormy16/sfr/11_clr_sfrb_bit_0.c --save-temps -fno-inline-functions -L/work/sources/gcc/current/gcc/testsuite/gcc.target/xstormy16: error executing dg-final: couldn't open "xstormy16.s": no such file or directory
FAIL: gcc.target/xstormy16/sfr/11_clr_sfrb_bit_7.c --save-temps -fno-inline-functions -L/work/sources/gcc/current/gcc/testsuite/gcc.target/xstormy16 (test for excess errors)
UNRESOLVED: gcc.target/xstormy16/sfr/11_clr_sfrb_bit_7.c --save-temps -fno-inline-functions -L/work/sources/gcc/current/gcc/testsuite/gcc.target/xstormy16 compilation failed to produce executable
ERROR: gcc.target/xstormy16/sfr/11_clr_sfrb_bit_7.c --save-temps -fno-inline-functions -L/work/sources/gcc/current/gcc/testsuite/gcc.target/xstormy16: error executing dg-final: couldn't open "xstormy16.s": no such file or directory
UNRESOLVED: gcc.target/xstormy16/sfr/11_clr_sfrb_bit_7.c --save-temps -fno-inline-functions -L/work/sources/gcc/current/gcc/testsuite/gcc.target/xstormy16: error executing dg-final: couldn't open "xstormy16.s": no such file or directory
FAIL: gcc.target/xstormy16/sfr/12_if1_sfrb_bit_0.c --save-temps -fno-inline-functions -L/work/sources/gcc/current/gcc/testsuite/gcc.target/xstormy16 (test for excess errors)
UNRESOLVED: gcc.target/xstormy16/sfr/12_if1_sfrb_bit_0.c --save-temps -fno-inline-functions -L/work/sources/gcc/current/gcc/testsuite/gcc.target/xstormy16 compilation failed to produce executable
ERROR: gcc.target/xstormy16/sfr/12_if1_sfrb_bit_0.c --save-temps -fno-inline-functions -L/work/sources/gcc/current/gcc/testsuite/gcc.target/xstormy16: error executing dg-final: couldn't open "xstormy16.s": no such file or directory
UNRESOLVED: gcc.target/xstormy16/sfr/12_if1_sfrb_bit_0.c --save-temps -fno-inline-functions -L/work/sources/gcc/current/gcc/testsuite/gcc.target/xstormy16: error executing dg-final: couldn't open "xstormy16.s": no such file or directory
FAIL: gcc.target/xstormy16/sfr/12_if1_sfrb_bit_3.c --save-temps -fno-inline-functions -L/work/sources/gcc/current/gcc/testsuite/gcc.target/xstormy16 (test for excess errors)
UNRESOLVED: gcc.target/xstormy16/sfr/12_if1_sfrb_bit_3.c --save-temps -fno-inline-functions -L/work/sources/gcc/current/gcc/testsuite/gcc.target/xstormy16 compilation failed to produce executable
ERROR: gcc.target/xstormy16/sfr/12_if1_sfrb_bit_3.c --save-temps -fno-inline-functions -L/work/sources/gcc/current/gcc/testsuite/gcc.target/xstormy16: error executing dg-final: couldn't open "xstormy16.s": no such file or directory
UNRESOLVED: gcc.target/xstormy16/sfr/12_if1_sfrb_bit_3.c --save-temps -fno-inline-functions -L/work/sources/gcc/current/gcc/testsuite/gcc.target/xstormy16: error executing dg-final: couldn't open "xstormy16.s": no such file or directory
FAIL: gcc.target/xstormy16/sfr/12_if1_sfrb_bit_7.c --save-temps -fno-inline-functions -L/work/sources/gcc/current/gcc/testsuite/gcc.target/xstormy16 (test for excess errors)
UNRESOLVED: gcc.target/xstormy16/sfr/12_if1_sfrb_bit_7.c --save-temps -fno-inline-functions -L/work/sources/gcc/current/gcc/testsuite/gcc.target/xstormy16 compilation failed to produce executable
ERROR: gcc.target/xstormy16/sfr/12_if1_sfrb_bit_7.c --save-temps -fno-inline-functions -L/work/sources/gcc/current/gcc/testsuite/gcc.target/xstormy16: error executing dg-final: couldn't open "xstormy16.s": no such file or directory
UNRESOLVED: gcc.target/xstormy16/sfr/12_if1_sfrb_bit_7.c --save-temps -fno-inline-functions -L/work/sources/gcc/current/gcc/testsuite/gcc.target/xstormy16: error executing dg-final: couldn't open "xstormy16.s": no such file or directory
FAIL: gcc.target/xstormy16/sfr/13_if0_sfrb_bit_0.c --save-temps -fno-inline-functions -L/work/sources/gcc/current/gcc/testsuite/gcc.target/xstormy16 (test for excess errors)
UNRESOLVED: gcc.target/xstormy16/sfr/13_if0_sfrb_bit_0.c --save-temps -fno-inline-functions -L/work/sources/gcc/current/gcc/testsuite/gcc.target/xstormy16 compilation failed to produce executable
ERROR: gcc.target/xstormy16/sfr/13_if0_sfrb_bit_0.c --save-temps -fno-inline-functions -L/work/sources/gcc/current/gcc/testsuite/gcc.target/xstormy16: error executing dg-final: couldn't open "xstormy16.s": no such file or directory
UNRESOLVED: gcc.target/xstormy16/sfr/13_if0_sfrb_bit_0.c --save-temps -fno-inline-functions -L/work/sources/gcc/current/gcc/testsuite/gcc.target/xstormy16: error executing dg-final: couldn't open "xstormy16.s": no such file or directory
FAIL: gcc.target/xstormy16/sfr/13_if0_sfrb_bit_3.c --save-temps -fno-inline-functions -L/work/sources/gcc/current/gcc/testsuite/gcc.target/xstormy16 (test for excess errors)
UNRESOLVED: gcc.target/xstormy16/sfr/13_if0_sfrb_bit_3.c --save-temps -fno-inline-functions -L/work/sources/gcc/current/gcc/testsuite/gcc.target/xstormy16 compilation failed to produce executable
ERROR: gcc.target/xstormy16/sfr/13_if0_sfrb_bit_3.c --save-temps -fno-inline-functions -L/work/sources/gcc/current/gcc/testsuite/gcc.target/xstormy16: error executing dg-final: couldn't open "xstormy16.s": no such file or directory
UNRESOLVED: gcc.target/xstormy16/sfr/13_if0_sfrb_bit_3.c --save-temps -fno-inline-functions -L/work/sources/gcc/current/gcc/testsuite/gcc.target/xstormy16: error executing dg-final: couldn't open "xstormy16.s": no such file or directory
FAIL: gcc.target/xstormy16/sfr/13_if0_sfrb_bit_7.c --save-temps -fno-inline-functions -L/work/sources/gcc/current/gcc/testsuite/gcc.target/xstormy16 (test for excess errors)
UNRESOLVED: gcc.target/xstormy16/sfr/13_if0_sfrb_bit_7.c --save-temps -fno-inline-functions -L/work/sources/gcc/current/gcc/testsuite/gcc.target/xstormy16 compilation failed to produce executable
ERROR: gcc.target/xstormy16/sfr/13_if0_sfrb_bit_7.c --save-temps -fno-inline-functions -L/work/sources/gcc/current/gcc/testsuite/gcc.target/xstormy16: error executing dg-final: couldn't open "xstormy16.s": no such file or directory
UNRESOLVED: gcc.target/xstormy16/sfr/13_if0_sfrb_bit_7.c --save-temps -fno-inline-functions -L/work/sources/gcc/current/gcc/testsuite/gcc.target/xstormy16: error executing dg-final: couldn't open "xstormy16.s": no such file or directory
FAIL: gcc.target/xstormy16/sfr/14_set_sfrw_bit_0.c --save-temps -fno-inline-functions -L/work/sources/gcc/current/gcc/testsuite/gcc.target/xstormy16 (test for excess errors)
UNRESOLVED: gcc.target/xstormy16/sfr/14_set_sfrw_bit_0.c --save-temps -fno-inline-functions -L/work/sources/gcc/current/gcc/testsuite/gcc.target/xstormy16 compilation failed to produce executable
ERROR: gcc.target/xstormy16/sfr/14_set_sfrw_bit_0.c --save-temps -fno-inline-functions -L/work/sources/gcc/current/gcc/testsuite/gcc.target/xstormy16: error executing dg-final: couldn't open "xstormy16.s": no such file or directory
UNRESOLVED: gcc.target/xstormy16/sfr/14_set_sfrw_bit_0.c --save-temps -fno-inline-functions -L/work/sources/gcc/current/gcc/testsuite/gcc.target/xstormy16: error executing dg-final: couldn't open "xstormy16.s": no such file or directory
FAIL: gcc.target/xstormy16/sfr/14_set_sfrw_bit_3.c --save-temps -fno-inline-functions -L/work/sources/gcc/current/gcc/testsuite/gcc.target/xstormy16 (test for excess errors)
UNRESOLVED: gcc.target/xstormy16/sfr/14_set_sfrw_bit_3.c --save-temps -fno-inline-functions -L/work/sources/gcc/current/gcc/testsuite/gcc.target/xstormy16 compilation failed to produce executable
ERROR: gcc.target/xstormy16/sfr/14_set_sfrw_bit_3.c --save-temps -fno-inline-functions -L/work/sources/gcc/current/gcc/testsuite/gcc.target/xstormy16: error executing dg-final: couldn't open "xstormy16.s": no such file or directory
UNRESOLVED: gcc.target/xstormy16/sfr/14_set_sfrw_bit_3.c --save-temps -fno-inline-functions -L/work/sources/gcc/current/gcc/testsuite/gcc.target/xstormy16: error executing dg-final: couldn't open "xstormy16.s": no such file or directory
FAIL: gcc.target/xstormy16/sfr/14_set_sfrw_bit_7.c --save-temps -fno-inline-functions -L/work/sources/gcc/current/gcc/testsuite/gcc.target/xstormy16 (test for excess errors)
UNRESOLVED: gcc.target/xstormy16/sfr/14_set_sfrw_bit_7.c --save-temps -fno-inline-functions -L/work/sources/gcc/current/gcc/testsuite/gcc.target/xstormy16 compilation failed to produce executable
ERROR: gcc.target/xstormy16/sfr/14_set_sfrw_bit_7.c --save-temps -fno-inline-functions -L/work/sources/gcc/current/gcc/testsuite/gcc.target/xstormy16: error executing dg-final: couldn't open "xstormy16.s": no such file or directory
UNRESOLVED: gcc.target/xstormy16/sfr/14_set_sfrw_bit_7.c --save-temps -fno-inline-functions -L/work/sources/gcc/current/gcc/testsuite/gcc.target/xstormy16: error executing dg-final: couldn't open "xstormy16.s": no such file or directory
FAIL: gcc.target/xstormy16/sfr/14_set_sfrw_bit_8.c --save-temps -fno-inline-functions -L/work/sources/gcc/current/gcc/testsuite/gcc.target/xstormy16 (test for excess errors)
UNRESOLVED: gcc.target/xstormy16/sfr/14_set_sfrw_bit_8.c --save-temps -fno-inline-functions -L/work/sources/gcc/current/gcc/testsuite/gcc.target/xstormy16 compilation failed to produce executable
ERROR: gcc.target/xstormy16/sfr/14_set_sfrw_bit_8.c --save-temps -fno-inline-functions -L/work/sources/gcc/current/gcc/testsuite/gcc.target/xstormy16: error executing dg-final: couldn't open "xstormy16.s": no such file or directory
UNRESOLVED: gcc.target/xstormy16/sfr/14_set_sfrw_bit_8.c --save-temps -fno-inline-functions -L/work/sources/gcc/current/gcc/testsuite/gcc.target/xstormy16: error executing dg-final: couldn't open "xstormy16.s": no such file or directory
FAIL: gcc.target/xstormy16/sfr/14_set_sfrw_bit_b.c --save-temps -fno-inline-functions -L/work/sources/gcc/current/gcc/testsuite/gcc.target/xstormy16 (test for excess errors)
UNRESOLVED: gcc.target/xstormy16/sfr/14_set_sfrw_bit_b.c --save-temps -fno-inline-functions -L/work/sources/gcc/current/gcc/testsuite/gcc.target/xstormy16 compilation failed to produce executable
ERROR: gcc.target/xstormy16/sfr/14_set_sfrw_bit_b.c --save-temps -fno-inline-functions -L/work/sources/gcc/current/gcc/testsuite/gcc.target/xstormy16: error executing dg-final: couldn't open "xstormy16.s": no such file or directory
UNRESOLVED: gcc.target/xstormy16/sfr/14_set_sfrw_bit_b.c --save-temps -fno-inline-functions -L/work/sources/gcc/current/gcc/testsuite/gcc.target/xstormy16: error executing dg-final: couldn't open "xstormy16.s": no such file or directory
FAIL: gcc.target/xstormy16/sfr/14_set_sfrw_bit_f.c --save-temps -fno-inline-functions -L/work/sources/gcc/current/gcc/testsuite/gcc.target/xstormy16 (test for excess errors)
UNRESOLVED: gcc.target/xstormy16/sfr/14_set_sfrw_bit_f.c --save-temps -fno-inline-functions -L/work/sources/gcc/current/gcc/testsuite/gcc.target/xstormy16 compilation failed to produce executable
ERROR: gcc.target/xstormy16/sfr/14_set_sfrw_bit_f.c --save-temps -fno-inline-functions -L/work/sources/gcc/current/gcc/testsuite/gcc.target/xstormy16: error executing dg-final: couldn't open "xstormy16.s": no such file or directory
UNRESOLVED: gcc.target/xstormy16/sfr/14_set_sfrw_bit_f.c --save-temps -fno-inline-functions -L/work/sources/gcc/current/gcc/testsuite/gcc.target/xstormy16: error executing dg-final: couldn't open "xstormy16.s": no such file or directory
FAIL: gcc.target/xstormy16/sfr/15_clr_sfrw_bit_0.c --save-temps -fno-inline-functions -L/work/sources/gcc/current/gcc/testsuite/gcc.target/xstormy16 (test for excess errors)
UNRESOLVED: gcc.target/xstormy16/sfr/15_clr_sfrw_bit_0.c --save-temps -fno-inline-functions -L/work/sources/gcc/current/gcc/testsuite/gcc.target/xstormy16 compilation failed to produce executable
ERROR: gcc.target/xstormy16/sfr/15_clr_sfrw_bit_0.c --save-temps -fno-inline-functions -L/work/sources/gcc/current/gcc/testsuite/gcc.target/xstormy16: error executing dg-final: couldn't open "xstormy16.s": no such file or directory
UNRESOLVED: gcc.target/xstormy16/sfr/15_clr_sfrw_bit_0.c --save-temps -fno-inline-functions -L/work/sources/gcc/current/gcc/testsuite/gcc.target/xstormy16: error executing dg-final: couldn't open "xstormy16.s": no such file or directory
FAIL: gcc.target/xstormy16/sfr/15_clr_sfrw_bit_3.c --save-temps -fno-inline-functions -L/work/sources/gcc/current/gcc/testsuite/gcc.target/xstormy16 (test for excess errors)
UNRESOLVED: gcc.target/xstormy16/sfr/15_clr_sfrw_bit_3.c --save-temps -fno-inline-functions -L/work/sources/gcc/current/gcc/testsuite/gcc.target/xstormy16 compilation failed to produce executable
ERROR: gcc.target/xstormy16/sfr/15_clr_sfrw_bit_3.c --save-temps -fno-inline-functions -L/work/sources/gcc/current/gcc/testsuite/gcc.target/xstormy16: error executing dg-final: couldn't open "xstormy16.s": no such file or directory
UNRESOLVED: gcc.target/xstormy16/sfr/15_clr_sfrw_bit_3.c --save-temps -fno-inline-functions -L/work/sources/gcc/current/gcc/testsuite/gcc.target/xstormy16: error executing dg-final: couldn't open "xstormy16.s": no such file or directory
FAIL: gcc.target/xstormy16/sfr/15_clr_sfrw_bit_7.c --save-temps -fno-inline-functions -L/work/sources/gcc/current/gcc/testsuite/gcc.target/xstormy16 (test for excess errors)
UNRESOLVED: gcc.target/xstormy16/sfr/15_clr_sfrw_bit_7.c --save-temps -fno-inline-functions -L/work/sources/gcc/current/gcc/testsuite/gcc.target/xstormy16 compilation failed to produce executable
ERROR: gcc.target/xstormy16/sfr/15_clr_sfrw_bit_7.c --save-temps -fno-inline-functions -L/work/sources/gcc/current/gcc/testsuite/gcc.target/xstormy16: error executing dg-final: couldn't open "xstormy16.s": no such file or directory
UNRESOLVED: gcc.target/xstormy16/sfr/15_clr_sfrw_bit_7.c --save-temps -fno-inline-functions -L/work/sources/gcc/current/gcc/testsuite/gcc.target/xstormy16: error executing dg-final: couldn't open "xstormy16.s": no such file or directory
FAIL: gcc.target/xstormy16/sfr/15_clr_sfrw_bit_8.c --save-temps -fno-inline-functions -L/work/sources/gcc/current/gcc/testsuite/gcc.target/xstormy16 (test for excess errors)
UNRESOLVED: gcc.target/xstormy16/sfr/15_clr_sfrw_bit_8.c --save-temps -fno-inline-functions -L/work/sources/gcc/current/gcc/testsuite/gcc.target/xstormy16 compilation failed to produce executable
ERROR: gcc.target/xstormy16/sfr/15_clr_sfrw_bit_8.c --save-temps -fno-inline-functions -L/work/sources/gcc/current/gcc/testsuite/gcc.target/xstormy16: error executing dg-final: couldn't open "xstormy16.s": no such file or directory
UNRESOLVED: gcc.target/xstormy16/sfr/15_clr_sfrw_bit_8.c --save-temps -fno-inline-functions -L/work/sources/gcc/current/gcc/testsuite/gcc.target/xstormy16: error executing dg-final: couldn't open "xstormy16.s": no such file or directory
FAIL: gcc.target/xstormy16/sfr/15_clr_sfrw_bit_b.c --save-temps -fno-inline-functions -L/work/sources/gcc/current/gcc/testsuite/gcc.target/xstormy16 (test for excess errors)
UNRESOLVED: gcc.target/xstormy16/sfr/15_clr_sfrw_bit_b.c --save-temps -fno-inline-functions -L/work/sources/gcc/current/gcc/testsuite/gcc.target/xstormy16 compilation failed to produce executable
ERROR: gcc.target/xstormy16/sfr/15_clr_sfrw_bit_b.c --save-temps -fno-inline-functions -L/work/sources/gcc/current/gcc/testsuite/gcc.target/xstormy16: error executing dg-final: couldn't open "xstormy16.s": no such file or directory
UNRESOLVED: gcc.target/xstormy16/sfr/15_clr_sfrw_bit_b.c --save-temps -fno-inline-functions -L/work/sources/gcc/current/gcc/testsuite/gcc.target/xstormy16: error executing dg-final: couldn't open "xstormy16.s": no such file or directory
FAIL: gcc.target/xstormy16/sfr/15_clr_sfrw_bit_f.c --save-temps -fno-inline-functions -L/work/sources/gcc/current/gcc/testsuite/gcc.target/xstormy16 (test for excess errors)
UNRESOLVED: gcc.target/xstormy16/sfr/15_clr_sfrw_bit_f.c --save-temps -fno-inline-functions -L/work/sources/gcc/current/gcc/testsuite/gcc.target/xstormy16 compilation failed to produce executable
ERROR: gcc.target/xstormy16/sfr/15_clr_sfrw_bit_f.c --save-temps -fno-inline-functions -L/work/sources/gcc/current/gcc/testsuite/gcc.target/xstormy16: error executing dg-final: couldn't open "xstormy16.s": no such file or directory
UNRESOLVED: gcc.target/xstormy16/sfr/15_clr_sfrw_bit_f.c --save-temps -fno-inline-functions -L/work/sources/gcc/current/gcc/testsuite/gcc.target/xstormy16: error executing dg-final: couldn't open "xstormy16.s": no such file or directory
FAIL: gcc.target/xstormy16/sfr/16_if1_sfrw_bit_0.c --save-temps -fno-inline-functions -L/work/sources/gcc/current/gcc/testsuite/gcc.target/xstormy16 (test for excess errors)
UNRESOLVED: gcc.target/xstormy16/sfr/16_if1_sfrw_bit_0.c --save-temps -fno-inline-functions -L/work/sources/gcc/current/gcc/testsuite/gcc.target/xstormy16 compilation failed to produce executable
ERROR: gcc.target/xstormy16/sfr/16_if1_sfrw_bit_0.c --save-temps -fno-inline-functions -L/work/sources/gcc/current/gcc/testsuite/gcc.target/xstormy16: error executing dg-final: couldn't open "xstormy16.s": no such file or directory
UNRESOLVED: gcc.target/xstormy16/sfr/16_if1_sfrw_bit_0.c --save-temps -fno-inline-functions -L/work/sources/gcc/current/gcc/testsuite/gcc.target/xstormy16: error executing dg-final: couldn't open "xstormy16.s": no such file or directory
FAIL: gcc.target/xstormy16/sfr/16_if1_sfrw_bit_3.c --save-temps -fno-inline-functions -L/work/sources/gcc/current/gcc/testsuite/gcc.target/xstormy16 (test for excess errors)
UNRESOLVED: gcc.target/xstormy16/sfr/16_if1_sfrw_bit_3.c --save-temps -fno-inline-functions -L/work/sources/gcc/current/gcc/testsuite/gcc.target/xstormy16 compilation failed to produce executable
ERROR: gcc.target/xstormy16/sfr/16_if1_sfrw_bit_3.c --save-temps -fno-inline-functions -L/work/sources/gcc/current/gcc/testsuite/gcc.target/xstormy16: error executing dg-final: couldn't open "xstormy16.s": no such file or directory
UNRESOLVED: gcc.target/xstormy16/sfr/16_if1_sfrw_bit_3.c --save-temps -fno-inline-functions -L/work/sources/gcc/current/gcc/testsuite/gcc.target/xstormy16: error executing dg-final: couldn't open "xstormy16.s": no such file or directory
FAIL: gcc.target/xstormy16/sfr/16_if1_sfrw_bit_7.c --save-temps -fno-inline-functions -L/work/sources/gcc/current/gcc/testsuite/gcc.target/xstormy16 (test for excess errors)
UNRESOLVED: gcc.target/xstormy16/sfr/16_if1_sfrw_bit_7.c --save-temps -fno-inline-functions -L/work/sources/gcc/current/gcc/testsuite/gcc.target/xstormy16 compilation failed to produce executable
ERROR: gcc.target/xstormy16/sfr/16_if1_sfrw_bit_7.c --save-temps -fno-inline-functions -L/work/sources/gcc/current/gcc/testsuite/gcc.target/xstormy16: error executing dg-final: couldn't open "xstormy16.s": no such file or directory
UNRESOLVED: gcc.target/xstormy16/sfr/16_if1_sfrw_bit_7.c --save-temps -fno-inline-functions -L/work/sources/gcc/current/gcc/testsuite/gcc.target/xstormy16: error executing dg-final: couldn't open "xstormy16.s": no such file or directory
FAIL: gcc.target/xstormy16/sfr/16_if1_sfrw_bit_8.c --save-temps -fno-inline-functions -L/work/sources/gcc/current/gcc/testsuite/gcc.target/xstormy16 (test for excess errors)
UNRESOLVED: gcc.target/xstormy16/sfr/16_if1_sfrw_bit_8.c --save-temps -fno-inline-functions -L/work/sources/gcc/current/gcc/testsuite/gcc.target/xstormy16 compilation failed to produce executable
ERROR: gcc.target/xstormy16/sfr/16_if1_sfrw_bit_8.c --save-temps -fno-inline-functions -L/work/sources/gcc/current/gcc/testsuite/gcc.target/xstormy16: error executing dg-final: couldn't open "xstormy16.s": no such file or directory
UNRESOLVED: gcc.target/xstormy16/sfr/16_if1_sfrw_bit_8.c --save-temps -fno-inline-functions -L/work/sources/gcc/current/gcc/testsuite/gcc.target/xstormy16: error executing dg-final: couldn't open "xstormy16.s": no such file or directory
FAIL: gcc.target/xstormy16/sfr/16_if1_sfrw_bit_b.c --save-temps -fno-inline-functions -L/work/sources/gcc/current/gcc/testsuite/gcc.target/xstormy16 (test for excess errors)
UNRESOLVED: gcc.target/xstormy16/sfr/16_if1_sfrw_bit_b.c --save-temps -fno-inline-functions -L/work/sources/gcc/current/gcc/testsuite/gcc.target/xstormy16 compilation failed to produce executable
ERROR: gcc.target/xstormy16/sfr/16_if1_sfrw_bit_b.c --save-temps -fno-inline-functions -L/work/sources/gcc/current/gcc/testsuite/gcc.target/xstormy16: error executing dg-final: couldn't open "xstormy16.s": no such file or directory
UNRESOLVED: gcc.target/xstormy16/sfr/16_if1_sfrw_bit_b.c --save-temps -fno-inline-functions -L/work/sources/gcc/current/gcc/testsuite/gcc.target/xstormy16: error executing dg-final: couldn't open "xstormy16.s": no such file or directory
FAIL: gcc.target/xstormy16/sfr/16_if1_sfrw_bit_f.c --save-temps -fno-inline-functions -L/work/sources/gcc/current/gcc/testsuite/gcc.target/xstormy16 (test for excess errors)
UNRESOLVED: gcc.target/xstormy16/sfr/16_if1_sfrw_bit_f.c --save-temps -fno-inline-functions -L/work/sources/gcc/current/gcc/testsuite/gcc.target/xstormy16 compilation failed to produce executable
ERROR: gcc.target/xstormy16/sfr/16_if1_sfrw_bit_f.c --save-temps -fno-inline-functions -L/work/sources/gcc/current/gcc/testsuite/gcc.target/xstormy16: error executing dg-final: couldn't open "xstormy16.s": no such file or directory
UNRESOLVED: gcc.target/xstormy16/sfr/16_if1_sfrw_bit_f.c --save-temps -fno-inline-functions -L/work/sources/gcc/current/gcc/testsuite/gcc.target/xstormy16: error executing dg-final: couldn't open "xstormy16.s": no such file or directory
FAIL: gcc.target/xstormy16/sfr/17_if0_sfrw_bit_0.c --save-temps -fno-inline-functions -L/work/sources/gcc/current/gcc/testsuite/gcc.target/xstormy16 (test for excess errors)
UNRESOLVED: gcc.target/xstormy16/sfr/17_if0_sfrw_bit_0.c --save-temps -fno-inline-functions -L/work/sources/gcc/current/gcc/testsuite/gcc.target/xstormy16 compilation failed to produce executable
ERROR: gcc.target/xstormy16/sfr/17_if0_sfrw_bit_0.c --save-temps -fno-inline-functions -L/work/sources/gcc/current/gcc/testsuite/gcc.target/xstormy16: error executing dg-final: couldn't open "xstormy16.s": no such file or directory
UNRESOLVED: gcc.target/xstormy16/sfr/17_if0_sfrw_bit_0.c --save-temps -fno-inline-functions -L/work/sources/gcc/current/gcc/testsuite/gcc.target/xstormy16: error executing dg-final: couldn't open "xstormy16.s": no such file or directory
FAIL: gcc.target/xstormy16/sfr/17_if0_sfrw_bit_3.c --save-temps -fno-inline-functions -L/work/sources/gcc/current/gcc/testsuite/gcc.target/xstormy16 (test for excess errors)
UNRESOLVED: gcc.target/xstormy16/sfr/17_if0_sfrw_bit_3.c --save-temps -fno-inline-functions -L/work/sources/gcc/current/gcc/testsuite/gcc.target/xstormy16 compilation failed to produce executable
ERROR: gcc.target/xstormy16/sfr/17_if0_sfrw_bit_3.c --save-temps -fno-inline-functions -L/work/sources/gcc/current/gcc/testsuite/gcc.target/xstormy16: error executing dg-final: couldn't open "xstormy16.s": no such file or directory
UNRESOLVED: gcc.target/xstormy16/sfr/17_if0_sfrw_bit_3.c --save-temps -fno-inline-functions -L/work/sources/gcc/current/gcc/testsuite/gcc.target/xstormy16: error executing dg-final: couldn't open "xstormy16.s": no such file or directory
FAIL: gcc.target/xstormy16/sfr/17_if0_sfrw_bit_7.c --save-temps -fno-inline-functions -L/work/sources/gcc/current/gcc/testsuite/gcc.target/xstormy16 (test for excess errors)
UNRESOLVED: gcc.target/xstormy16/sfr/17_if0_sfrw_bit_7.c --save-temps -fno-inline-functions -L/work/sources/gcc/current/gcc/testsuite/gcc.target/xstormy16 compilation failed to produce executable
ERROR: gcc.target/xstormy16/sfr/17_if0_sfrw_bit_7.c --save-temps -fno-inline-functions -L/work/sources/gcc/current/gcc/testsuite/gcc.target/xstormy16: error executing dg-final: couldn't open "xstormy16.s": no such file or directory
UNRESOLVED: gcc.target/xstormy16/sfr/17_if0_sfrw_bit_7.c --save-temps -fno-inline-functions -L/work/sources/gcc/current/gcc/testsuite/gcc.target/xstormy16: error executing dg-final: couldn't open "xstormy16.s": no such file or directory
FAIL: gcc.target/xstormy16/sfr/17_if0_sfrw_bit_8.c --save-temps -fno-inline-functions -L/work/sources/gcc/current/gcc/testsuite/gcc.target/xstormy16 (test for excess errors)
UNRESOLVED: gcc.target/xstormy16/sfr/17_if0_sfrw_bit_8.c --save-temps -fno-inline-functions -L/work/sources/gcc/current/gcc/testsuite/gcc.target/xstormy16 compilation failed to produce executable
ERROR: gcc.target/xstormy16/sfr/17_if0_sfrw_bit_8.c --save-temps -fno-inline-functions -L/work/sources/gcc/current/gcc/testsuite/gcc.target/xstormy16: error executing dg-final: couldn't open "xstormy16.s": no such file or directory
UNRESOLVED: gcc.target/xstormy16/sfr/17_if0_sfrw_bit_8.c --save-temps -fno-inline-functions -L/work/sources/gcc/current/gcc/testsuite/gcc.target/xstormy16: error executing dg-final: couldn't open "xstormy16.s": no such file or directory
FAIL: gcc.target/xstormy16/sfr/17_if0_sfrw_bit_b.c --save-temps -fno-inline-functions -L/work/sources/gcc/current/gcc/testsuite/gcc.target/xstormy16 (test for excess errors)
UNRESOLVED: gcc.target/xstormy16/sfr/17_if0_sfrw_bit_b.c --save-temps -fno-inline-functions -L/work/sources/gcc/current/gcc/testsuite/gcc.target/xstormy16 compilation failed to produce executable
ERROR: gcc.target/xstormy16/sfr/17_if0_sfrw_bit_b.c --save-temps -fno-inline-functions -L/work/sources/gcc/current/gcc/testsuite/gcc.target/xstormy16: error executing dg-final: couldn't open "xstormy16.s": no such file or directory
UNRESOLVED: gcc.target/xstormy16/sfr/17_if0_sfrw_bit_b.c --save-temps -fno-inline-functions -L/work/sources/gcc/current/gcc/testsuite/gcc.target/xstormy16: error executing dg-final: couldn't open "xstormy16.s": no such file or directory
FAIL: gcc.target/xstormy16/sfr/17_if0_sfrw_bit_f.c --save-temps -fno-inline-functions -L/work/sources/gcc/current/gcc/testsuite/gcc.target/xstormy16 (test for excess errors)
UNRESOLVED: gcc.target/xstormy16/sfr/17_if0_sfrw_bit_f.c --save-temps -fno-inline-functions -L/work/sources/gcc/current/gcc/testsuite/gcc.target/xstormy16 compilation failed to produce executable
ERROR: gcc.target/xstormy16/sfr/17_if0_sfrw_bit_f.c --save-temps -fno-inline-functions -L/work/sources/gcc/current/gcc/testsuite/gcc.target/xstormy16: error executing dg-final: couldn't open "xstormy16.s": no such file or directory
UNRESOLVED: gcc.target/xstormy16/sfr/17_if0_sfrw_bit_f.c --save-temps -fno-inline-functions -L/work/sources/gcc/current/gcc/testsuite/gcc.target/xstormy16: error executing dg-final: couldn't open "xstormy16.s": no such file or directory
FAIL: gcc.target/xstormy16/sfr/20_set_sfrb_bitfield_0.c --save-temps -fno-inline-functions -L/work/sources/gcc/current/gcc/testsuite/gcc.target/xstormy16 (test for excess errors)
UNRESOLVED: gcc.target/xstormy16/sfr/20_set_sfrb_bitfield_0.c --save-temps -fno-inline-functions -L/work/sources/gcc/current/gcc/testsuite/gcc.target/xstormy16 compilation failed to produce executable
ERROR: gcc.target/xstormy16/sfr/20_set_sfrb_bitfield_0.c --save-temps -fno-inline-functions -L/work/sources/gcc/current/gcc/testsuite/gcc.target/xstormy16: error executing dg-final: couldn't open "xstormy16.s": no such file or directory
UNRESOLVED: gcc.target/xstormy16/sfr/20_set_sfrb_bitfield_0.c --save-temps -fno-inline-functions -L/work/sources/gcc/current/gcc/testsuite/gcc.target/xstormy16: error executing dg-final: couldn't open "xstormy16.s": no such file or directory
FAIL: gcc.target/xstormy16/sfr/20_set_sfrb_bitfield_7.c --save-temps -fno-inline-functions -L/work/sources/gcc/current/gcc/testsuite/gcc.target/xstormy16 (test for excess errors)
UNRESOLVED: gcc.target/xstormy16/sfr/20_set_sfrb_bitfield_7.c --save-temps -fno-inline-functions -L/work/sources/gcc/current/gcc/testsuite/gcc.target/xstormy16 compilation failed to produce executable
ERROR: gcc.target/xstormy16/sfr/20_set_sfrb_bitfield_7.c --save-temps -fno-inline-functions -L/work/sources/gcc/current/gcc/testsuite/gcc.target/xstormy16: error executing dg-final: couldn't open "xstormy16.s": no such file or directory
UNRESOLVED: gcc.target/xstormy16/sfr/20_set_sfrb_bitfield_7.c --save-temps -fno-inline-functions -L/work/sources/gcc/current/gcc/testsuite/gcc.target/xstormy16: error executing dg-final: couldn't open "xstormy16.s": no such file or directory
FAIL: gcc.target/xstormy16/sfr/21_clr_sfrb_bitfield_0.c --save-temps -fno-inline-functions -L/work/sources/gcc/current/gcc/testsuite/gcc.target/xstormy16 (test for excess errors)
UNRESOLVED: gcc.target/xstormy16/sfr/21_clr_sfrb_bitfield_0.c --save-temps -fno-inline-functions -L/work/sources/gcc/current/gcc/testsuite/gcc.target/xstormy16 compilation failed to produce executable
ERROR: gcc.target/xstormy16/sfr/21_clr_sfrb_bitfield_0.c --save-temps -fno-inline-functions -L/work/sources/gcc/current/gcc/testsuite/gcc.target/xstormy16: error executing dg-final: couldn't open "xstormy16.s": no such file or directory
UNRESOLVED: gcc.target/xstormy16/sfr/21_clr_sfrb_bitfield_0.c --save-temps -fno-inline-functions -L/work/sources/gcc/current/gcc/testsuite/gcc.target/xstormy16: error executing dg-final: couldn't open "xstormy16.s": no such file or directory
FAIL: gcc.target/xstormy16/sfr/21_clr_sfrb_bitfield_7.c --save-temps -fno-inline-functions -L/work/sources/gcc/current/gcc/testsuite/gcc.target/xstormy16 (test for excess errors)
UNRESOLVED: gcc.target/xstormy16/sfr/21_clr_sfrb_bitfield_7.c --save-temps -fno-inline-functions -L/work/sources/gcc/current/gcc/testsuite/gcc.target/xstormy16 compilation failed to produce executable
ERROR: gcc.target/xstormy16/sfr/21_clr_sfrb_bitfield_7.c --save-temps -fno-inline-functions -L/work/sources/gcc/current/gcc/testsuite/gcc.target/xstormy16: error executing dg-final: couldn't open "xstormy16.s": no such file or directory
UNRESOLVED: gcc.target/xstormy16/sfr/21_clr_sfrb_bitfield_7.c --save-temps -fno-inline-functions -L/work/sources/gcc/current/gcc/testsuite/gcc.target/xstormy16: error executing dg-final: couldn't open "xstormy16.s": no such file or directory
FAIL: gcc.target/xstormy16/sfr/22_if1_sfrb_bitfield_0.c --save-temps -fno-inline-functions -L/work/sources/gcc/current/gcc/testsuite/gcc.target/xstormy16 (test for excess errors)
UNRESOLVED: gcc.target/xstormy16/sfr/22_if1_sfrb_bitfield_0.c --save-temps -fno-inline-functions -L/work/sources/gcc/current/gcc/testsuite/gcc.target/xstormy16 compilation failed to produce executable
ERROR: gcc.target/xstormy16/sfr/22_if1_sfrb_bitfield_0.c --save-temps -fno-inline-functions -L/work/sources/gcc/current/gcc/testsuite/gcc.target/xstormy16: error executing dg-final: couldn't open "xstormy16.s": no such file or directory
UNRESOLVED: gcc.target/xstormy16/sfr/22_if1_sfrb_bitfield_0.c --save-temps -fno-inline-functions -L/work/sources/gcc/current/gcc/testsuite/gcc.target/xstormy16: error executing dg-final: couldn't open "xstormy16.s": no such file or directory
FAIL: gcc.target/xstormy16/sfr/22_if1_sfrb_bitfield_3.c --save-temps -fno-inline-functions -L/work/sources/gcc/current/gcc/testsuite/gcc.target/xstormy16 (test for excess errors)
UNRESOLVED: gcc.target/xstormy16/sfr/22_if1_sfrb_bitfield_3.c --save-temps -fno-inline-functions -L/work/sources/gcc/current/gcc/testsuite/gcc.target/xstormy16 compilation failed to produce executable
ERROR: gcc.target/xstormy16/sfr/22_if1_sfrb_bitfield_3.c --save-temps -fno-inline-functions -L/work/sources/gcc/current/gcc/testsuite/gcc.target/xstormy16: error executing dg-final: couldn't open "xstormy16.s": no such file or directory
UNRESOLVED: gcc.target/xstormy16/sfr/22_if1_sfrb_bitfield_3.c --save-temps -fno-inline-functions -L/work/sources/gcc/current/gcc/testsuite/gcc.target/xstormy16: error executing dg-final: couldn't open "xstormy16.s": no such file or directory
FAIL: gcc.target/xstormy16/sfr/22_if1_sfrb_bitfield_7.c --save-temps -fno-inline-functions -L/work/sources/gcc/current/gcc/testsuite/gcc.target/xstormy16 (test for excess errors)
UNRESOLVED: gcc.target/xstormy16/sfr/22_if1_sfrb_bitfield_7.c --save-temps -fno-inline-functions -L/work/sources/gcc/current/gcc/testsuite/gcc.target/xstormy16 compilation failed to produce executable
ERROR: gcc.target/xstormy16/sfr/22_if1_sfrb_bitfield_7.c --save-temps -fno-inline-functions -L/work/sources/gcc/current/gcc/testsuite/gcc.target/xstormy16: error executing dg-final: couldn't open "xstormy16.s": no such file or directory
UNRESOLVED: gcc.target/xstormy16/sfr/22_if1_sfrb_bitfield_7.c --save-temps -fno-inline-functions -L/work/sources/gcc/current/gcc/testsuite/gcc.target/xstormy16: error executing dg-final: couldn't open "xstormy16.s": no such file or directory
FAIL: gcc.target/xstormy16/sfr/23_if0_sfrb_bitfield_0.c --save-temps -fno-inline-functions -L/work/sources/gcc/current/gcc/testsuite/gcc.target/xstormy16 (test for excess errors)
UNRESOLVED: gcc.target/xstormy16/sfr/23_if0_sfrb_bitfield_0.c --save-temps -fno-inline-functions -L/work/sources/gcc/current/gcc/testsuite/gcc.target/xstormy16 compilation failed to produce executable
ERROR: gcc.target/xstormy16/sfr/23_if0_sfrb_bitfield_0.c --save-temps -fno-inline-functions -L/work/sources/gcc/current/gcc/testsuite/gcc.target/xstormy16: error executing dg-final: couldn't open "xstormy16.s": no such file or directory
UNRESOLVED: gcc.target/xstormy16/sfr/23_if0_sfrb_bitfield_0.c --save-temps -fno-inline-functions -L/work/sources/gcc/current/gcc/testsuite/gcc.target/xstormy16: error executing dg-final: couldn't open "xstormy16.s": no such file or directory
FAIL: gcc.target/xstormy16/sfr/23_if0_sfrb_bitfield_3.c --save-temps -fno-inline-functions -L/work/sources/gcc/current/gcc/testsuite/gcc.target/xstormy16 (test for excess errors)
UNRESOLVED: gcc.target/xstormy16/sfr/23_if0_sfrb_bitfield_3.c --save-temps -fno-inline-functions -L/work/sources/gcc/current/gcc/testsuite/gcc.target/xstormy16 compilation failed to produce executable
ERROR: gcc.target/xstormy16/sfr/23_if0_sfrb_bitfield_3.c --save-temps -fno-inline-functions -L/work/sources/gcc/current/gcc/testsuite/gcc.target/xstormy16: error executing dg-final: couldn't open "xstormy16.s": no such file or directory
UNRESOLVED: gcc.target/xstormy16/sfr/23_if0_sfrb_bitfield_3.c --save-temps -fno-inline-functions -L/work/sources/gcc/current/gcc/testsuite/gcc.target/xstormy16: error executing dg-final: couldn't open "xstormy16.s": no such file or directory
FAIL: gcc.target/xstormy16/sfr/23_if0_sfrb_bitfield_7.c --save-temps -fno-inline-functions -L/work/sources/gcc/current/gcc/testsuite/gcc.target/xstormy16 (test for excess errors)
UNRESOLVED: gcc.target/xstormy16/sfr/23_if0_sfrb_bitfield_7.c --save-temps -fno-inline-functions -L/work/sources/gcc/current/gcc/testsuite/gcc.target/xstormy16 compilation failed to produce executable
ERROR: gcc.target/xstormy16/sfr/23_if0_sfrb_bitfield_7.c --save-temps -fno-inline-functions -L/work/sources/gcc/current/gcc/testsuite/gcc.target/xstormy16: error executing dg-final: couldn't open "xstormy16.s": no such file or directory
UNRESOLVED: gcc.target/xstormy16/sfr/23_if0_sfrb_bitfield_7.c --save-temps -fno-inline-functions -L/work/sources/gcc/current/gcc/testsuite/gcc.target/xstormy16: error executing dg-final: couldn't open "xstormy16.s": no such file or directory
FAIL: gcc.target/xstormy16/sfr/24_set_sfrw_bitfield_0.c --save-temps -fno-inline-functions -L/work/sources/gcc/current/gcc/testsuite/gcc.target/xstormy16 (test for excess errors)
UNRESOLVED: gcc.target/xstormy16/sfr/24_set_sfrw_bitfield_0.c --save-temps -fno-inline-functions -L/work/sources/gcc/current/gcc/testsuite/gcc.target/xstormy16 compilation failed to produce executable
ERROR: gcc.target/xstormy16/sfr/24_set_sfrw_bitfield_0.c --save-temps -fno-inline-functions -L/work/sources/gcc/current/gcc/testsuite/gcc.target/xstormy16: error executing dg-final: couldn't open "xstormy16.s": no such file or directory
UNRESOLVED: gcc.target/xstormy16/sfr/24_set_sfrw_bitfield_0.c --save-temps -fno-inline-functions -L/work/sources/gcc/current/gcc/testsuite/gcc.target/xstormy16: error executing dg-final: couldn't open "xstormy16.s": no such file or directory
FAIL: gcc.target/xstormy16/sfr/24_set_sfrw_bitfield_7.c --save-temps -fno-inline-functions -L/work/sources/gcc/current/gcc/testsuite/gcc.target/xstormy16 (test for excess errors)
UNRESOLVED: gcc.target/xstormy16/sfr/24_set_sfrw_bitfield_7.c --save-temps -fno-inline-functions -L/work/sources/gcc/current/gcc/testsuite/gcc.target/xstormy16 compilation failed to produce executable
ERROR: gcc.target/xstormy16/sfr/24_set_sfrw_bitfield_7.c --save-temps -fno-inline-functions -L/work/sources/gcc/current/gcc/testsuite/gcc.target/xstormy16: error executing dg-final: couldn't open "xstormy16.s": no such file or directory
UNRESOLVED: gcc.target/xstormy16/sfr/24_set_sfrw_bitfield_7.c --save-temps -fno-inline-functions -L/work/sources/gcc/current/gcc/testsuite/gcc.target/xstormy16: error executing dg-final: couldn't open "xstormy16.s": no such file or directory
FAIL: gcc.target/xstormy16/sfr/24_set_sfrw_bitfield_8.c --save-temps -fno-inline-functions -L/work/sources/gcc/current/gcc/testsuite/gcc.target/xstormy16 (test for excess errors)
UNRESOLVED: gcc.target/xstormy16/sfr/24_set_sfrw_bitfield_8.c --save-temps -fno-inline-functions -L/work/sources/gcc/current/gcc/testsuite/gcc.target/xstormy16 compilation failed to produce executable
ERROR: gcc.target/xstormy16/sfr/24_set_sfrw_bitfield_8.c --save-temps -fno-inline-functions -L/work/sources/gcc/current/gcc/testsuite/gcc.target/xstormy16: error executing dg-final: couldn't open "xstormy16.s": no such file or directory
UNRESOLVED: gcc.target/xstormy16/sfr/24_set_sfrw_bitfield_8.c --save-temps -fno-inline-functions -L/work/sources/gcc/current/gcc/testsuite/gcc.target/xstormy16: error executing dg-final: couldn't open "xstormy16.s": no such file or directory
FAIL: gcc.target/xstormy16/sfr/24_set_sfrw_bitfield_f.c --save-temps -fno-inline-functions -L/work/sources/gcc/current/gcc/testsuite/gcc.target/xstormy16 (test for excess errors)
UNRESOLVED: gcc.target/xstormy16/sfr/24_set_sfrw_bitfield_f.c --save-temps -fno-inline-functions -L/work/sources/gcc/current/gcc/testsuite/gcc.target/xstormy16 compilation failed to produce executable
ERROR: gcc.target/xstormy16/sfr/24_set_sfrw_bitfield_f.c --save-temps -fno-inline-functions -L/work/sources/gcc/current/gcc/testsuite/gcc.target/xstormy16: error executing dg-final: couldn't open "xstormy16.s": no such file or directory
UNRESOLVED: gcc.target/xstormy16/sfr/24_set_sfrw_bitfield_f.c --save-temps -fno-inline-functions -L/work/sources/gcc/current/gcc/testsuite/gcc.target/xstormy16: error executing dg-final: couldn't open "xstormy16.s": no such file or directory
FAIL: gcc.target/xstormy16/sfr/25_clr_sfrw_bitfield_0.c --save-temps -fno-inline-functions -L/work/sources/gcc/current/gcc/testsuite/gcc.target/xstormy16 (test for excess errors)
UNRESOLVED: gcc.target/xstormy16/sfr/25_clr_sfrw_bitfield_0.c --save-temps -fno-inline-functions -L/work/sources/gcc/current/gcc/testsuite/gcc.target/xstormy16 compilation failed to produce executable
ERROR: gcc.target/xstormy16/sfr/25_clr_sfrw_bitfield_0.c --save-temps -fno-inline-functions -L/work/sources/gcc/current/gcc/testsuite/gcc.target/xstormy16: error executing dg-final: couldn't open "xstormy16.s": no such file or directory
UNRESOLVED: gcc.target/xstormy16/sfr/25_clr_sfrw_bitfield_0.c --save-temps -fno-inline-functions -L/work/sources/gcc/current/gcc/testsuite/gcc.target/xstormy16: error executing dg-final: couldn't open "xstormy16.s": no such file or directory
FAIL: gcc.target/xstormy16/sfr/25_clr_sfrw_bitfield_7.c --save-temps -fno-inline-functions -L/work/sources/gcc/current/gcc/testsuite/gcc.target/xstormy16 (test for excess errors)
UNRESOLVED: gcc.target/xstormy16/sfr/25_clr_sfrw_bitfield_7.c --save-temps -fno-inline-functions -L/work/sources/gcc/current/gcc/testsuite/gcc.target/xstormy16 compilation failed to produce executable
ERROR: gcc.target/xstormy16/sfr/25_clr_sfrw_bitfield_7.c --save-temps -fno-inline-functions -L/work/sources/gcc/current/gcc/testsuite/gcc.target/xstormy16: error executing dg-final: couldn't open "xstormy16.s": no such file or directory
UNRESOLVED: gcc.target/xstormy16/sfr/25_clr_sfrw_bitfield_7.c --save-temps -fno-inline-functions -L/work/sources/gcc/current/gcc/testsuite/gcc.target/xstormy16: error executing dg-final: couldn't open "xstormy16.s": no such file or directory
FAIL: gcc.target/xstormy16/sfr/25_clr_sfrw_bitfield_8.c --save-temps -fno-inline-functions -L/work/sources/gcc/current/gcc/testsuite/gcc.target/xstormy16 (test for excess errors)
UNRESOLVED: gcc.target/xstormy16/sfr/25_clr_sfrw_bitfield_8.c --save-temps -fno-inline-functions -L/work/sources/gcc/current/gcc/testsuite/gcc.target/xstormy16 compilation failed to produce executable
ERROR: gcc.target/xstormy16/sfr/25_clr_sfrw_bitfield_8.c --save-temps -fno-inline-functions -L/work/sources/gcc/current/gcc/testsuite/gcc.target/xstormy16: error executing dg-final: couldn't open "xstormy16.s": no such file or directory
UNRESOLVED: gcc.target/xstormy16/sfr/25_clr_sfrw_bitfield_8.c --save-temps -fno-inline-functions -L/work/sources/gcc/current/gcc/testsuite/gcc.target/xstormy16: error executing dg-final: couldn't open "xstormy16.s": no such file or directory
FAIL: gcc.target/xstormy16/sfr/25_clr_sfrw_bitfield_f.c --save-temps -fno-inline-functions -L/work/sources/gcc/current/gcc/testsuite/gcc.target/xstormy16 (test for excess errors)
UNRESOLVED: gcc.target/xstormy16/sfr/25_clr_sfrw_bitfield_f.c --save-temps -fno-inline-functions -L/work/sources/gcc/current/gcc/testsuite/gcc.target/xstormy16 compilation failed to produce executable
ERROR: gcc.target/xstormy16/sfr/25_clr_sfrw_bitfield_f.c --save-temps -fno-inline-functions -L/work/sources/gcc/current/gcc/testsuite/gcc.target/xstormy16: error executing dg-final: couldn't open "xstormy16.s": no such file or directory
UNRESOLVED: gcc.target/xstormy16/sfr/25_clr_sfrw_bitfield_f.c --save-temps -fno-inline-functions -L/work/sources/gcc/current/gcc/testsuite/gcc.target/xstormy16: error executing dg-final: couldn't open "xstormy16.s": no such file or directory
FAIL: gcc.target/xstormy16/sfr/26_if1_sfrw_bitfield_0.c --save-temps -fno-inline-functions -L/work/sources/gcc/current/gcc/testsuite/gcc.target/xstormy16 (test for excess errors)
UNRESOLVED: gcc.target/xstormy16/sfr/26_if1_sfrw_bitfield_0.c --save-temps -fno-inline-functions -L/work/sources/gcc/current/gcc/testsuite/gcc.target/xstormy16 compilation failed to produce executable
ERROR: gcc.target/xstormy16/sfr/26_if1_sfrw_bitfield_0.c --save-temps -fno-inline-functions -L/work/sources/gcc/current/gcc/testsuite/gcc.target/xstormy16: error executing dg-final: couldn't open "xstormy16.s": no such file or directory
UNRESOLVED: gcc.target/xstormy16/sfr/26_if1_sfrw_bitfield_0.c --save-temps -fno-inline-functions -L/work/sources/gcc/current/gcc/testsuite/gcc.target/xstormy16: error executing dg-final: couldn't open "xstormy16.s": no such file or directory
FAIL: gcc.target/xstormy16/sfr/26_if1_sfrw_bitfield_3.c --save-temps -fno-inline-functions -L/work/sources/gcc/current/gcc/testsuite/gcc.target/xstormy16 (test for excess errors)
UNRESOLVED: gcc.target/xstormy16/sfr/26_if1_sfrw_bitfield_3.c --save-temps -fno-inline-functions -L/work/sources/gcc/current/gcc/testsuite/gcc.target/xstormy16 compilation failed to produce executable
ERROR: gcc.target/xstormy16/sfr/26_if1_sfrw_bitfield_3.c --save-temps -fno-inline-functions -L/work/sources/gcc/current/gcc/testsuite/gcc.target/xstormy16: error executing dg-final: couldn't open "xstormy16.s": no such file or directory
UNRESOLVED: gcc.target/xstormy16/sfr/26_if1_sfrw_bitfield_3.c --save-temps -fno-inline-functions -L/work/sources/gcc/current/gcc/testsuite/gcc.target/xstormy16: error executing dg-final: couldn't open "xstormy16.s": no such file or directory
FAIL: gcc.target/xstormy16/sfr/26_if1_sfrw_bitfield_7.c --save-temps -fno-inline-functions -L/work/sources/gcc/current/gcc/testsuite/gcc.target/xstormy16 (test for excess errors)
UNRESOLVED: gcc.target/xstormy16/sfr/26_if1_sfrw_bitfield_7.c --save-temps -fno-inline-functions -L/work/sources/gcc/current/gcc/testsuite/gcc.target/xstormy16 compilation failed to produce executable
ERROR: gcc.target/xstormy16/sfr/26_if1_sfrw_bitfield_7.c --save-temps -fno-inline-functions -L/work/sources/gcc/current/gcc/testsuite/gcc.target/xstormy16: error executing dg-final: couldn't open "xstormy16.s": no such file or directory
UNRESOLVED: gcc.target/xstormy16/sfr/26_if1_sfrw_bitfield_7.c --save-temps -fno-inline-functions -L/work/sources/gcc/current/gcc/testsuite/gcc.target/xstormy16: error executing dg-final: couldn't open "xstormy16.s": no such file or directory
FAIL: gcc.target/xstormy16/sfr/26_if1_sfrw_bitfield_8.c --save-temps -fno-inline-functions -L/work/sources/gcc/current/gcc/testsuite/gcc.target/xstormy16 (test for excess errors)
UNRESOLVED: gcc.target/xstormy16/sfr/26_if1_sfrw_bitfield_8.c --save-temps -fno-inline-functions -L/work/sources/gcc/current/gcc/testsuite/gcc.target/xstormy16 compilation failed to produce executable
ERROR: gcc.target/xstormy16/sfr/26_if1_sfrw_bitfield_8.c --save-temps -fno-inline-functions -L/work/sources/gcc/current/gcc/testsuite/gcc.target/xstormy16: error executing dg-final: couldn't open "xstormy16.s": no such file or directory
UNRESOLVED: gcc.target/xstormy16/sfr/26_if1_sfrw_bitfield_8.c --save-temps -fno-inline-functions -L/work/sources/gcc/current/gcc/testsuite/gcc.target/xstormy16: error executing dg-final: couldn't open "xstormy16.s": no such file or directory
FAIL: gcc.target/xstormy16/sfr/26_if1_sfrw_bitfield_b.c --save-temps -fno-inline-functions -L/work/sources/gcc/current/gcc/testsuite/gcc.target/xstormy16 (test for excess errors)
UNRESOLVED: gcc.target/xstormy16/sfr/26_if1_sfrw_bitfield_b.c --save-temps -fno-inline-functions -L/work/sources/gcc/current/gcc/testsuite/gcc.target/xstormy16 compilation failed to produce executable
ERROR: gcc.target/xstormy16/sfr/26_if1_sfrw_bitfield_b.c --save-temps -fno-inline-functions -L/work/sources/gcc/current/gcc/testsuite/gcc.target/xstormy16: error executing dg-final: couldn't open "xstormy16.s": no such file or directory
UNRESOLVED: gcc.target/xstormy16/sfr/26_if1_sfrw_bitfield_b.c --save-temps -fno-inline-functions -L/work/sources/gcc/current/gcc/testsuite/gcc.target/xstormy16: error executing dg-final: couldn't open "xstormy16.s": no such file or directory
FAIL: gcc.target/xstormy16/sfr/26_if1_sfrw_bitfield_f.c --save-temps -fno-inline-functions -L/work/sources/gcc/current/gcc/testsuite/gcc.target/xstormy16 (test for excess errors)
UNRESOLVED: gcc.target/xstormy16/sfr/26_if1_sfrw_bitfield_f.c --save-temps -fno-inline-functions -L/work/sources/gcc/current/gcc/testsuite/gcc.target/xstormy16 compilation failed to produce executable
ERROR: gcc.target/xstormy16/sfr/26_if1_sfrw_bitfield_f.c --save-temps -fno-inline-functions -L/work/sources/gcc/current/gcc/testsuite/gcc.target/xstormy16: error executing dg-final: couldn't open "xstormy16.s": no such file or directory
UNRESOLVED: gcc.target/xstormy16/sfr/26_if1_sfrw_bitfield_f.c --save-temps -fno-inline-functions -L/work/sources/gcc/current/gcc/testsuite/gcc.target/xstormy16: error executing dg-final: couldn't open "xstormy16.s": no such file or directory
FAIL: gcc.target/xstormy16/sfr/27_if0_sfrw_bitfield_0.c --save-temps -fno-inline-functions -L/work/sources/gcc/current/gcc/testsuite/gcc.target/xstormy16 (test for excess errors)
UNRESOLVED: gcc.target/xstormy16/sfr/27_if0_sfrw_bitfield_0.c --save-temps -fno-inline-functions -L/work/sources/gcc/current/gcc/testsuite/gcc.target/xstormy16 compilation failed to produce executable
ERROR: gcc.target/xstormy16/sfr/27_if0_sfrw_bitfield_0.c --save-temps -fno-inline-functions -L/work/sources/gcc/current/gcc/testsuite/gcc.target/xstormy16: error executing dg-final: couldn't open "xstormy16.s": no such file or directory
UNRESOLVED: gcc.target/xstormy16/sfr/27_if0_sfrw_bitfield_0.c --save-temps -fno-inline-functions -L/work/sources/gcc/current/gcc/testsuite/gcc.target/xstormy16: error executing dg-final: couldn't open "xstormy16.s": no such file or directory
FAIL: gcc.target/xstormy16/sfr/27_if0_sfrw_bitfield_3.c --save-temps -fno-inline-functions -L/work/sources/gcc/current/gcc/testsuite/gcc.target/xstormy16 (test for excess errors)
UNRESOLVED: gcc.target/xstormy16/sfr/27_if0_sfrw_bitfield_3.c --save-temps -fno-inline-functions -L/work/sources/gcc/current/gcc/testsuite/gcc.target/xstormy16 compilation failed to produce executable
ERROR: gcc.target/xstormy16/sfr/27_if0_sfrw_bitfield_3.c --save-temps -fno-inline-functions -L/work/sources/gcc/current/gcc/testsuite/gcc.target/xstormy16: error executing dg-final: couldn't open "xstormy16.s": no such file or directory
UNRESOLVED: gcc.target/xstormy16/sfr/27_if0_sfrw_bitfield_3.c --save-temps -fno-inline-functions -L/work/sources/gcc/current/gcc/testsuite/gcc.target/xstormy16: error executing dg-final: couldn't open "xstormy16.s": no such file or directory
FAIL: gcc.target/xstormy16/sfr/27_if0_sfrw_bitfield_7.c --save-temps -fno-inline-functions -L/work/sources/gcc/current/gcc/testsuite/gcc.target/xstormy16 (test for excess errors)
UNRESOLVED: gcc.target/xstormy16/sfr/27_if0_sfrw_bitfield_7.c --save-temps -fno-inline-functions -L/work/sources/gcc/current/gcc/testsuite/gcc.target/xstormy16 compilation failed to produce executable
ERROR: gcc.target/xstormy16/sfr/27_if0_sfrw_bitfield_7.c --save-temps -fno-inline-functions -L/work/sources/gcc/current/gcc/testsuite/gcc.target/xstormy16: error executing dg-final: couldn't open "xstormy16.s": no such file or directory
UNRESOLVED: gcc.target/xstormy16/sfr/27_if0_sfrw_bitfield_7.c --save-temps -fno-inline-functions -L/work/sources/gcc/current/gcc/testsuite/gcc.target/xstormy16: error executing dg-final: couldn't open "xstormy16.s": no such file or directory
FAIL: gcc.target/xstormy16/sfr/27_if0_sfrw_bitfield_8.c --save-temps -fno-inline-functions -L/work/sources/gcc/current/gcc/testsuite/gcc.target/xstormy16 (test for excess errors)
UNRESOLVED: gcc.target/xstormy16/sfr/27_if0_sfrw_bitfield_8.c --save-temps -fno-inline-functions -L/work/sources/gcc/current/gcc/testsuite/gcc.target/xstormy16 compilation failed to produce executable
ERROR: gcc.target/xstormy16/sfr/27_if0_sfrw_bitfield_8.c --save-temps -fno-inline-functions -L/work/sources/gcc/current/gcc/testsuite/gcc.target/xstormy16: error executing dg-final: couldn't open "xstormy16.s": no such file or directory
UNRESOLVED: gcc.target/xstormy16/sfr/27_if0_sfrw_bitfield_8.c --save-temps -fno-inline-functions -L/work/sources/gcc/current/gcc/testsuite/gcc.target/xstormy16: error executing dg-final: couldn't open "xstormy16.s": no such file or directory
FAIL: gcc.target/xstormy16/sfr/27_if0_sfrw_bitfield_b.c --save-temps -fno-inline-functions -L/work/sources/gcc/current/gcc/testsuite/gcc.target/xstormy16 (test for excess errors)
UNRESOLVED: gcc.target/xstormy16/sfr/27_if0_sfrw_bitfield_b.c --save-temps -fno-inline-functions -L/work/sources/gcc/current/gcc/testsuite/gcc.target/xstormy16 compilation failed to produce executable
ERROR: gcc.target/xstormy16/sfr/27_if0_sfrw_bitfield_b.c --save-temps -fno-inline-functions -L/work/sources/gcc/current/gcc/testsuite/gcc.target/xstormy16: error executing dg-final: couldn't open "xstormy16.s": no such file or directory
UNRESOLVED: gcc.target/xstormy16/sfr/27_if0_sfrw_bitfield_b.c --save-temps -fno-inline-functions -L/work/sources/gcc/current/gcc/testsuite/gcc.target/xstormy16: error executing dg-final: couldn't open "xstormy16.s": no such file or directory
FAIL: gcc.target/xstormy16/sfr/27_if0_sfrw_bitfield_f.c --save-temps -fno-inline-functions -L/work/sources/gcc/current/gcc/testsuite/gcc.target/xstormy16 (test for excess errors)
UNRESOLVED: gcc.target/xstormy16/sfr/27_if0_sfrw_bitfield_f.c --save-temps -fno-inline-functions -L/work/sources/gcc/current/gcc/testsuite/gcc.target/xstormy16 compilation failed to produce executable
ERROR: gcc.target/xstormy16/sfr/27_if0_sfrw_bitfield_f.c --save-temps -fno-inline-functions -L/work/sources/gcc/current/gcc/testsuite/gcc.target/xstormy16: error executing dg-final: couldn't open "xstormy16.s": no such file or directory
UNRESOLVED: gcc.target/xstormy16/sfr/27_if0_sfrw_bitfield_f.c --save-temps -fno-inline-functions -L/work/sources/gcc/current/gcc/testsuite/gcc.target/xstormy16: error executing dg-final: couldn't open "xstormy16.s": no such file or directory

		=== gcc Summary ===

# of expected passes		43650
# of unexpected failures	614
# of unexpected successes	9
# of expected failures		93
# of unresolved testcases	669
# of untested testcases		42
# of unsupported tests		477
/work/sources/non-sources/builds/gcc/current/xstormy16-elf/gcc/xgcc  version 4.3.0 20080124 (experimental) [trunk revision 131778] (GCC) 


Compiler version: 4.3.0 20080124 (experimental) [trunk revision 131778] (GCC) gcc 
Platform: xstormy16-unknown-elf
configure flags: --quiet --with-x=no --disable-gdbtk --enable-languages=c,c++ --prefix=/work/sources/non-sources/builds/gcc/current/xstormy16-elf/install --target=xstormy16-elf --silent


Index Nav: [Date Index] [Subject Index] [Author Index] [Thread Index]
Message Nav: [Date Prev] [Date Next] [Thread Prev] [Thread Next]