This is the mail archive of the gcc-testresults@gcc.gnu.org mailing list for the GCC project.


Index Nav: [Date Index] [Subject Index] [Author Index] [Thread Index]
Message Nav: [Date Prev] [Date Next] [Thread Prev] [Thread Next]
Other format: [Raw text]

Results for 4.1.3 20070216 (prerelease) gcc testsuite on m68hc11-unknown-none


Ubuntu 5 on pentium3-smp
cross tool versions:
GNU assembler 2.17.50 20060618
GNU gdb 6.5.50.20060618-cvs
GNU ld version 2.17.50 20060618

GNU Make 3.80
expect version 5.42.1
host gcc version: gcc (GCC) 4.3.0 20070215 (experimental)
LAST_UPDATED: Fri Feb 16 01:27:31 UTC 2007 (revision 122028)

Target is m68hc11-unknown-none
Host   is i686-pc-linux-gnu

		=== gcc tests ===


Running target m68hc11-sim
FAIL: gcc.c-torture/compile/20000804-1.c  -O0  (test for excess errors)
FAIL: gcc.c-torture/compile/20001226-1.c  -O0  (internal compiler error)
FAIL: gcc.c-torture/compile/20001226-1.c  -O0  (test for excess errors)
FAIL: gcc.c-torture/compile/20010327-1.c  -O0  (test for excess errors)
FAIL: gcc.c-torture/compile/20010327-1.c  -O1  (test for excess errors)
FAIL: gcc.c-torture/compile/20010327-1.c  -O2  (test for excess errors)
FAIL: gcc.c-torture/compile/20010327-1.c  -O3 -fomit-frame-pointer  (test for excess errors)
FAIL: gcc.c-torture/compile/20010327-1.c  -O3 -g  (test for excess errors)
FAIL: gcc.c-torture/compile/20010327-1.c  -Os  (test for excess errors)
FAIL: gcc.c-torture/compile/20010518-2.c  -O0  (test for excess errors)
FAIL: gcc.c-torture/compile/20010518-2.c  -O1  (test for excess errors)
FAIL: gcc.c-torture/compile/20010518-2.c  -O2  (test for excess errors)
FAIL: gcc.c-torture/compile/20010518-2.c  -O3 -fomit-frame-pointer  (test for excess errors)
FAIL: gcc.c-torture/compile/20010518-2.c  -O3 -g  (test for excess errors)
FAIL: gcc.c-torture/compile/20010518-2.c  -Os  (test for excess errors)
FAIL: gcc.c-torture/compile/20020604-1.c  -O0  (test for excess errors)
FAIL: gcc.c-torture/compile/20020604-1.c  -O1  (test for excess errors)
FAIL: gcc.c-torture/compile/20020604-1.c  -O2  (test for excess errors)
FAIL: gcc.c-torture/compile/20020604-1.c  -O3 -fomit-frame-pointer  (test for excess errors)
FAIL: gcc.c-torture/compile/20020604-1.c  -O3 -fomit-frame-pointer -funroll-loops  (test for excess errors)
FAIL: gcc.c-torture/compile/20020604-1.c  -O3 -fomit-frame-pointer -funroll-all-loops -finline-functions  (test for excess errors)
FAIL: gcc.c-torture/compile/20020604-1.c  -O3 -g  (test for excess errors)
FAIL: gcc.c-torture/compile/20020604-1.c  -Os  (test for excess errors)
FAIL: gcc.c-torture/compile/20040101-1.c  -O0  (test for excess errors)
FAIL: gcc.c-torture/compile/20040101-1.c  -O1  (test for excess errors)
FAIL: gcc.c-torture/compile/20040101-1.c  -O2  (test for excess errors)
FAIL: gcc.c-torture/compile/20040101-1.c  -O3 -fomit-frame-pointer  (test for excess errors)
FAIL: gcc.c-torture/compile/20040101-1.c  -O3 -g  (test for excess errors)
FAIL: gcc.c-torture/compile/20040101-1.c  -Os  (test for excess errors)
FAIL: gcc.c-torture/compile/20050303-1.c  -O0  (test for excess errors)
FAIL: gcc.c-torture/compile/20050303-1.c  -O1  (test for excess errors)
FAIL: gcc.c-torture/compile/20050303-1.c  -O2  (test for excess errors)
FAIL: gcc.c-torture/compile/20050303-1.c  -O3 -fomit-frame-pointer  (test for excess errors)
FAIL: gcc.c-torture/compile/20050303-1.c  -O3 -fomit-frame-pointer -funroll-loops  (test for excess errors)
FAIL: gcc.c-torture/compile/20050303-1.c  -O3 -fomit-frame-pointer -funroll-all-loops -finline-functions  (test for excess errors)
FAIL: gcc.c-torture/compile/20050303-1.c  -O3 -g  (test for excess errors)
FAIL: gcc.c-torture/compile/20050303-1.c  -Os  (test for excess errors)
FAIL: gcc.c-torture/compile/20050622-1.c  -O0  (test for excess errors)
FAIL: gcc.c-torture/compile/20050622-1.c  -O1  (test for excess errors)
FAIL: gcc.c-torture/compile/20050622-1.c  -O2  (test for excess errors)
FAIL: gcc.c-torture/compile/20050622-1.c  -O3 -fomit-frame-pointer  (test for excess errors)
FAIL: gcc.c-torture/compile/20050622-1.c  -O3 -g  (test for excess errors)
FAIL: gcc.c-torture/compile/20050622-1.c  -Os  (test for excess errors)
FAIL: gcc.c-torture/compile/920501-12.c  -O0  (test for excess errors)
FAIL: gcc.c-torture/compile/920501-12.c  -O1  (test for excess errors)
FAIL: gcc.c-torture/compile/920501-12.c  -O2  (test for excess errors)
FAIL: gcc.c-torture/compile/920501-12.c  -O3 -fomit-frame-pointer  (test for excess errors)
FAIL: gcc.c-torture/compile/920501-12.c  -O3 -g  (test for excess errors)
FAIL: gcc.c-torture/compile/920501-12.c  -Os  (test for excess errors)
FAIL: gcc.c-torture/compile/920501-4.c  -O0  (internal compiler error)
FAIL: gcc.c-torture/compile/920501-4.c  -O0  (test for excess errors)
FAIL: gcc.c-torture/compile/920501-4.c  -O1  (internal compiler error)
FAIL: gcc.c-torture/compile/920501-4.c  -O1  (test for excess errors)
FAIL: gcc.c-torture/compile/920501-4.c  -O2  (internal compiler error)
FAIL: gcc.c-torture/compile/920501-4.c  -O2  (test for excess errors)
FAIL: gcc.c-torture/compile/920501-4.c  -O3 -fomit-frame-pointer  (internal compiler error)
FAIL: gcc.c-torture/compile/920501-4.c  -O3 -fomit-frame-pointer  (test for excess errors)
FAIL: gcc.c-torture/compile/920501-4.c  -O3 -fomit-frame-pointer -funroll-loops  (internal compiler error)
FAIL: gcc.c-torture/compile/920501-4.c  -O3 -fomit-frame-pointer -funroll-loops  (test for excess errors)
FAIL: gcc.c-torture/compile/920501-4.c  -O3 -fomit-frame-pointer -funroll-all-loops -finline-functions  (internal compiler error)
FAIL: gcc.c-torture/compile/920501-4.c  -O3 -fomit-frame-pointer -funroll-all-loops -finline-functions  (test for excess errors)
FAIL: gcc.c-torture/compile/920501-4.c  -O3 -g  (internal compiler error)
FAIL: gcc.c-torture/compile/920501-4.c  -O3 -g  (test for excess errors)
FAIL: gcc.c-torture/compile/920501-4.c  -Os  (internal compiler error)
FAIL: gcc.c-torture/compile/920501-4.c  -Os  (test for excess errors)
FAIL: gcc.c-torture/compile/961203-1.c  -O0  (test for excess errors)
FAIL: gcc.c-torture/compile/961203-1.c  -O1  (test for excess errors)
FAIL: gcc.c-torture/compile/961203-1.c  -O2  (test for excess errors)
FAIL: gcc.c-torture/compile/961203-1.c  -O3 -fomit-frame-pointer  (test for excess errors)
FAIL: gcc.c-torture/compile/961203-1.c  -O3 -g  (test for excess errors)
FAIL: gcc.c-torture/compile/961203-1.c  -Os  (test for excess errors)
FAIL: gcc.c-torture/compile/980506-1.c  -O0  (test for excess errors)
FAIL: gcc.c-torture/compile/980506-1.c  -O1  (test for excess errors)
FAIL: gcc.c-torture/compile/980506-1.c  -O2  (test for excess errors)
FAIL: gcc.c-torture/compile/980506-1.c  -O3 -fomit-frame-pointer  (test for excess errors)
FAIL: gcc.c-torture/compile/980506-1.c  -O3 -fomit-frame-pointer -funroll-loops  (test for excess errors)
FAIL: gcc.c-torture/compile/980506-1.c  -O3 -fomit-frame-pointer -funroll-all-loops -finline-functions  (test for excess errors)
FAIL: gcc.c-torture/compile/980506-1.c  -O3 -g  (test for excess errors)
FAIL: gcc.c-torture/compile/980506-1.c  -Os  (test for excess errors)
FAIL: gcc.c-torture/compile/mangle-1.c  -O0  (test for excess errors)
FAIL: gcc.c-torture/compile/mangle-1.c  -O1  (test for excess errors)
FAIL: gcc.c-torture/compile/mangle-1.c  -O2  (test for excess errors)
FAIL: gcc.c-torture/compile/mangle-1.c  -O3 -fomit-frame-pointer  (test for excess errors)
FAIL: gcc.c-torture/compile/mangle-1.c  -O3 -g  (test for excess errors)
FAIL: gcc.c-torture/compile/mangle-1.c  -Os  (test for excess errors)
FAIL: gcc.c-torture/compile/pr25310.c  -O0  (test for excess errors)
FAIL: gcc.c-torture/compile/pr25310.c  -O1  (test for excess errors)
FAIL: gcc.c-torture/compile/pr25310.c  -O2  (test for excess errors)
FAIL: gcc.c-torture/compile/pr25310.c  -O3 -fomit-frame-pointer  (test for excess errors)
FAIL: gcc.c-torture/compile/pr25310.c  -O3 -fomit-frame-pointer -funroll-loops  (test for excess errors)
FAIL: gcc.c-torture/compile/pr25310.c  -O3 -fomit-frame-pointer -funroll-all-loops -finline-functions  (test for excess errors)
FAIL: gcc.c-torture/compile/pr25310.c  -O3 -g  (test for excess errors)
FAIL: gcc.c-torture/compile/pr25310.c  -Os  (test for excess errors)
FAIL: gcc.c-torture/execute/builtins/abs-2.c execution,  -O0 
FAIL: gcc.c-torture/execute/builtins/abs-2.c execution,  -O1 
FAIL: gcc.c-torture/execute/builtins/abs-2.c execution,  -O2 
FAIL: gcc.c-torture/execute/builtins/abs-2.c execution,  -O3 -fomit-frame-pointer 
FAIL: gcc.c-torture/execute/builtins/abs-2.c execution,  -O3 -g 
FAIL: gcc.c-torture/execute/builtins/abs-2.c execution,  -Os 
FAIL: gcc.c-torture/execute/builtins/abs-3.c execution,  -O0 
FAIL: gcc.c-torture/execute/builtins/abs-3.c execution,  -O1 
FAIL: gcc.c-torture/execute/builtins/abs-3.c execution,  -O2 
FAIL: gcc.c-torture/execute/builtins/abs-3.c execution,  -O3 -fomit-frame-pointer 
FAIL: gcc.c-torture/execute/builtins/abs-3.c execution,  -O3 -g 
FAIL: gcc.c-torture/execute/builtins/abs-3.c execution,  -Os 
UNRESOLVED: gcc.c-torture/execute/builtins/fprintf.c execution,  -O0 
UNRESOLVED: gcc.c-torture/execute/builtins/fprintf.c execution,  -O1 
UNRESOLVED: gcc.c-torture/execute/builtins/fprintf.c execution,  -O2 
UNRESOLVED: gcc.c-torture/execute/builtins/fprintf.c execution,  -O3 -fomit-frame-pointer 
UNRESOLVED: gcc.c-torture/execute/builtins/fprintf.c execution,  -O3 -g 
UNRESOLVED: gcc.c-torture/execute/builtins/fprintf.c execution,  -Os 
UNRESOLVED: gcc.c-torture/execute/builtins/memcpy-chk.c execution,  -O0 
UNRESOLVED: gcc.c-torture/execute/builtins/memcpy-chk.c execution,  -O1 
UNRESOLVED: gcc.c-torture/execute/builtins/memcpy-chk.c execution,  -O2 
UNRESOLVED: gcc.c-torture/execute/builtins/memcpy-chk.c execution,  -O3 -fomit-frame-pointer 
UNRESOLVED: gcc.c-torture/execute/builtins/memcpy-chk.c execution,  -O3 -fomit-frame-pointer -funroll-loops 
UNRESOLVED: gcc.c-torture/execute/builtins/memcpy-chk.c execution,  -O3 -fomit-frame-pointer -funroll-all-loops -finline-functions 
UNRESOLVED: gcc.c-torture/execute/builtins/memcpy-chk.c execution,  -O3 -g 
UNRESOLVED: gcc.c-torture/execute/builtins/memcpy-chk.c execution,  -Os 
UNRESOLVED: gcc.c-torture/execute/builtins/memmove-chk.c execution,  -O0 
UNRESOLVED: gcc.c-torture/execute/builtins/memmove-chk.c execution,  -O1 
UNRESOLVED: gcc.c-torture/execute/builtins/memmove-chk.c execution,  -O2 
UNRESOLVED: gcc.c-torture/execute/builtins/memmove-chk.c execution,  -O3 -fomit-frame-pointer 
UNRESOLVED: gcc.c-torture/execute/builtins/memmove-chk.c execution,  -O3 -fomit-frame-pointer -funroll-loops 
UNRESOLVED: gcc.c-torture/execute/builtins/memmove-chk.c execution,  -O3 -fomit-frame-pointer -funroll-all-loops -finline-functions 
UNRESOLVED: gcc.c-torture/execute/builtins/memmove-chk.c execution,  -O3 -g 
UNRESOLVED: gcc.c-torture/execute/builtins/memmove-chk.c execution,  -Os 
UNRESOLVED: gcc.c-torture/execute/builtins/mempcpy-chk.c execution,  -O0 
UNRESOLVED: gcc.c-torture/execute/builtins/mempcpy-chk.c execution,  -O1 
UNRESOLVED: gcc.c-torture/execute/builtins/mempcpy-chk.c execution,  -O2 
UNRESOLVED: gcc.c-torture/execute/builtins/mempcpy-chk.c execution,  -O3 -fomit-frame-pointer 
UNRESOLVED: gcc.c-torture/execute/builtins/mempcpy-chk.c execution,  -O3 -fomit-frame-pointer -funroll-loops 
UNRESOLVED: gcc.c-torture/execute/builtins/mempcpy-chk.c execution,  -O3 -fomit-frame-pointer -funroll-all-loops -finline-functions 
UNRESOLVED: gcc.c-torture/execute/builtins/mempcpy-chk.c execution,  -O3 -g 
UNRESOLVED: gcc.c-torture/execute/builtins/mempcpy-chk.c execution,  -Os 
UNRESOLVED: gcc.c-torture/execute/builtins/memset-chk.c execution,  -O0 
UNRESOLVED: gcc.c-torture/execute/builtins/memset-chk.c execution,  -O1 
UNRESOLVED: gcc.c-torture/execute/builtins/memset-chk.c execution,  -O2 
UNRESOLVED: gcc.c-torture/execute/builtins/memset-chk.c execution,  -O3 -fomit-frame-pointer 
UNRESOLVED: gcc.c-torture/execute/builtins/memset-chk.c execution,  -O3 -fomit-frame-pointer -funroll-loops 
UNRESOLVED: gcc.c-torture/execute/builtins/memset-chk.c execution,  -O3 -fomit-frame-pointer -funroll-all-loops -finline-functions 
UNRESOLVED: gcc.c-torture/execute/builtins/memset-chk.c execution,  -O3 -g 
UNRESOLVED: gcc.c-torture/execute/builtins/memset-chk.c execution,  -Os 
WARNING: program timed out.
FAIL: gcc.c-torture/execute/builtins/pr22237.c execution,  -O3 -fomit-frame-pointer -funroll-loops 
FAIL: gcc.c-torture/execute/builtins/pr22237.c execution,  -O3 -fomit-frame-pointer -funroll-all-loops -finline-functions 
UNRESOLVED: gcc.c-torture/execute/builtins/pr23484-chk.c execution,  -O0 
UNRESOLVED: gcc.c-torture/execute/builtins/pr23484-chk.c execution,  -O1 
UNRESOLVED: gcc.c-torture/execute/builtins/pr23484-chk.c execution,  -O2 
UNRESOLVED: gcc.c-torture/execute/builtins/pr23484-chk.c execution,  -O3 -fomit-frame-pointer 
UNRESOLVED: gcc.c-torture/execute/builtins/pr23484-chk.c execution,  -O3 -g 
UNRESOLVED: gcc.c-torture/execute/builtins/pr23484-chk.c execution,  -Os 
UNRESOLVED: gcc.c-torture/execute/builtins/printf.c execution,  -O0 
UNRESOLVED: gcc.c-torture/execute/builtins/printf.c execution,  -O1 
UNRESOLVED: gcc.c-torture/execute/builtins/printf.c execution,  -O2 
UNRESOLVED: gcc.c-torture/execute/builtins/printf.c execution,  -O3 -fomit-frame-pointer 
UNRESOLVED: gcc.c-torture/execute/builtins/printf.c execution,  -O3 -g 
UNRESOLVED: gcc.c-torture/execute/builtins/printf.c execution,  -Os 
UNRESOLVED: gcc.c-torture/execute/builtins/snprintf-chk.c execution,  -O0 
UNRESOLVED: gcc.c-torture/execute/builtins/snprintf-chk.c execution,  -O1 
UNRESOLVED: gcc.c-torture/execute/builtins/snprintf-chk.c execution,  -O2 
UNRESOLVED: gcc.c-torture/execute/builtins/snprintf-chk.c execution,  -O3 -fomit-frame-pointer 
UNRESOLVED: gcc.c-torture/execute/builtins/snprintf-chk.c execution,  -O3 -fomit-frame-pointer -funroll-loops 
UNRESOLVED: gcc.c-torture/execute/builtins/snprintf-chk.c execution,  -O3 -fomit-frame-pointer -funroll-all-loops -finline-functions 
UNRESOLVED: gcc.c-torture/execute/builtins/snprintf-chk.c execution,  -O3 -g 
UNRESOLVED: gcc.c-torture/execute/builtins/snprintf-chk.c execution,  -Os 
UNRESOLVED: gcc.c-torture/execute/builtins/sprintf-chk.c execution,  -O0 
UNRESOLVED: gcc.c-torture/execute/builtins/sprintf-chk.c execution,  -O1 
UNRESOLVED: gcc.c-torture/execute/builtins/sprintf-chk.c execution,  -O2 
UNRESOLVED: gcc.c-torture/execute/builtins/sprintf-chk.c execution,  -O3 -fomit-frame-pointer 
UNRESOLVED: gcc.c-torture/execute/builtins/sprintf-chk.c execution,  -O3 -fomit-frame-pointer -funroll-loops 
UNRESOLVED: gcc.c-torture/execute/builtins/sprintf-chk.c execution,  -O3 -fomit-frame-pointer -funroll-all-loops -finline-functions 
UNRESOLVED: gcc.c-torture/execute/builtins/sprintf-chk.c execution,  -O3 -g 
UNRESOLVED: gcc.c-torture/execute/builtins/sprintf-chk.c execution,  -Os 
UNRESOLVED: gcc.c-torture/execute/builtins/sprintf.c execution,  -O0 
UNRESOLVED: gcc.c-torture/execute/builtins/sprintf.c execution,  -O1 
UNRESOLVED: gcc.c-torture/execute/builtins/sprintf.c execution,  -O2 
UNRESOLVED: gcc.c-torture/execute/builtins/sprintf.c execution,  -O3 -fomit-frame-pointer 
UNRESOLVED: gcc.c-torture/execute/builtins/sprintf.c execution,  -O3 -g 
UNRESOLVED: gcc.c-torture/execute/builtins/sprintf.c execution,  -Os 
UNRESOLVED: gcc.c-torture/execute/builtins/stpcpy-chk.c execution,  -O0 
UNRESOLVED: gcc.c-torture/execute/builtins/stpcpy-chk.c execution,  -O1 
UNRESOLVED: gcc.c-torture/execute/builtins/stpcpy-chk.c execution,  -O2 
UNRESOLVED: gcc.c-torture/execute/builtins/stpcpy-chk.c execution,  -O3 -fomit-frame-pointer 
UNRESOLVED: gcc.c-torture/execute/builtins/stpcpy-chk.c execution,  -O3 -fomit-frame-pointer -funroll-loops 
UNRESOLVED: gcc.c-torture/execute/builtins/stpcpy-chk.c execution,  -O3 -fomit-frame-pointer -funroll-all-loops -finline-functions 
UNRESOLVED: gcc.c-torture/execute/builtins/stpcpy-chk.c execution,  -O3 -g 
UNRESOLVED: gcc.c-torture/execute/builtins/stpcpy-chk.c execution,  -Os 
UNRESOLVED: gcc.c-torture/execute/builtins/strcat-chk.c execution,  -O0 
UNRESOLVED: gcc.c-torture/execute/builtins/strcat-chk.c execution,  -O1 
UNRESOLVED: gcc.c-torture/execute/builtins/strcat-chk.c execution,  -O2 
UNRESOLVED: gcc.c-torture/execute/builtins/strcat-chk.c execution,  -O3 -fomit-frame-pointer 
UNRESOLVED: gcc.c-torture/execute/builtins/strcat-chk.c execution,  -O3 -fomit-frame-pointer -funroll-loops 
UNRESOLVED: gcc.c-torture/execute/builtins/strcat-chk.c execution,  -O3 -fomit-frame-pointer -funroll-all-loops -finline-functions 
UNRESOLVED: gcc.c-torture/execute/builtins/strcat-chk.c execution,  -O3 -g 
UNRESOLVED: gcc.c-torture/execute/builtins/strcat-chk.c execution,  -Os 
UNRESOLVED: gcc.c-torture/execute/builtins/strcpy-chk.c execution,  -O0 
UNRESOLVED: gcc.c-torture/execute/builtins/strcpy-chk.c execution,  -O1 
UNRESOLVED: gcc.c-torture/execute/builtins/strcpy-chk.c execution,  -O2 
UNRESOLVED: gcc.c-torture/execute/builtins/strcpy-chk.c execution,  -O3 -fomit-frame-pointer 
UNRESOLVED: gcc.c-torture/execute/builtins/strcpy-chk.c execution,  -O3 -fomit-frame-pointer -funroll-loops 
UNRESOLVED: gcc.c-torture/execute/builtins/strcpy-chk.c execution,  -O3 -fomit-frame-pointer -funroll-all-loops -finline-functions 
UNRESOLVED: gcc.c-torture/execute/builtins/strcpy-chk.c execution,  -O3 -g 
UNRESOLVED: gcc.c-torture/execute/builtins/strcpy-chk.c execution,  -Os 
UNRESOLVED: gcc.c-torture/execute/builtins/strncat-chk.c execution,  -O0 
UNRESOLVED: gcc.c-torture/execute/builtins/strncat-chk.c execution,  -O1 
UNRESOLVED: gcc.c-torture/execute/builtins/strncat-chk.c execution,  -O2 
UNRESOLVED: gcc.c-torture/execute/builtins/strncat-chk.c execution,  -O3 -fomit-frame-pointer 
UNRESOLVED: gcc.c-torture/execute/builtins/strncat-chk.c execution,  -O3 -fomit-frame-pointer -funroll-loops 
UNRESOLVED: gcc.c-torture/execute/builtins/strncat-chk.c execution,  -O3 -fomit-frame-pointer -funroll-all-loops -finline-functions 
UNRESOLVED: gcc.c-torture/execute/builtins/strncat-chk.c execution,  -O3 -g 
UNRESOLVED: gcc.c-torture/execute/builtins/strncat-chk.c execution,  -Os 
UNRESOLVED: gcc.c-torture/execute/builtins/strncpy-chk.c execution,  -O0 
UNRESOLVED: gcc.c-torture/execute/builtins/strncpy-chk.c execution,  -O1 
UNRESOLVED: gcc.c-torture/execute/builtins/strncpy-chk.c execution,  -O2 
UNRESOLVED: gcc.c-torture/execute/builtins/strncpy-chk.c execution,  -O3 -fomit-frame-pointer 
UNRESOLVED: gcc.c-torture/execute/builtins/strncpy-chk.c execution,  -O3 -fomit-frame-pointer -funroll-loops 
UNRESOLVED: gcc.c-torture/execute/builtins/strncpy-chk.c execution,  -O3 -fomit-frame-pointer -funroll-all-loops -finline-functions 
UNRESOLVED: gcc.c-torture/execute/builtins/strncpy-chk.c execution,  -O3 -g 
UNRESOLVED: gcc.c-torture/execute/builtins/strncpy-chk.c execution,  -Os 
UNRESOLVED: gcc.c-torture/execute/builtins/vsnprintf-chk.c execution,  -O0 
UNRESOLVED: gcc.c-torture/execute/builtins/vsnprintf-chk.c execution,  -O1 
UNRESOLVED: gcc.c-torture/execute/builtins/vsnprintf-chk.c execution,  -O2 
UNRESOLVED: gcc.c-torture/execute/builtins/vsnprintf-chk.c execution,  -O3 -fomit-frame-pointer 
UNRESOLVED: gcc.c-torture/execute/builtins/vsnprintf-chk.c execution,  -O3 -fomit-frame-pointer -funroll-loops 
UNRESOLVED: gcc.c-torture/execute/builtins/vsnprintf-chk.c execution,  -O3 -fomit-frame-pointer -funroll-all-loops -finline-functions 
UNRESOLVED: gcc.c-torture/execute/builtins/vsnprintf-chk.c execution,  -O3 -g 
UNRESOLVED: gcc.c-torture/execute/builtins/vsnprintf-chk.c execution,  -Os 
UNRESOLVED: gcc.c-torture/execute/builtins/vsprintf-chk.c execution,  -O0 
UNRESOLVED: gcc.c-torture/execute/builtins/vsprintf-chk.c execution,  -O1 
UNRESOLVED: gcc.c-torture/execute/builtins/vsprintf-chk.c execution,  -O2 
UNRESOLVED: gcc.c-torture/execute/builtins/vsprintf-chk.c execution,  -O3 -fomit-frame-pointer 
UNRESOLVED: gcc.c-torture/execute/builtins/vsprintf-chk.c execution,  -O3 -fomit-frame-pointer -funroll-loops 
UNRESOLVED: gcc.c-torture/execute/builtins/vsprintf-chk.c execution,  -O3 -fomit-frame-pointer -funroll-all-loops -finline-functions 
UNRESOLVED: gcc.c-torture/execute/builtins/vsprintf-chk.c execution,  -O3 -g 
UNRESOLVED: gcc.c-torture/execute/builtins/vsprintf-chk.c execution,  -Os 
FAIL: gcc.c-torture/execute/20000603-1.c execution,  -O0 
FAIL: gcc.c-torture/execute/20000603-1.c execution,  -O1 
FAIL: gcc.c-torture/execute/20000603-1.c execution,  -O2 
FAIL: gcc.c-torture/execute/20000603-1.c execution,  -Os 
FAIL: gcc.c-torture/execute/20001031-1.c execution,  -O0 
FAIL: gcc.c-torture/execute/20001031-1.c execution,  -O1 
FAIL: gcc.c-torture/execute/20001031-1.c execution,  -O2 
FAIL: gcc.c-torture/execute/20001031-1.c execution,  -Os 
FAIL: gcc.c-torture/execute/20001108-1.c execution,  -O0 
FAIL: gcc.c-torture/execute/20001108-1.c execution,  -O1 
FAIL: gcc.c-torture/execute/20001108-1.c execution,  -O2 
FAIL: gcc.c-torture/execute/20001108-1.c execution,  -Os 
FAIL: gcc.c-torture/execute/20001112-1.c execution,  -O0 
FAIL: gcc.c-torture/execute/20020201-1.c execution,  -O0 
FAIL: gcc.c-torture/execute/20020201-1.c execution,  -O1 
FAIL: gcc.c-torture/execute/20020201-1.c execution,  -O2 
FAIL: gcc.c-torture/execute/20020201-1.c execution,  -O3 -fomit-frame-pointer 
FAIL: gcc.c-torture/execute/20020201-1.c execution,  -O3 -g 
FAIL: gcc.c-torture/execute/20020201-1.c execution,  -Os 
UNRESOLVED: gcc.c-torture/execute/20020406-1.c execution,  -O0 
UNRESOLVED: gcc.c-torture/execute/20020406-1.c execution,  -O1 
UNRESOLVED: gcc.c-torture/execute/20020406-1.c execution,  -O2 
UNRESOLVED: gcc.c-torture/execute/20020406-1.c execution,  -O3 -fomit-frame-pointer 
UNRESOLVED: gcc.c-torture/execute/20020406-1.c execution,  -O3 -fomit-frame-pointer -funroll-loops 
UNRESOLVED: gcc.c-torture/execute/20020406-1.c execution,  -O3 -fomit-frame-pointer -funroll-all-loops -finline-functions 
UNRESOLVED: gcc.c-torture/execute/20020406-1.c execution,  -O3 -g 
UNRESOLVED: gcc.c-torture/execute/20020406-1.c execution,  -Os 
FAIL: gcc.c-torture/execute/20020411-1.c execution,  -O0 
FAIL: gcc.c-torture/execute/20020411-1.c execution,  -O1 
FAIL: gcc.c-torture/execute/20020411-1.c execution,  -O2 
FAIL: gcc.c-torture/execute/20020411-1.c execution,  -Os 
FAIL: gcc.c-torture/execute/20021024-1.c execution,  -O0 
FAIL: gcc.c-torture/execute/20021024-1.c execution,  -O1 
FAIL: gcc.c-torture/execute/20021024-1.c execution,  -O2 
FAIL: gcc.c-torture/execute/20021024-1.c execution,  -O3 -fomit-frame-pointer 
FAIL: gcc.c-torture/execute/20021024-1.c execution,  -O3 -g 
FAIL: gcc.c-torture/execute/20021024-1.c execution,  -Os 
FAIL: gcc.c-torture/execute/20021120-1.c execution,  -O0 
FAIL: gcc.c-torture/execute/20021120-1.c execution,  -O1 
FAIL: gcc.c-torture/execute/20021120-1.c execution,  -O2 
FAIL: gcc.c-torture/execute/20021120-1.c execution,  -O3 -fomit-frame-pointer 
FAIL: gcc.c-torture/execute/20021120-1.c execution,  -O3 -fomit-frame-pointer -funroll-loops 
FAIL: gcc.c-torture/execute/20021120-1.c execution,  -O3 -fomit-frame-pointer -funroll-all-loops -finline-functions 
FAIL: gcc.c-torture/execute/20021120-1.c execution,  -O3 -g 
FAIL: gcc.c-torture/execute/20021120-1.c execution,  -Os 
UNRESOLVED: gcc.c-torture/execute/20021120-3.c execution,  -O0 
UNRESOLVED: gcc.c-torture/execute/20021120-3.c execution,  -O1 
UNRESOLVED: gcc.c-torture/execute/20021120-3.c execution,  -O2 
UNRESOLVED: gcc.c-torture/execute/20021120-3.c execution,  -O3 -fomit-frame-pointer 
UNRESOLVED: gcc.c-torture/execute/20021120-3.c execution,  -O3 -g 
UNRESOLVED: gcc.c-torture/execute/20021120-3.c execution,  -Os 
FAIL: gcc.c-torture/execute/20030222-1.c compilation,  -O0 
UNRESOLVED: gcc.c-torture/execute/20030222-1.c execution,  -O0 
FAIL: gcc.c-torture/execute/20030222-1.c compilation,  -O1 
UNRESOLVED: gcc.c-torture/execute/20030222-1.c execution,  -O1 
FAIL: gcc.c-torture/execute/20030222-1.c compilation,  -O2 
UNRESOLVED: gcc.c-torture/execute/20030222-1.c execution,  -O2 
FAIL: gcc.c-torture/execute/20030222-1.c compilation,  -O3 -fomit-frame-pointer 
UNRESOLVED: gcc.c-torture/execute/20030222-1.c execution,  -O3 -fomit-frame-pointer 
FAIL: gcc.c-torture/execute/20030222-1.c compilation,  -O3 -g 
UNRESOLVED: gcc.c-torture/execute/20030222-1.c execution,  -O3 -g 
FAIL: gcc.c-torture/execute/20030222-1.c compilation,  -Os 
UNRESOLVED: gcc.c-torture/execute/20030222-1.c execution,  -Os 
UNRESOLVED: gcc.c-torture/execute/20030626-2.c execution,  -O0 
FAIL: gcc.c-torture/execute/20030914-1.c execution,  -O0 
FAIL: gcc.c-torture/execute/20030914-1.c execution,  -O1 
FAIL: gcc.c-torture/execute/20030914-1.c execution,  -O2 
FAIL: gcc.c-torture/execute/20030914-1.c execution,  -O3 -fomit-frame-pointer 
FAIL: gcc.c-torture/execute/20030914-1.c execution,  -O3 -fomit-frame-pointer -funroll-loops 
FAIL: gcc.c-torture/execute/20030914-1.c execution,  -O3 -fomit-frame-pointer -funroll-all-loops -finline-functions 
FAIL: gcc.c-torture/execute/20030914-1.c execution,  -O3 -g 
FAIL: gcc.c-torture/execute/20030914-1.c execution,  -Os 
FAIL: gcc.c-torture/execute/20040208-1.c execution,  -O0 
UNRESOLVED: gcc.c-torture/execute/20040709-1.c execution,  -O0 
UNRESOLVED: gcc.c-torture/execute/20040709-1.c execution,  -O1 
UNRESOLVED: gcc.c-torture/execute/20040709-1.c execution,  -O2 
UNRESOLVED: gcc.c-torture/execute/20040709-1.c execution,  -O3 -fomit-frame-pointer 
UNRESOLVED: gcc.c-torture/execute/20040709-1.c execution,  -O3 -fomit-frame-pointer -funroll-loops 
UNRESOLVED: gcc.c-torture/execute/20040709-1.c execution,  -O3 -fomit-frame-pointer -funroll-all-loops -finline-functions 
UNRESOLVED: gcc.c-torture/execute/20040709-1.c execution,  -O3 -g 
UNRESOLVED: gcc.c-torture/execute/20040709-1.c execution,  -Os 
UNRESOLVED: gcc.c-torture/execute/20040709-2.c execution,  -O0 
UNRESOLVED: gcc.c-torture/execute/20040709-2.c execution,  -O3 -fomit-frame-pointer 
UNRESOLVED: gcc.c-torture/execute/20040709-2.c execution,  -O3 -fomit-frame-pointer -funroll-loops 
UNRESOLVED: gcc.c-torture/execute/20040709-2.c execution,  -O3 -fomit-frame-pointer -funroll-all-loops -finline-functions 
UNRESOLVED: gcc.c-torture/execute/20040709-2.c execution,  -O3 -g 
WARNING: program timed out.
FAIL: gcc.c-torture/execute/20040811-1.c execution,  -O0 
FAIL: gcc.c-torture/execute/20041011-1.c execution,  -O0 
FAIL: gcc.c-torture/execute/20041011-1.c execution,  -O1 
FAIL: gcc.c-torture/execute/20041011-1.c execution,  -O2 
FAIL: gcc.c-torture/execute/20041011-1.c execution,  -O3 -fomit-frame-pointer 
FAIL: gcc.c-torture/execute/20041011-1.c execution,  -O3 -fomit-frame-pointer -funroll-loops 
FAIL: gcc.c-torture/execute/20041011-1.c execution,  -O3 -fomit-frame-pointer -funroll-all-loops -finline-functions 
FAIL: gcc.c-torture/execute/20041011-1.c execution,  -O3 -g 
FAIL: gcc.c-torture/execute/20041011-1.c execution,  -Os 
FAIL: gcc.c-torture/execute/20050104-1.c execution,  -O0 
FAIL: gcc.c-torture/execute/20050104-1.c execution,  -O1 
FAIL: gcc.c-torture/execute/20050104-1.c execution,  -O2 
FAIL: gcc.c-torture/execute/20050104-1.c execution,  -Os 
FAIL: gcc.c-torture/execute/20050121-1.c execution,  -O0 
FAIL: gcc.c-torture/execute/20050121-1.c execution,  -O1 
FAIL: gcc.c-torture/execute/20050121-1.c execution,  -O2 
FAIL: gcc.c-torture/execute/20050121-1.c execution,  -Os 
FAIL: gcc.c-torture/execute/20051113-1.c execution,  -O0 
FAIL: gcc.c-torture/execute/20051113-1.c execution,  -O1 
FAIL: gcc.c-torture/execute/20051113-1.c execution,  -O2 
FAIL: gcc.c-torture/execute/20051113-1.c execution,  -O3 -fomit-frame-pointer 
FAIL: gcc.c-torture/execute/20051113-1.c execution,  -O3 -fomit-frame-pointer -funroll-loops 
FAIL: gcc.c-torture/execute/20051113-1.c execution,  -O3 -fomit-frame-pointer -funroll-all-loops -finline-functions 
FAIL: gcc.c-torture/execute/20051113-1.c execution,  -O3 -g 
FAIL: gcc.c-torture/execute/20051113-1.c execution,  -Os 
UNRESOLVED: gcc.c-torture/execute/20070201-1.c execution,  -O0 
UNRESOLVED: gcc.c-torture/execute/20070201-1.c execution,  -O1 
UNRESOLVED: gcc.c-torture/execute/20070201-1.c execution,  -O2 
UNRESOLVED: gcc.c-torture/execute/20070201-1.c execution,  -O3 -fomit-frame-pointer 
UNRESOLVED: gcc.c-torture/execute/20070201-1.c execution,  -O3 -g 
UNRESOLVED: gcc.c-torture/execute/20070201-1.c execution,  -Os 
FAIL: gcc.c-torture/execute/920501-2.c execution,  -O0 
FAIL: gcc.c-torture/execute/920501-2.c execution,  -O1 
FAIL: gcc.c-torture/execute/920501-2.c execution,  -O2 
FAIL: gcc.c-torture/execute/920501-2.c execution,  -O3 -fomit-frame-pointer 
FAIL: gcc.c-torture/execute/920501-2.c execution,  -O3 -fomit-frame-pointer -funroll-loops 
FAIL: gcc.c-torture/execute/920501-2.c execution,  -O3 -fomit-frame-pointer -funroll-all-loops -finline-functions 
FAIL: gcc.c-torture/execute/920501-2.c execution,  -O3 -g 
FAIL: gcc.c-torture/execute/920501-2.c execution,  -Os 
FAIL: gcc.c-torture/execute/920501-6.c execution,  -O0 
FAIL: gcc.c-torture/execute/920501-6.c execution,  -O1 
FAIL: gcc.c-torture/execute/920501-6.c execution,  -O2 
FAIL: gcc.c-torture/execute/920501-6.c execution,  -O3 -fomit-frame-pointer 
FAIL: gcc.c-torture/execute/920501-6.c execution,  -O3 -fomit-frame-pointer -funroll-loops 
FAIL: gcc.c-torture/execute/920501-6.c compilation,  -O3 -fomit-frame-pointer -funroll-all-loops -finline-functions  (internal compiler error)
UNRESOLVED: gcc.c-torture/execute/920501-6.c execution,  -O3 -fomit-frame-pointer -funroll-all-loops -finline-functions 
FAIL: gcc.c-torture/execute/920501-6.c execution,  -O3 -g 
FAIL: gcc.c-torture/execute/920501-6.c execution,  -Os 
UNRESOLVED: gcc.c-torture/execute/920501-8.c execution,  -O0 
UNRESOLVED: gcc.c-torture/execute/920501-8.c execution,  -O1 
UNRESOLVED: gcc.c-torture/execute/920501-8.c execution,  -O2 
UNRESOLVED: gcc.c-torture/execute/920501-8.c execution,  -O3 -fomit-frame-pointer 
UNRESOLVED: gcc.c-torture/execute/920501-8.c execution,  -O3 -g 
UNRESOLVED: gcc.c-torture/execute/920501-8.c execution,  -Os 
UNRESOLVED: gcc.c-torture/execute/920501-9.c execution,  -O0 
UNRESOLVED: gcc.c-torture/execute/920501-9.c execution,  -O1 
UNRESOLVED: gcc.c-torture/execute/920501-9.c execution,  -O2 
UNRESOLVED: gcc.c-torture/execute/920501-9.c execution,  -O3 -fomit-frame-pointer 
UNRESOLVED: gcc.c-torture/execute/920501-9.c execution,  -O3 -g 
UNRESOLVED: gcc.c-torture/execute/920501-9.c execution,  -Os 
UNRESOLVED: gcc.c-torture/execute/920726-1.c execution,  -O0 
UNRESOLVED: gcc.c-torture/execute/920726-1.c execution,  -O1 
UNRESOLVED: gcc.c-torture/execute/920726-1.c execution,  -O2 
UNRESOLVED: gcc.c-torture/execute/920726-1.c execution,  -O3 -fomit-frame-pointer 
UNRESOLVED: gcc.c-torture/execute/920726-1.c execution,  -O3 -fomit-frame-pointer -funroll-loops 
UNRESOLVED: gcc.c-torture/execute/920726-1.c execution,  -O3 -fomit-frame-pointer -funroll-all-loops -finline-functions 
UNRESOLVED: gcc.c-torture/execute/920726-1.c execution,  -O3 -g 
UNRESOLVED: gcc.c-torture/execute/920726-1.c execution,  -Os 
FAIL: gcc.c-torture/execute/921208-1.c execution,  -O0 
FAIL: gcc.c-torture/execute/921208-1.c execution,  -O1 
FAIL: gcc.c-torture/execute/921208-1.c execution,  -O2 
FAIL: gcc.c-torture/execute/921208-1.c execution,  -O3 -fomit-frame-pointer 
FAIL: gcc.c-torture/execute/921208-1.c execution,  -O3 -g 
FAIL: gcc.c-torture/execute/921208-1.c execution,  -Os 
FAIL: gcc.c-torture/execute/930106-1.c execution,  -O0 
FAIL: gcc.c-torture/execute/930106-1.c execution,  -O1 
FAIL: gcc.c-torture/execute/930106-1.c execution,  -O2 
FAIL: gcc.c-torture/execute/930106-1.c execution,  -Os 
UNRESOLVED: gcc.c-torture/execute/930513-1.c execution,  -O0 
UNRESOLVED: gcc.c-torture/execute/930513-1.c execution,  -O1 
UNRESOLVED: gcc.c-torture/execute/930513-1.c execution,  -O2 
UNRESOLVED: gcc.c-torture/execute/930513-1.c execution,  -O3 -fomit-frame-pointer 
UNRESOLVED: gcc.c-torture/execute/930513-1.c execution,  -O3 -g 
UNRESOLVED: gcc.c-torture/execute/930513-1.c execution,  -Os 
FAIL: gcc.c-torture/execute/930622-2.c execution,  -O0 
FAIL: gcc.c-torture/execute/930622-2.c execution,  -O1 
FAIL: gcc.c-torture/execute/930622-2.c execution,  -O2 
FAIL: gcc.c-torture/execute/930622-2.c execution,  -Os 
UNRESOLVED: gcc.c-torture/execute/931018-1.c execution,  -O0 
UNRESOLVED: gcc.c-torture/execute/931018-1.c execution,  -O1 
UNRESOLVED: gcc.c-torture/execute/931018-1.c execution,  -O2 
UNRESOLVED: gcc.c-torture/execute/931018-1.c execution,  -O3 -fomit-frame-pointer 
UNRESOLVED: gcc.c-torture/execute/931018-1.c execution,  -O3 -g 
UNRESOLVED: gcc.c-torture/execute/931018-1.c execution,  -Os 
UNRESOLVED: gcc.c-torture/execute/941014-2.c execution,  -O0 
UNRESOLVED: gcc.c-torture/execute/941014-2.c execution,  -O1 
UNRESOLVED: gcc.c-torture/execute/941014-2.c execution,  -O2 
UNRESOLVED: gcc.c-torture/execute/941014-2.c execution,  -O3 -fomit-frame-pointer 
UNRESOLVED: gcc.c-torture/execute/941014-2.c execution,  -O3 -g 
UNRESOLVED: gcc.c-torture/execute/941014-2.c execution,  -Os 
FAIL: gcc.c-torture/execute/950511-1.c execution,  -O0 
FAIL: gcc.c-torture/execute/950612-1.c execution,  -O1 
FAIL: gcc.c-torture/execute/950612-1.c execution,  -O2 
FAIL: gcc.c-torture/execute/950612-1.c execution,  -Os 
FAIL: gcc.c-torture/execute/960215-1.c execution,  -O0 
FAIL: gcc.c-torture/execute/960215-1.c execution,  -O1 
FAIL: gcc.c-torture/execute/960215-1.c execution,  -O2 
FAIL: gcc.c-torture/execute/960215-1.c execution,  -O3 -fomit-frame-pointer 
FAIL: gcc.c-torture/execute/960215-1.c execution,  -O3 -g 
FAIL: gcc.c-torture/execute/960215-1.c execution,  -Os 
FAIL: gcc.c-torture/execute/960801-1.c execution,  -O1 
FAIL: gcc.c-torture/execute/960801-1.c execution,  -O2 
FAIL: gcc.c-torture/execute/960801-1.c execution,  -Os 
FAIL: gcc.c-torture/execute/961223-1.c execution,  -O0 
FAIL: gcc.c-torture/execute/961223-1.c execution,  -Os 
UNRESOLVED: gcc.c-torture/execute/980605-1.c execution,  -O0 
UNRESOLVED: gcc.c-torture/execute/980605-1.c execution,  -O1 
UNRESOLVED: gcc.c-torture/execute/980605-1.c execution,  -O2 
UNRESOLVED: gcc.c-torture/execute/980605-1.c execution,  -O3 -fomit-frame-pointer 
UNRESOLVED: gcc.c-torture/execute/980605-1.c execution,  -O3 -g 
UNRESOLVED: gcc.c-torture/execute/980605-1.c execution,  -Os 
FAIL: gcc.c-torture/execute/980709-1.c compilation,  -O0 
UNRESOLVED: gcc.c-torture/execute/980709-1.c execution,  -O0 
FAIL: gcc.c-torture/execute/980709-1.c compilation,  -O1 
UNRESOLVED: gcc.c-torture/execute/980709-1.c execution,  -O1 
FAIL: gcc.c-torture/execute/980709-1.c compilation,  -O2 
UNRESOLVED: gcc.c-torture/execute/980709-1.c execution,  -O2 
FAIL: gcc.c-torture/execute/980709-1.c compilation,  -O3 -fomit-frame-pointer 
UNRESOLVED: gcc.c-torture/execute/980709-1.c execution,  -O3 -fomit-frame-pointer 
FAIL: gcc.c-torture/execute/980709-1.c compilation,  -O3 -g 
UNRESOLVED: gcc.c-torture/execute/980709-1.c execution,  -O3 -g 
FAIL: gcc.c-torture/execute/980709-1.c compilation,  -Os 
UNRESOLVED: gcc.c-torture/execute/980709-1.c execution,  -Os 
FAIL: gcc.c-torture/execute/990127-2.c execution,  -O0 
FAIL: gcc.c-torture/execute/990127-2.c execution,  -O1 
FAIL: gcc.c-torture/execute/990127-2.c execution,  -O2 
FAIL: gcc.c-torture/execute/990127-2.c execution,  -Os 
FAIL: gcc.c-torture/execute/991016-1.c execution,  -O0 
FAIL: gcc.c-torture/execute/991016-1.c execution,  -O1 
FAIL: gcc.c-torture/execute/991016-1.c execution,  -O2 
FAIL: gcc.c-torture/execute/991016-1.c execution,  -Os 
FAIL: gcc.c-torture/execute/991019-1.c execution,  -O0 
FAIL: gcc.c-torture/execute/991019-1.c execution,  -O1 
FAIL: gcc.c-torture/execute/991019-1.c execution,  -O2 
FAIL: gcc.c-torture/execute/991019-1.c execution,  -Os 
FAIL: gcc.c-torture/execute/ashrdi-1.c execution,  -O3 -fomit-frame-pointer 
FAIL: gcc.c-torture/execute/ashrdi-1.c execution,  -O3 -fomit-frame-pointer -funroll-loops 
FAIL: gcc.c-torture/execute/ashrdi-1.c execution,  -O3 -fomit-frame-pointer -funroll-all-loops -finline-functions 
FAIL: gcc.c-torture/execute/ashrdi-1.c execution,  -O3 -g 
FAIL: gcc.c-torture/execute/bitfld-3.c execution,  -O0 
FAIL: gcc.c-torture/execute/bitfld-3.c execution,  -O1 
FAIL: gcc.c-torture/execute/bitfld-3.c execution,  -O2 
FAIL: gcc.c-torture/execute/bitfld-3.c execution,  -O3 -fomit-frame-pointer 
FAIL: gcc.c-torture/execute/bitfld-3.c execution,  -O3 -g 
FAIL: gcc.c-torture/execute/bitfld-3.c execution,  -Os 
FAIL: gcc.c-torture/execute/builtin-bitops-1.c execution,  -O0 
FAIL: gcc.c-torture/execute/builtin-bitops-1.c execution,  -O1 
FAIL: gcc.c-torture/execute/builtin-bitops-1.c execution,  -O2 
FAIL: gcc.c-torture/execute/builtin-bitops-1.c execution,  -O3 -fomit-frame-pointer 
FAIL: gcc.c-torture/execute/builtin-bitops-1.c execution,  -O3 -fomit-frame-pointer -funroll-loops 
FAIL: gcc.c-torture/execute/builtin-bitops-1.c execution,  -O3 -fomit-frame-pointer -funroll-all-loops -finline-functions 
FAIL: gcc.c-torture/execute/builtin-bitops-1.c execution,  -O3 -g 
FAIL: gcc.c-torture/execute/builtin-bitops-1.c execution,  -Os 
UNRESOLVED: gcc.c-torture/execute/cmpdi-1.c execution,  -O0 
UNRESOLVED: gcc.c-torture/execute/cmpdi-1.c execution,  -O1 
UNRESOLVED: gcc.c-torture/execute/cmpdi-1.c execution,  -O2 
UNRESOLVED: gcc.c-torture/execute/cmpdi-1.c execution,  -O3 -fomit-frame-pointer 
UNRESOLVED: gcc.c-torture/execute/cmpdi-1.c execution,  -O3 -fomit-frame-pointer -funroll-loops 
UNRESOLVED: gcc.c-torture/execute/cmpdi-1.c execution,  -O3 -fomit-frame-pointer -funroll-all-loops -finline-functions 
UNRESOLVED: gcc.c-torture/execute/cmpdi-1.c execution,  -O3 -g 
UNRESOLVED: gcc.c-torture/execute/cmpdi-1.c execution,  -Os 
FAIL: gcc.c-torture/execute/complex-1.c execution,  -O0 
FAIL: gcc.c-torture/execute/complex-1.c execution,  -O1 
FAIL: gcc.c-torture/execute/complex-1.c execution,  -O2 
FAIL: gcc.c-torture/execute/complex-2.c execution,  -O0 
FAIL: gcc.c-torture/execute/complex-2.c execution,  -O1 
FAIL: gcc.c-torture/execute/complex-2.c execution,  -O2 
FAIL: gcc.c-torture/execute/complex-2.c execution,  -O3 -fomit-frame-pointer 
FAIL: gcc.c-torture/execute/complex-2.c execution,  -O3 -g 
FAIL: gcc.c-torture/execute/complex-2.c execution,  -Os 
FAIL: gcc.c-torture/execute/complex-6.c execution,  -O0 
FAIL: gcc.c-torture/execute/complex-6.c execution,  -O1 
FAIL: gcc.c-torture/execute/complex-6.c execution,  -O2 
FAIL: gcc.c-torture/execute/complex-6.c execution,  -Os 
FAIL: gcc.c-torture/execute/conversion.c execution,  -O0 
FAIL: gcc.c-torture/execute/conversion.c execution,  -O1 
FAIL: gcc.c-torture/execute/conversion.c execution,  -O2 
FAIL: gcc.c-torture/execute/conversion.c execution,  -Os 
FAIL: gcc.c-torture/execute/cvt-1.c execution,  -O0 
FAIL: gcc.c-torture/execute/cvt-1.c execution,  -O1 
FAIL: gcc.c-torture/execute/cvt-1.c execution,  -O2 
FAIL: gcc.c-torture/execute/cvt-1.c execution,  -Os 
FAIL: gcc.c-torture/execute/float-floor.c compilation,  -O0 
UNRESOLVED: gcc.c-torture/execute/float-floor.c execution,  -O0 
FAIL: gcc.c-torture/execute/float-floor.c compilation,  -O1 
UNRESOLVED: gcc.c-torture/execute/float-floor.c execution,  -O1 
FAIL: gcc.c-torture/execute/float-floor.c compilation,  -O2 
UNRESOLVED: gcc.c-torture/execute/float-floor.c execution,  -O2 
FAIL: gcc.c-torture/execute/float-floor.c compilation,  -O3 -fomit-frame-pointer 
UNRESOLVED: gcc.c-torture/execute/float-floor.c execution,  -O3 -fomit-frame-pointer 
FAIL: gcc.c-torture/execute/float-floor.c compilation,  -O3 -g 
UNRESOLVED: gcc.c-torture/execute/float-floor.c execution,  -O3 -g 
FAIL: gcc.c-torture/execute/float-floor.c compilation,  -Os 
UNRESOLVED: gcc.c-torture/execute/float-floor.c execution,  -Os 
UNRESOLVED: gcc.c-torture/execute/fprintf-1.c execution,  -O0 
UNRESOLVED: gcc.c-torture/execute/fprintf-1.c execution,  -O1 
UNRESOLVED: gcc.c-torture/execute/fprintf-1.c execution,  -O2 
UNRESOLVED: gcc.c-torture/execute/fprintf-1.c execution,  -O3 -fomit-frame-pointer 
UNRESOLVED: gcc.c-torture/execute/fprintf-1.c execution,  -O3 -g 
UNRESOLVED: gcc.c-torture/execute/fprintf-1.c execution,  -Os 
UNRESOLVED: gcc.c-torture/execute/fprintf-chk-1.c execution,  -O0 
UNRESOLVED: gcc.c-torture/execute/fprintf-chk-1.c execution,  -O1 
UNRESOLVED: gcc.c-torture/execute/fprintf-chk-1.c execution,  -O2 
UNRESOLVED: gcc.c-torture/execute/fprintf-chk-1.c execution,  -O3 -fomit-frame-pointer 
UNRESOLVED: gcc.c-torture/execute/fprintf-chk-1.c execution,  -O3 -g 
UNRESOLVED: gcc.c-torture/execute/fprintf-chk-1.c execution,  -Os 
FAIL: gcc.c-torture/execute/func-ptr-1.c execution,  -O0 
FAIL: gcc.c-torture/execute/func-ptr-1.c execution,  -O1 
FAIL: gcc.c-torture/execute/func-ptr-1.c execution,  -O2 
FAIL: gcc.c-torture/execute/func-ptr-1.c execution,  -O3 -fomit-frame-pointer 
FAIL: gcc.c-torture/execute/func-ptr-1.c execution,  -O3 -g 
FAIL: gcc.c-torture/execute/func-ptr-1.c execution,  -Os 
UNRESOLVED: gcc.c-torture/execute/gofast.c execution,  -O0 
UNRESOLVED: gcc.c-torture/execute/gofast.c execution,  -O1 
UNRESOLVED: gcc.c-torture/execute/gofast.c execution,  -O2 
UNRESOLVED: gcc.c-torture/execute/gofast.c execution,  -O3 -fomit-frame-pointer 
UNRESOLVED: gcc.c-torture/execute/gofast.c execution,  -O3 -g 
UNRESOLVED: gcc.c-torture/execute/gofast.c execution,  -Os 
FAIL: gcc.c-torture/execute/longlong.c execution,  -O0 
FAIL: gcc.c-torture/execute/loop-15.c execution,  -O3 -fomit-frame-pointer 
FAIL: gcc.c-torture/execute/lshrdi-1.c compilation,  -O1  (internal compiler error)
UNRESOLVED: gcc.c-torture/execute/lshrdi-1.c execution,  -O1 
FAIL: gcc.c-torture/execute/lshrdi-1.c execution,  -O2 
FAIL: gcc.c-torture/execute/lshrdi-1.c execution,  -O3 -fomit-frame-pointer 
FAIL: gcc.c-torture/execute/lshrdi-1.c execution,  -O3 -fomit-frame-pointer -funroll-loops 
FAIL: gcc.c-torture/execute/lshrdi-1.c execution,  -O3 -fomit-frame-pointer -funroll-all-loops -finline-functions 
FAIL: gcc.c-torture/execute/lshrdi-1.c execution,  -O3 -g 
FAIL: gcc.c-torture/execute/lshrdi-1.c execution,  -Os 
UNRESOLVED: gcc.c-torture/execute/pr20601-1.c execution,  -O0 
UNRESOLVED: gcc.c-torture/execute/pr20601-1.c execution,  -O1 
UNRESOLVED: gcc.c-torture/execute/pr20601-1.c execution,  -O2 
UNRESOLVED: gcc.c-torture/execute/pr20601-1.c execution,  -O3 -fomit-frame-pointer 
UNRESOLVED: gcc.c-torture/execute/pr20601-1.c execution,  -O3 -fomit-frame-pointer -funroll-loops 
UNRESOLVED: gcc.c-torture/execute/pr20601-1.c execution,  -O3 -fomit-frame-pointer -funroll-all-loops -finline-functions 
UNRESOLVED: gcc.c-torture/execute/pr20601-1.c execution,  -O3 -g 
UNRESOLVED: gcc.c-torture/execute/pr20601-1.c execution,  -Os 
FAIL: gcc.c-torture/execute/pr23135.c compilation,  -O1 
UNRESOLVED: gcc.c-torture/execute/pr23135.c execution,  -O1 
FAIL: gcc.c-torture/execute/pr23135.c compilation,  -O2 
UNRESOLVED: gcc.c-torture/execute/pr23135.c execution,  -O2 
FAIL: gcc.c-torture/execute/pr23135.c compilation,  -Os 
UNRESOLVED: gcc.c-torture/execute/pr23135.c execution,  -Os 
FAIL: gcc.c-torture/execute/pr30185.c execution,  -O0 
FAIL: gcc.c-torture/execute/pr30185.c execution,  -O1 
FAIL: gcc.c-torture/execute/pr30185.c execution,  -O2 
FAIL: gcc.c-torture/execute/pr30185.c execution,  -O3 -fomit-frame-pointer 
FAIL: gcc.c-torture/execute/pr30185.c execution,  -O3 -g 
FAIL: gcc.c-torture/execute/pr30185.c execution,  -Os 
UNRESOLVED: gcc.c-torture/execute/printf-1.c execution,  -O0 
UNRESOLVED: gcc.c-torture/execute/printf-1.c execution,  -O1 
UNRESOLVED: gcc.c-torture/execute/printf-1.c execution,  -O2 
UNRESOLVED: gcc.c-torture/execute/printf-1.c execution,  -O3 -fomit-frame-pointer 
UNRESOLVED: gcc.c-torture/execute/printf-1.c execution,  -O3 -g 
UNRESOLVED: gcc.c-torture/execute/printf-1.c execution,  -Os 
UNRESOLVED: gcc.c-torture/execute/printf-chk-1.c execution,  -O0 
UNRESOLVED: gcc.c-torture/execute/printf-chk-1.c execution,  -O1 
UNRESOLVED: gcc.c-torture/execute/printf-chk-1.c execution,  -O2 
UNRESOLVED: gcc.c-torture/execute/printf-chk-1.c execution,  -O3 -fomit-frame-pointer 
UNRESOLVED: gcc.c-torture/execute/printf-chk-1.c execution,  -O3 -g 
UNRESOLVED: gcc.c-torture/execute/printf-chk-1.c execution,  -Os 
FAIL: gcc.c-torture/execute/regstack-1.c execution,  -O0 
FAIL: gcc.c-torture/execute/regstack-1.c execution,  -O1 
FAIL: gcc.c-torture/execute/regstack-1.c execution,  -O2 
FAIL: gcc.c-torture/execute/regstack-1.c execution,  -O3 -fomit-frame-pointer 
FAIL: gcc.c-torture/execute/regstack-1.c execution,  -O3 -g 
FAIL: gcc.c-torture/execute/regstack-1.c execution,  -Os 
FAIL: gcc.c-torture/execute/simd-2.c execution,  -O3 -fomit-frame-pointer 
FAIL: gcc.c-torture/execute/simd-2.c execution,  -O3 -g 
FAIL: gcc.c-torture/execute/simd-4.c execution,  -O0 
FAIL: gcc.c-torture/execute/stdarg-1.c execution,  -O0 
FAIL: gcc.c-torture/execute/stdarg-1.c execution,  -O1 
FAIL: gcc.c-torture/execute/stdarg-1.c execution,  -O2 
FAIL: gcc.c-torture/execute/stdarg-1.c execution,  -O3 -fomit-frame-pointer 
FAIL: gcc.c-torture/execute/stdarg-1.c execution,  -O3 -g 
FAIL: gcc.c-torture/execute/stdarg-1.c execution,  -Os 
WARNING: program timed out.
FAIL: gcc.c-torture/execute/strlen-1.c execution,  -O3 -fomit-frame-pointer -funroll-loops 
FAIL: gcc.c-torture/execute/strlen-1.c execution,  -O3 -fomit-frame-pointer -funroll-all-loops -finline-functions 
UNRESOLVED: gcc.c-torture/execute/struct-ret-1.c execution,  -O0 
UNRESOLVED: gcc.c-torture/execute/struct-ret-1.c execution,  -O1 
UNRESOLVED: gcc.c-torture/execute/struct-ret-1.c execution,  -O2 
UNRESOLVED: gcc.c-torture/execute/struct-ret-1.c execution,  -O3 -fomit-frame-pointer 
UNRESOLVED: gcc.c-torture/execute/struct-ret-1.c execution,  -O3 -g 
UNRESOLVED: gcc.c-torture/execute/struct-ret-1.c execution,  -Os 
FAIL: gcc.c-torture/execute/va-arg-15.c execution,  -O0 
FAIL: gcc.c-torture/execute/va-arg-15.c execution,  -O1 
FAIL: gcc.c-torture/execute/va-arg-15.c execution,  -O2 
FAIL: gcc.c-torture/execute/va-arg-15.c execution,  -O3 -fomit-frame-pointer 
FAIL: gcc.c-torture/execute/va-arg-15.c execution,  -O3 -fomit-frame-pointer -funroll-loops 
FAIL: gcc.c-torture/execute/va-arg-15.c execution,  -O3 -fomit-frame-pointer -funroll-all-loops -finline-functions 
FAIL: gcc.c-torture/execute/va-arg-15.c execution,  -O3 -g 
FAIL: gcc.c-torture/execute/va-arg-15.c execution,  -Os 
FAIL: gcc.c-torture/execute/va-arg-20.c execution,  -O0 
FAIL: gcc.c-torture/execute/va-arg-20.c execution,  -O1 
FAIL: gcc.c-torture/execute/va-arg-20.c execution,  -O2 
FAIL: gcc.c-torture/execute/va-arg-20.c execution,  -O3 -fomit-frame-pointer 
FAIL: gcc.c-torture/execute/va-arg-20.c execution,  -O3 -g 
FAIL: gcc.c-torture/execute/va-arg-20.c execution,  -Os 
UNRESOLVED: gcc.c-torture/execute/va-arg-21.c execution,  -O0 
UNRESOLVED: gcc.c-torture/execute/va-arg-21.c execution,  -O1 
UNRESOLVED: gcc.c-torture/execute/va-arg-21.c execution,  -O2 
UNRESOLVED: gcc.c-torture/execute/va-arg-21.c execution,  -O3 -fomit-frame-pointer 
UNRESOLVED: gcc.c-torture/execute/va-arg-21.c execution,  -O3 -fomit-frame-pointer -funroll-loops 
UNRESOLVED: gcc.c-torture/execute/va-arg-21.c execution,  -O3 -fomit-frame-pointer -funroll-all-loops -finline-functions 
UNRESOLVED: gcc.c-torture/execute/va-arg-21.c execution,  -O3 -g 
UNRESOLVED: gcc.c-torture/execute/va-arg-21.c execution,  -Os 
UNRESOLVED: gcc.c-torture/execute/va-arg-24.c execution,  -O0 
UNRESOLVED: gcc.c-torture/execute/va-arg-24.c execution,  -O1 
UNRESOLVED: gcc.c-torture/execute/va-arg-24.c execution,  -O2 
UNRESOLVED: gcc.c-torture/execute/va-arg-24.c execution,  -O3 -fomit-frame-pointer 
UNRESOLVED: gcc.c-torture/execute/va-arg-24.c execution,  -O3 -fomit-frame-pointer -funroll-loops 
UNRESOLVED: gcc.c-torture/execute/va-arg-24.c execution,  -O3 -fomit-frame-pointer -funroll-all-loops -finline-functions 
UNRESOLVED: gcc.c-torture/execute/va-arg-24.c execution,  -O3 -g 
UNRESOLVED: gcc.c-torture/execute/va-arg-24.c execution,  -Os 
UNRESOLVED: gcc.c-torture/execute/vfprintf-1.c execution,  -O0 
UNRESOLVED: gcc.c-torture/execute/vfprintf-1.c execution,  -O1 
UNRESOLVED: gcc.c-torture/execute/vfprintf-1.c execution,  -O2 
UNRESOLVED: gcc.c-torture/execute/vfprintf-1.c execution,  -O3 -fomit-frame-pointer 
UNRESOLVED: gcc.c-torture/execute/vfprintf-1.c execution,  -O3 -g 
UNRESOLVED: gcc.c-torture/execute/vfprintf-1.c execution,  -Os 
UNRESOLVED: gcc.c-torture/execute/vfprintf-chk-1.c execution,  -O0 
UNRESOLVED: gcc.c-torture/execute/vfprintf-chk-1.c execution,  -O1 
UNRESOLVED: gcc.c-torture/execute/vfprintf-chk-1.c execution,  -O2 
UNRESOLVED: gcc.c-torture/execute/vfprintf-chk-1.c execution,  -O3 -fomit-frame-pointer 
UNRESOLVED: gcc.c-torture/execute/vfprintf-chk-1.c execution,  -O3 -g 
UNRESOLVED: gcc.c-torture/execute/vfprintf-chk-1.c execution,  -Os 
UNRESOLVED: gcc.c-torture/execute/vprintf-1.c execution,  -O0 
UNRESOLVED: gcc.c-torture/execute/vprintf-1.c execution,  -O1 
UNRESOLVED: gcc.c-torture/execute/vprintf-1.c execution,  -O2 
UNRESOLVED: gcc.c-torture/execute/vprintf-1.c execution,  -O3 -fomit-frame-pointer 
UNRESOLVED: gcc.c-torture/execute/vprintf-1.c execution,  -O3 -g 
UNRESOLVED: gcc.c-torture/execute/vprintf-1.c execution,  -Os 
UNRESOLVED: gcc.c-torture/execute/vprintf-chk-1.c execution,  -O0 
UNRESOLVED: gcc.c-torture/execute/vprintf-chk-1.c execution,  -O1 
UNRESOLVED: gcc.c-torture/execute/vprintf-chk-1.c execution,  -O2 
UNRESOLVED: gcc.c-torture/execute/vprintf-chk-1.c execution,  -O3 -fomit-frame-pointer 
UNRESOLVED: gcc.c-torture/execute/vprintf-chk-1.c execution,  -O3 -g 
UNRESOLVED: gcc.c-torture/execute/vprintf-chk-1.c execution,  -Os 
FAIL: gcc.c-torture/execute/ieee/20000320-1.c execution,  -O0 
FAIL: gcc.c-torture/execute/ieee/20000320-1.c execution,  -O1 
FAIL: gcc.c-torture/execute/ieee/20000320-1.c execution,  -O2 
FAIL: gcc.c-torture/execute/ieee/20000320-1.c execution,  -O3 -fomit-frame-pointer 
FAIL: gcc.c-torture/execute/ieee/20000320-1.c execution,  -O3 -g 
FAIL: gcc.c-torture/execute/ieee/20000320-1.c execution,  -Os 
WARNING: program timed out.
FAIL: gcc.c-torture/execute/ieee/20001122-1.c execution,  -O0 
WARNING: program timed out.
FAIL: gcc.c-torture/execute/ieee/20001122-1.c execution,  -O1 
WARNING: program timed out.
FAIL: gcc.c-torture/execute/ieee/20001122-1.c execution,  -O2 
WARNING: program timed out.
FAIL: gcc.c-torture/execute/ieee/20001122-1.c execution,  -O3 -fomit-frame-pointer 
WARNING: program timed out.
FAIL: gcc.c-torture/execute/ieee/20001122-1.c execution,  -O3 -fomit-frame-pointer -funroll-loops 
WARNING: program timed out.
FAIL: gcc.c-torture/execute/ieee/20001122-1.c execution,  -O3 -fomit-frame-pointer -funroll-all-loops -finline-functions 
WARNING: program timed out.
FAIL: gcc.c-torture/execute/ieee/20001122-1.c execution,  -O3 -g 
WARNING: program timed out.
FAIL: gcc.c-torture/execute/ieee/20001122-1.c execution,  -Os 
FAIL: gcc.c-torture/execute/ieee/20010226-1.c execution,  -O0 
FAIL: gcc.c-torture/execute/ieee/20010226-1.c execution,  -O1 
FAIL: gcc.c-torture/execute/ieee/20010226-1.c execution,  -O2 
FAIL: gcc.c-torture/execute/ieee/20010226-1.c execution,  -O3 -fomit-frame-pointer 
FAIL: gcc.c-torture/execute/ieee/20010226-1.c execution,  -O3 -g 
FAIL: gcc.c-torture/execute/ieee/20010226-1.c execution,  -Os 
FAIL: gcc.c-torture/execute/ieee/20041213-1.c compilation,  -O0 
UNRESOLVED: gcc.c-torture/execute/ieee/20041213-1.c execution,  -O0 
FAIL: gcc.c-torture/execute/ieee/20041213-1.c compilation,  -O1 
UNRESOLVED: gcc.c-torture/execute/ieee/20041213-1.c execution,  -O1 
FAIL: gcc.c-torture/execute/ieee/20041213-1.c compilation,  -O2 
UNRESOLVED: gcc.c-torture/execute/ieee/20041213-1.c execution,  -O2 
FAIL: gcc.c-torture/execute/ieee/20041213-1.c compilation,  -O3 -fomit-frame-pointer 
UNRESOLVED: gcc.c-torture/execute/ieee/20041213-1.c execution,  -O3 -fomit-frame-pointer 
FAIL: gcc.c-torture/execute/ieee/20041213-1.c compilation,  -O3 -g 
UNRESOLVED: gcc.c-torture/execute/ieee/20041213-1.c execution,  -O3 -g 
FAIL: gcc.c-torture/execute/ieee/20041213-1.c compilation,  -Os 
UNRESOLVED: gcc.c-torture/execute/ieee/20041213-1.c execution,  -Os 
UNRESOLVED: gcc.c-torture/execute/ieee/920810-1.c execution,  -O0 
UNRESOLVED: gcc.c-torture/execute/ieee/920810-1.c execution,  -O1 
UNRESOLVED: gcc.c-torture/execute/ieee/920810-1.c execution,  -O2 
UNRESOLVED: gcc.c-torture/execute/ieee/920810-1.c execution,  -O3 -fomit-frame-pointer 
UNRESOLVED: gcc.c-torture/execute/ieee/920810-1.c execution,  -O3 -g 
UNRESOLVED: gcc.c-torture/execute/ieee/920810-1.c execution,  -Os 
FAIL: gcc.c-torture/execute/ieee/acc1.c execution,  -O0 
FAIL: gcc.c-torture/execute/ieee/acc1.c execution,  -O1 
FAIL: gcc.c-torture/execute/ieee/acc1.c execution,  -O2 
FAIL: gcc.c-torture/execute/ieee/acc1.c execution,  -O3 -fomit-frame-pointer 
FAIL: gcc.c-torture/execute/ieee/acc1.c execution,  -O3 -g 
FAIL: gcc.c-torture/execute/ieee/acc1.c execution,  -Os 
FAIL: gcc.c-torture/execute/ieee/acc2.c execution,  -O0 
FAIL: gcc.c-torture/execute/ieee/acc2.c execution,  -O1 
FAIL: gcc.c-torture/execute/ieee/acc2.c execution,  -O2 
FAIL: gcc.c-torture/execute/ieee/acc2.c execution,  -O3 -fomit-frame-pointer 
FAIL: gcc.c-torture/execute/ieee/acc2.c execution,  -O3 -g 
FAIL: gcc.c-torture/execute/ieee/acc2.c execution,  -Os 
FAIL: gcc.c-torture/execute/ieee/mzero2.c execution,  -O0 
FAIL: gcc.c-torture/execute/ieee/mzero2.c execution,  -O1 
FAIL: gcc.c-torture/execute/ieee/mzero6.c execution,  -O0 
FAIL: gcc.c-torture/execute/ieee/mzero6.c execution,  -O1 
FAIL: gcc.c-torture/execute/ieee/mzero6.c execution,  -O2 
FAIL: gcc.c-torture/execute/ieee/mzero6.c execution,  -O3 -fomit-frame-pointer 
FAIL: gcc.c-torture/execute/ieee/mzero6.c execution,  -O3 -fomit-frame-pointer -funroll-loops 
FAIL: gcc.c-torture/execute/ieee/mzero6.c execution,  -O3 -fomit-frame-pointer -funroll-all-loops -finline-functions 
FAIL: gcc.c-torture/execute/ieee/mzero6.c execution,  -O3 -g 
FAIL: gcc.c-torture/execute/ieee/mzero6.c execution,  -Os 
FAIL: gcc.c-torture/execute/ieee/rbug.c execution,  -O0 
FAIL: gcc.c-torture/execute/ieee/rbug.c execution,  -O1 
FAIL: gcc.c-torture/execute/ieee/rbug.c execution,  -O2 
FAIL: gcc.c-torture/execute/ieee/rbug.c execution,  -Os 
FAIL: gcc.c-torture/execute/ieee/unsafe-fp-assoc-1.c execution,  -O0 
FAIL: gcc.c-torture/execute/ieee/unsafe-fp-assoc-1.c execution,  -O1 
FAIL: gcc.c-torture/execute/ieee/unsafe-fp-assoc-1.c execution,  -O2 
FAIL: gcc.c-torture/execute/ieee/unsafe-fp-assoc-1.c execution,  -Os 
FAIL: gcc.dg/compat/fnptr-by-value-1 c_compat_x_tst.o-c_compat_y_tst.o execute 
UNRESOLVED: gcc.dg/compat/scalar-by-value-1 c_compat_x_tst.o-c_compat_y_tst.o execute 
FAIL: gcc.dg/compat/scalar-by-value-2 c_compat_x_tst.o-c_compat_y_tst.o execute 
UNRESOLVED: gcc.dg/compat/scalar-by-value-3 c_compat_x_tst.o-c_compat_y_tst.o execute 
FAIL: gcc.dg/compat/scalar-by-value-4 c_compat_x_tst.o compile
FAIL: gcc.dg/compat/scalar-by-value-4 c_compat_y_tst.o compile
UNRESOLVED: gcc.dg/compat/scalar-by-value-4 c_compat_x_tst.o-c_compat_y_tst.o link 
UNRESOLVED: gcc.dg/compat/scalar-by-value-4 c_compat_x_tst.o-c_compat_y_tst.o execute 
FAIL: gcc.dg/compat/scalar-return-1 c_compat_x_tst.o-c_compat_y_tst.o execute 
UNRESOLVED: gcc.dg/compat/scalar-return-3 c_compat_x_tst.o-c_compat_y_tst.o execute 
FAIL: gcc.dg/compat/scalar-return-4 c_compat_x_tst.o compile
FAIL: gcc.dg/compat/scalar-return-4 c_compat_y_tst.o compile
UNRESOLVED: gcc.dg/compat/scalar-return-4 c_compat_x_tst.o-c_compat_y_tst.o link 
UNRESOLVED: gcc.dg/compat/scalar-return-4 c_compat_x_tst.o-c_compat_y_tst.o execute 
UNRESOLVED: gcc.dg/compat/struct-by-value-10 c_compat_x_tst.o-c_compat_y_tst.o execute 
FAIL: gcc.dg/compat/struct-by-value-11 c_compat_y_tst.o compile
UNRESOLVED: gcc.dg/compat/struct-by-value-11 c_compat_x_tst.o-c_compat_y_tst.o link 
UNRESOLVED: gcc.dg/compat/struct-by-value-11 c_compat_x_tst.o-c_compat_y_tst.o execute 
UNRESOLVED: gcc.dg/compat/struct-by-value-12 c_compat_x_tst.o-c_compat_y_tst.o execute 
UNRESOLVED: gcc.dg/compat/struct-by-value-13 c_compat_x_tst.o-c_compat_y_tst.o execute 
UNRESOLVED: gcc.dg/compat/struct-by-value-14 c_compat_x_tst.o-c_compat_y_tst.o execute 
UNRESOLVED: gcc.dg/compat/struct-by-value-15 c_compat_x_tst.o-c_compat_y_tst.o execute 
UNRESOLVED: gcc.dg/compat/struct-by-value-16 c_compat_x_tst.o-c_compat_y_tst.o execute 
UNRESOLVED: gcc.dg/compat/struct-by-value-17 c_compat_x_tst.o-c_compat_y_tst.o execute 
UNRESOLVED: gcc.dg/compat/struct-by-value-18 c_compat_x_tst.o-c_compat_y_tst.o execute 
UNRESOLVED: gcc.dg/compat/struct-by-value-19 c_compat_x_tst.o-c_compat_y_tst.o execute 
UNRESOLVED: gcc.dg/compat/struct-by-value-1 c_compat_x_tst.o-c_compat_y_tst.o execute 
FAIL: gcc.dg/compat/struct-by-value-20 c_compat_x_tst.o-c_compat_y_tst.o execute 
UNRESOLVED: gcc.dg/compat/struct-by-value-21 c_compat_x_tst.o-c_compat_y_tst.o execute 
UNRESOLVED: gcc.dg/compat/struct-by-value-22 c_compat_x_tst.o-c_compat_y_tst.o execute 
UNRESOLVED: gcc.dg/compat/struct-by-value-2 c_compat_x_tst.o-c_compat_y_tst.o execute 
UNRESOLVED: gcc.dg/compat/struct-by-value-3 c_compat_x_tst.o-c_compat_y_tst.o execute 
UNRESOLVED: gcc.dg/compat/struct-by-value-4 c_compat_x_tst.o-c_compat_y_tst.o execute 
UNRESOLVED: gcc.dg/compat/struct-by-value-5a c_compat_x_tst.o-c_compat_y_tst.o execute 
UNRESOLVED: gcc.dg/compat/struct-by-value-5b c_compat_x_tst.o-c_compat_y_tst.o execute 
UNRESOLVED: gcc.dg/compat/struct-by-value-6a c_compat_x_tst.o-c_compat_y_tst.o execute 
UNRESOLVED: gcc.dg/compat/struct-by-value-6b c_compat_x_tst.o-c_compat_y_tst.o execute 
UNRESOLVED: gcc.dg/compat/struct-by-value-7a c_compat_x_tst.o-c_compat_y_tst.o execute 
UNRESOLVED: gcc.dg/compat/struct-by-value-7b c_compat_x_tst.o-c_compat_y_tst.o execute 
UNRESOLVED: gcc.dg/compat/struct-by-value-8 c_compat_x_tst.o-c_compat_y_tst.o execute 
UNRESOLVED: gcc.dg/compat/struct-by-value-9 c_compat_x_tst.o-c_compat_y_tst.o execute 
FAIL: gcc.dg/compat/struct-layout-1 c_compat_x_tst.o-c_compat_y_tst.o execute 
UNRESOLVED: gcc.dg/compat/struct-return-10 c_compat_x_tst.o-c_compat_y_tst.o execute 
UNRESOLVED: gcc.dg/compat/struct-return-19 c_compat_x_tst.o-c_compat_y_tst.o execute 
UNRESOLVED: gcc.dg/compat/struct-return-2 c_compat_x_tst.o-c_compat_y_tst.o execute 
UNRESOLVED: gcc.dg/compat/union-by-value-1 c_compat_x_tst.o-c_compat_y_tst.o execute 
FAIL: gcc.dg/compat/vector-1 c_compat_x_tst.o-c_compat_y_tst.o execute 
FAIL: gcc.dg/compat/vector-2 c_compat_x_tst.o-c_compat_y_tst.o execute 
UNRESOLVED: tmpdir-gcc.dg-struct-layout-1/t001 c_compat_x_tst.o-c_compat_y_tst.o execute 
UNRESOLVED: tmpdir-gcc.dg-struct-layout-1/t002 c_compat_x_tst.o-c_compat_y_tst.o execute 
UNRESOLVED: tmpdir-gcc.dg-struct-layout-1/t003 c_compat_x_tst.o-c_compat_y_tst.o execute 
UNRESOLVED: tmpdir-gcc.dg-struct-layout-1/t004 c_compat_x_tst.o-c_compat_y_tst.o execute 
UNRESOLVED: tmpdir-gcc.dg-struct-layout-1/t005 c_compat_x_tst.o-c_compat_y_tst.o execute 
UNRESOLVED: tmpdir-gcc.dg-struct-layout-1/t006 c_compat_x_tst.o-c_compat_y_tst.o execute 
UNRESOLVED: tmpdir-gcc.dg-struct-layout-1/t007 c_compat_x_tst.o-c_compat_y_tst.o execute 
UNRESOLVED: tmpdir-gcc.dg-struct-layout-1/t008 c_compat_x_tst.o-c_compat_y_tst.o execute 
UNRESOLVED: tmpdir-gcc.dg-struct-layout-1/t009 c_compat_x_tst.o-c_compat_y_tst.o execute 
UNRESOLVED: tmpdir-gcc.dg-struct-layout-1/t010 c_compat_x_tst.o-c_compat_y_tst.o execute 
UNRESOLVED: tmpdir-gcc.dg-struct-layout-1/t011 c_compat_x_tst.o-c_compat_y_tst.o execute 
UNRESOLVED: tmpdir-gcc.dg-struct-layout-1/t012 c_compat_x_tst.o-c_compat_y_tst.o execute 
UNRESOLVED: tmpdir-gcc.dg-struct-layout-1/t013 c_compat_x_tst.o-c_compat_y_tst.o execute 
UNRESOLVED: tmpdir-gcc.dg-struct-layout-1/t014 c_compat_x_tst.o-c_compat_y_tst.o execute 
UNRESOLVED: tmpdir-gcc.dg-struct-layout-1/t015 c_compat_x_tst.o-c_compat_y_tst.o execute 
UNRESOLVED: tmpdir-gcc.dg-struct-layout-1/t016 c_compat_x_tst.o-c_compat_y_tst.o execute 
UNRESOLVED: tmpdir-gcc.dg-struct-layout-1/t017 c_compat_x_tst.o-c_compat_y_tst.o execute 
UNRESOLVED: tmpdir-gcc.dg-struct-layout-1/t018 c_compat_x_tst.o-c_compat_y_tst.o execute 
UNRESOLVED: tmpdir-gcc.dg-struct-layout-1/t019 c_compat_x_tst.o-c_compat_y_tst.o execute 
UNRESOLVED: tmpdir-gcc.dg-struct-layout-1/t020 c_compat_x_tst.o-c_compat_y_tst.o execute 
UNRESOLVED: tmpdir-gcc.dg-struct-layout-1/t021 c_compat_x_tst.o-c_compat_y_tst.o execute 
UNRESOLVED: tmpdir-gcc.dg-struct-layout-1/t022 c_compat_x_tst.o-c_compat_y_tst.o execute 
UNRESOLVED: tmpdir-gcc.dg-struct-layout-1/t023 c_compat_x_tst.o-c_compat_y_tst.o execute 
UNRESOLVED: tmpdir-gcc.dg-struct-layout-1/t024 c_compat_x_tst.o-c_compat_y_tst.o execute 
UNRESOLVED: tmpdir-gcc.dg-struct-layout-1/t025 c_compat_x_tst.o-c_compat_y_tst.o execute 
UNRESOLVED: tmpdir-gcc.dg-struct-layout-1/t026 c_compat_x_tst.o-c_compat_y_tst.o execute 
UNRESOLVED: tmpdir-gcc.dg-struct-layout-1/t027 c_compat_x_tst.o-c_compat_y_tst.o execute 
UNRESOLVED: tmpdir-gcc.dg-struct-layout-1/t028 c_compat_x_tst.o-c_compat_y_tst.o execute 
FAIL: gcc.dg/20001117-1.c execution test
FAIL: gcc.dg/20020219-1.c (test for excess errors)
WARNING: gcc.dg/20020219-1.c compilation failed to produce executable
FAIL: gcc.dg/20021014-1.c (test for excess errors)
WARNING: gcc.dg/20021014-1.c compilation failed to produce executable
FAIL: gcc.dg/20030826-1.c execution test
FAIL: gcc.dg/20050321-1.c (test for excess errors)
FAIL: gcc.dg/Wpadded.c  (test for warnings, line 10)
FAIL: gcc.dg/builtin-apply3.c (test for excess errors)
WARNING: gcc.dg/builtin-apply3.c compilation failed to produce executable
FAIL: gcc.dg/builtins-1.c (internal compiler error)
FAIL: gcc.dg/builtins-1.c (test for excess errors)
ERROR: gcc.dg/builtins-1.c: error executing dg-final: couldn't open "builtins-1.s": no such file or directory
UNRESOLVED: gcc.dg/builtins-1.c: error executing dg-final: couldn't open "builtins-1.s": no such file or directory
FAIL: gcc.dg/builtins-24.c execution test
FAIL: gcc.dg/builtins-32.c (internal compiler error)
FAIL: gcc.dg/builtins-32.c (test for excess errors)
WARNING: gcc.dg/builtins-32.c compilation failed to produce executable
FAIL: gcc.dg/builtins-48.c execution test
FAIL: gcc.dg/builtins-49.c execution test
FAIL: gcc.dg/builtins-50.c execution test
FAIL: gcc.dg/builtins-51.c execution test
FAIL: gcc.dg/c90-const-expr-2.c (test for excess errors)
FAIL: gcc.dg/c99-const-expr-2.c (test for excess errors)
FAIL: gcc.dg/complex-3.c execution test
FAIL: gcc.dg/fold-overflow-1.c scan-assembler-times 2139095040 2
FAIL: gcc.dg/funcorder.c scan-assembler-not link_error
FAIL: gcc.dg/inline-1.c scan-assembler-not xyzzy
FAIL: gcc.dg/large-size-array-2.c (internal compiler error)
FAIL: gcc.dg/large-size-array-2.c (test for excess errors)
FAIL: gcc.dg/max-1.c (test for excess errors)
FAIL: gcc.dg/nest.c (test for excess errors)
WARNING: gcc.dg/nest.c compilation failed to produce executable
FAIL: gcc.dg/nested-func-4.c (test for excess errors)
WARNING: gcc.dg/nested-func-4.c compilation failed to produce executable
FAIL: gcc.dg/pr18241-1.c (test for excess errors)
FAIL: gcc.dg/pr18241-2.c (test for excess errors)
FAIL: gcc.dg/pr19340.c (test for excess errors)
FAIL: gcc.dg/pr19402-2.c execution test
FAIL: gcc.dg/pr26719.c (test for excess errors)
WARNING: gcc.dg/pr26719.c compilation failed to produce executable
FAIL: gcc.dg/pr27639.c (test for excess errors)
FAIL: gcc.dg/pr28243.c (test for excess errors)
FAIL: gcc.dg/pr28726.c execution test
FAIL: gcc.dg/redecl-4.c (test for excess errors)
FAIL: gcc.dg/trampoline-1.c execution test
FAIL: gcc.dg/ultrasp4.c (test for excess errors)
FAIL: gcc.dg/varpool-1.c (internal compiler error)
FAIL: gcc.dg/varpool-1.c (test for excess errors)
ERROR: gcc.dg/varpool-1.c: error executing dg-final: couldn't open "varpool-1.s": no such file or directory
UNRESOLVED: gcc.dg/varpool-1.c: error executing dg-final: couldn't open "varpool-1.s": no such file or directory
FAIL: gcc.dg/torture/pr26587.c  -O3 -fomit-frame-pointer  (internal compiler error)
FAIL: gcc.dg/torture/pr26587.c  -O3 -fomit-frame-pointer  (test for excess errors)
WARNING: gcc.dg/torture/pr26587.c  -O3 -fomit-frame-pointer  compilation failed to produce executable
FAIL: gcc.dg/torture/pr26587.c  -O3 -fomit-frame-pointer -funroll-loops  (internal compiler error)
FAIL: gcc.dg/torture/pr26587.c  -O3 -fomit-frame-pointer -funroll-loops  (test for excess errors)
WARNING: gcc.dg/torture/pr26587.c  -O3 -fomit-frame-pointer -funroll-loops  compilation failed to produce executable
FAIL: gcc.dg/torture/pr26587.c  -O3 -fomit-frame-pointer -funroll-all-loops -finline-functions  (internal compiler error)
FAIL: gcc.dg/torture/pr26587.c  -O3 -fomit-frame-pointer -funroll-all-loops -finline-functions  (test for excess errors)
WARNING: gcc.dg/torture/pr26587.c  -O3 -fomit-frame-pointer -funroll-all-loops -finline-functions  compilation failed to produce executable
FAIL: gcc.dg/torture/pr26587.c  -O3 -g  (internal compiler error)
FAIL: gcc.dg/torture/pr26587.c  -O3 -g  (test for excess errors)
WARNING: gcc.dg/torture/pr26587.c  -O3 -g  compilation failed to produce executable
FAIL: gcc.dg/torture/pr28814.c  -O0  (test for excess errors)
FAIL: gcc.dg/torture/pr28814.c  -O1  (test for excess errors)
FAIL: gcc.dg/torture/pr28814.c  -O2  (test for excess errors)
FAIL: gcc.dg/torture/pr28814.c  -O3 -fomit-frame-pointer  (test for excess errors)
FAIL: gcc.dg/torture/pr28814.c  -O3 -g  (test for excess errors)
FAIL: gcc.dg/torture/pr28814.c  -Os  (test for excess errors)
FAIL: gcc.dg/torture/pr29584.c  -O0  (test for excess errors)
FAIL: gcc.dg/torture/pr29584.c  -O1  (test for excess errors)
FAIL: gcc.dg/torture/pr29584.c  -O2  (test for excess errors)
FAIL: gcc.dg/torture/pr29584.c  -O3 -fomit-frame-pointer  (test for excess errors)
FAIL: gcc.dg/torture/pr29584.c  -O3 -fomit-frame-pointer -funroll-loops  (test for excess errors)
FAIL: gcc.dg/torture/pr29584.c  -O3 -fomit-frame-pointer -funroll-all-loops -finline-functions  (test for excess errors)
FAIL: gcc.dg/torture/pr29584.c  -O3 -g  (test for excess errors)
FAIL: gcc.dg/torture/pr29584.c  -Os  (test for excess errors)
FAIL: gcc.dg/tree-prof/inliner-1.c compilation,  -fprofile-generate
UNRESOLVED: gcc.dg/tree-prof/inliner-1.c execution,    -fprofile-generate
UNRESOLVED: gcc.dg/tree-prof/inliner-1.c compilation,  -fprofile-use
UNRESOLVED: gcc.dg/tree-prof/inliner-1.c execution,    -fprofile-use
FAIL: gcc.dg/tree-prof/update-cunroll-2.c execution: file update-cunroll-2.gcda does not exist,  -fprofile-generate
UNRESOLVED: gcc.dg/tree-prof/update-cunroll-2.c compilation,  -fprofile-use
UNRESOLVED: gcc.dg/tree-prof/update-cunroll-2.c execution,    -fprofile-use
FAIL: gcc.dg/tree-prof/update-loopch.c execution: file update-loopch.gcda does not exist,  -fprofile-generate
UNRESOLVED: gcc.dg/tree-prof/update-loopch.c compilation,  -fprofile-use
UNRESOLVED: gcc.dg/tree-prof/update-loopch.c execution,    -fprofile-use
FAIL: gcc.dg/tree-prof/update-tailcall.c execution: file update-tailcall.gcda does not exist,  -fprofile-generate
UNRESOLVED: gcc.dg/tree-prof/update-tailcall.c compilation,  -fprofile-use
UNRESOLVED: gcc.dg/tree-prof/update-tailcall.c execution,    -fprofile-use
UNRESOLVED: gcc.dg/tree-prof/val-prof-1.c execution,    -fprofile-generate
UNRESOLVED: gcc.dg/tree-prof/val-prof-1.c compilation,  -fprofile-use
UNRESOLVED: gcc.dg/tree-prof/val-prof-1.c execution,    -fprofile-use
UNRESOLVED: gcc.dg/tree-prof/val-prof-2.c execution,    -fprofile-generate
UNRESOLVED: gcc.dg/tree-prof/val-prof-2.c compilation,  -fprofile-use
UNRESOLVED: gcc.dg/tree-prof/val-prof-2.c execution,    -fprofile-use
UNRESOLVED: gcc.dg/tree-prof/val-prof-3.c execution,    -fprofile-generate
UNRESOLVED: gcc.dg/tree-prof/val-prof-3.c compilation,  -fprofile-use
UNRESOLVED: gcc.dg/tree-prof/val-prof-3.c execution,    -fprofile-use
UNRESOLVED: gcc.dg/tree-prof/val-prof-4.c execution,    -fprofile-generate
UNRESOLVED: gcc.dg/tree-prof/val-prof-4.c compilation,  -fprofile-use
UNRESOLVED: gcc.dg/tree-prof/val-prof-4.c execution,    -fprofile-use
UNRESOLVED: gcc.dg/tree-prof/val-prof-5.c execution,    -fprofile-generate
UNRESOLVED: gcc.dg/tree-prof/val-prof-5.c compilation,  -fprofile-use
UNRESOLVED: gcc.dg/tree-prof/val-prof-5.c execution,    -fprofile-use
XPASS: gcc.dg/tree-ssa/20040204-1.c scan-tree-dump-times link_error 0
FAIL: gcc.dg/tree-ssa/foldaddr-1.c (test for excess errors)
FAIL: gcc.dg/tree-ssa/foldaddr-1.c scan-tree-dump-times return 0 1
FAIL: gcc.dg/tree-ssa/gen-vect-11.c scan-tree-dump-times vectorized 1 loops 1
FAIL: gcc.dg/tree-ssa/gen-vect-11a.c scan-tree-dump-times vectorized 1 loops 1
FAIL: gcc.dg/tree-ssa/gen-vect-11b.c execution test
FAIL: gcc.dg/tree-ssa/gen-vect-2.c scan-tree-dump-times vectorized 1 loops 1
FAIL: gcc.dg/tree-ssa/gen-vect-25.c execution test
FAIL: gcc.dg/tree-ssa/gen-vect-25.c scan-tree-dump-times vectorized 2 loops 1
FAIL: gcc.dg/tree-ssa/gen-vect-26.c scan-tree-dump-times vectorized 1 loops 1
FAIL: gcc.dg/tree-ssa/gen-vect-26.c scan-tree-dump-times Alignment of access forced using peeling 1
FAIL: gcc.dg/tree-ssa/gen-vect-28.c scan-tree-dump-times vectorized 1 loops 1
FAIL: gcc.dg/tree-ssa/gen-vect-28.c scan-tree-dump-times Alignment of access forced using peeling 1
FAIL: gcc.dg/tree-ssa/gen-vect-32.c scan-tree-dump-times vectorized 1 loops 1
FAIL: gcc.dg/tree-ssa/loop-1.c scan-assembler-times foo 5
FAIL: gcc.dg/tree-ssa/loop-2.c (test for excess errors)
ERROR: gcc.dg/tree-ssa/loop-2.c: error executing dg-final: no files matched glob pattern "loop-2.c.t[0-9][0-9].vars"
UNRESOLVED: gcc.dg/tree-ssa/loop-2.c: error executing dg-final: no files matched glob pattern "loop-2.c.t[0-9][0-9].vars"
FAIL: gcc.dg/tree-ssa/loop-4.c (test for excess errors)
ERROR: gcc.dg/tree-ssa/loop-4.c: error executing dg-final: no files matched glob pattern "loop-4.c.t[0-9][0-9].vars"
UNRESOLVED: gcc.dg/tree-ssa/loop-4.c: error executing dg-final: no files matched glob pattern "loop-4.c.t[0-9][0-9].vars"
FAIL: gcc.dg/tree-ssa/ltrans-1.c (test for excess errors)
ERROR: gcc.dg/tree-ssa/ltrans-1.c: error executing dg-final: no files matched glob pattern "ltrans-1.c.t[0-9][0-9].ltrans"
UNRESOLVED: gcc.dg/tree-ssa/ltrans-1.c: error executing dg-final: no files matched glob pattern "ltrans-1.c.t[0-9][0-9].ltrans"
FAIL: gcc.dg/tree-ssa/ltrans-2.c (test for excess errors)
FAIL: gcc.dg/tree-ssa/ltrans-3.c (test for excess errors)
ERROR: gcc.dg/tree-ssa/ltrans-3.c: error executing dg-final: no files matched glob pattern "ltrans-3.c.t[0-9][0-9].ltrans"
UNRESOLVED: gcc.dg/tree-ssa/ltrans-3.c: error executing dg-final: no files matched glob pattern "ltrans-3.c.t[0-9][0-9].ltrans"
FAIL: gcc.dg/tree-ssa/ltrans-4.c (test for excess errors)
ERROR: gcc.dg/tree-ssa/ltrans-4.c: error executing dg-final: no files matched glob pattern "ltrans-4.c.t[0-9][0-9].ltrans"
UNRESOLVED: gcc.dg/tree-ssa/ltrans-4.c: error executing dg-final: no files matched glob pattern "ltrans-4.c.t[0-9][0-9].ltrans"
FAIL: gcc.dg/tree-ssa/ltrans-8.c scan-tree-dump-times transformed loop 1
FAIL: gcc.dg/tree-ssa/pr15791-5.c scan-tree-dump-times i == j 1
FAIL: gcc.dg/tree-ssa/pr22051-2.c scan-tree-dump-times if \\(\\(int\\).*q 1
FAIL: gcc.dg/tree-ssa/pr23382.c (test for excess errors)
FAIL: gcc.dg/tree-ssa/scev-2.c execution test
FAIL: gcc.dg/tree-ssa/ssa-pre-8.c scan-tree-dump-times Eliminated: 4 1
FAIL: gcc.misc-tests/bprob-1.c execution: file bprob-1.gcda does not exist,  -fprofile-arcs
UNRESOLVED: gcc.misc-tests/bprob-1.c compilation,  -fbranch-probabilities
UNRESOLVED: gcc.misc-tests/bprob-1.c execution,    -fbranch-probabilities
FAIL: gcc.misc-tests/bprob-2.c execution: file bprob-2.gcda does not exist,  -fprofile-arcs
UNRESOLVED: gcc.misc-tests/bprob-2.c compilation,  -fbranch-probabilities
UNRESOLVED: gcc.misc-tests/bprob-2.c execution,    -fbranch-probabilities

		=== gcc Summary ===

# of expected passes		36281
# of unexpected failures	509
# of unexpected successes	1
# of expected failures		77
# of unresolved testcases	432
# of untested testcases		28
# of unsupported tests		778
/home/mstein/sim/m68hc11-elf/build/gcc/xgcc  version 4.1.3 20070216 (prerelease)


Compiler version: 4.1.3 20070216 (prerelease) gcc 
Platform: m68hc11-unknown-none
configure flags: --target=m68hc11-elf --prefix=/n/07/mstein/cross-local/m68hc11-elf --disable-nls --disable-build-warnings --with-ld=/n/07/mstein/cross-local/m68hc11-elf/bin/m68hc11-elf-ld --with-as=/n/07/mstein/cross-local/m68hc11-elf/bin/m68hc11-elf-as --disable-libssp --enable-languages=c


Index Nav: [Date Index] [Subject Index] [Author Index] [Thread Index]
Message Nav: [Date Prev] [Date Next] [Thread Prev] [Thread Next]