This is the mail archive of the gcc-testresults@gcc.gnu.org mailing list for the GCC project.


Index Nav: [Date Index] [Subject Index] [Author Index] [Thread Index]
Message Nav: [Date Prev] [Date Next] [Thread Prev] [Thread Next]
Other format: [Raw text]

Results for 4.0.3 20060207 (prerelease) testsuite on sparc-sun-solaris2.10


LAST_UPDATED: 
Native configuration is sparc-sun-solaris2.10

		=== g++ tests ===


Running target unix

		=== g++ Summary ===

# of expected passes		11313
# of expected failures		70
# of unsupported tests		120
/caip/u12/kishgcc/gcc-testing/gcc-testing/40/build/gcc/testsuite/../g++  version 4.0.3 20060207 (prerelease)

		=== gcc tests ===


Running target unix
FAIL: gcc.c-torture/compile/20020701-1.c  -O0  (test for excess errors)
FAIL: gcc.c-torture/compile/20020701-1.c  -O1  (test for excess errors)
FAIL: gcc.c-torture/compile/20020701-1.c  -O2  (test for excess errors)
FAIL: gcc.c-torture/compile/20020701-1.c  -O3 -fomit-frame-pointer  (test for excess errors)
FAIL: gcc.c-torture/compile/20020701-1.c  -O3 -fomit-frame-pointer -funroll-loops  (test for excess errors)
FAIL: gcc.c-torture/compile/20020701-1.c  -O3 -fomit-frame-pointer -funroll-all-loops -finline-functions  (test for excess errors)
FAIL: gcc.c-torture/compile/20020701-1.c  -O3 -g  (test for excess errors)
FAIL: gcc.c-torture/compile/20020701-1.c  -Os  (test for excess errors)
FAIL: gcc.c-torture/compile/20021108-1.c  -O0  (test for excess errors)
FAIL: gcc.c-torture/compile/20021108-1.c  -O1  (test for excess errors)
FAIL: gcc.c-torture/compile/20021108-1.c  -O2  (test for excess errors)
FAIL: gcc.c-torture/compile/20021108-1.c  -O3 -fomit-frame-pointer  (test for excess errors)
FAIL: gcc.c-torture/compile/20021108-1.c  -O3 -g  (test for excess errors)
FAIL: gcc.c-torture/compile/20021108-1.c  -Os  (test for excess errors)
FAIL: gcc.c-torture/compile/920501-7.c  -O0  (test for excess errors)
FAIL: gcc.c-torture/compile/920501-7.c  -O1  (test for excess errors)
FAIL: gcc.c-torture/compile/920501-7.c  -O2  (test for excess errors)
FAIL: gcc.c-torture/compile/920501-7.c  -O3 -fomit-frame-pointer  (test for excess errors)
FAIL: gcc.c-torture/compile/920501-7.c  -O3 -g  (test for excess errors)
FAIL: gcc.c-torture/compile/920501-7.c  -Os  (test for excess errors)
FAIL: gcc.c-torture/compile/labels-1.c  -O0  (test for excess errors)
FAIL: gcc.c-torture/compile/labels-1.c  -O1  (test for excess errors)
FAIL: gcc.c-torture/compile/labels-1.c  -O2  (test for excess errors)
FAIL: gcc.c-torture/compile/labels-1.c  -O3 -fomit-frame-pointer  (test for excess errors)
FAIL: gcc.c-torture/compile/labels-1.c  -O3 -g  (test for excess errors)
FAIL: gcc.c-torture/compile/labels-1.c  -Os  (test for excess errors)
FAIL: gcc.c-torture/compile/labels-2.c  -O0  (test for excess errors)
FAIL: gcc.c-torture/compile/labels-2.c  -O1  (test for excess errors)
FAIL: gcc.c-torture/compile/labels-2.c  -O2  (test for excess errors)
FAIL: gcc.c-torture/compile/labels-2.c  -O3 -fomit-frame-pointer  (test for excess errors)
FAIL: gcc.c-torture/compile/labels-2.c  -O3 -g  (test for excess errors)
FAIL: gcc.c-torture/compile/labels-2.c  -Os  (test for excess errors)
FAIL: gcc.c-torture/compile/labels-3.c  -O0  (test for excess errors)
FAIL: gcc.c-torture/compile/labels-3.c  -O1  (test for excess errors)
FAIL: gcc.c-torture/compile/labels-3.c  -O2  (test for excess errors)
FAIL: gcc.c-torture/compile/labels-3.c  -O3 -fomit-frame-pointer  (test for excess errors)
FAIL: gcc.c-torture/compile/labels-3.c  -O3 -g  (test for excess errors)
FAIL: gcc.c-torture/compile/labels-3.c  -Os  (test for excess errors)
FAIL: gcc.c-torture/execute/builtins/memmove-2.c compilation,  -O0 
UNRESOLVED: gcc.c-torture/execute/builtins/memmove-2.c execution,  -O0 
FAIL: gcc.c-torture/execute/builtins/memmove-2.c compilation,  -O1 
UNRESOLVED: gcc.c-torture/execute/builtins/memmove-2.c execution,  -O1 
FAIL: gcc.c-torture/execute/builtins/memmove-2.c compilation,  -O2 
UNRESOLVED: gcc.c-torture/execute/builtins/memmove-2.c execution,  -O2 
FAIL: gcc.c-torture/execute/builtins/memmove-2.c compilation,  -O3 -fomit-frame-pointer 
UNRESOLVED: gcc.c-torture/execute/builtins/memmove-2.c execution,  -O3 -fomit-frame-pointer 
FAIL: gcc.c-torture/execute/builtins/memmove-2.c compilation,  -O3 -g 
UNRESOLVED: gcc.c-torture/execute/builtins/memmove-2.c execution,  -O3 -g 
FAIL: gcc.c-torture/execute/builtins/memmove-2.c compilation,  -Os 
UNRESOLVED: gcc.c-torture/execute/builtins/memmove-2.c execution,  -Os 
FAIL: gcc.c-torture/execute/builtins/strcat.c compilation,  -O0 
UNRESOLVED: gcc.c-torture/execute/builtins/strcat.c execution,  -O0 
FAIL: gcc.c-torture/execute/builtins/strcat.c compilation,  -O1 
UNRESOLVED: gcc.c-torture/execute/builtins/strcat.c execution,  -O1 
FAIL: gcc.c-torture/execute/builtins/strcat.c compilation,  -O2 
UNRESOLVED: gcc.c-torture/execute/builtins/strcat.c execution,  -O2 
FAIL: gcc.c-torture/execute/builtins/strcat.c compilation,  -O3 -fomit-frame-pointer 
UNRESOLVED: gcc.c-torture/execute/builtins/strcat.c execution,  -O3 -fomit-frame-pointer 
FAIL: gcc.c-torture/execute/builtins/strcat.c compilation,  -O3 -fomit-frame-pointer -funroll-loops 
UNRESOLVED: gcc.c-torture/execute/builtins/strcat.c execution,  -O3 -fomit-frame-pointer -funroll-loops 
FAIL: gcc.c-torture/execute/builtins/strcat.c compilation,  -O3 -fomit-frame-pointer -funroll-all-loops -finline-functions 
UNRESOLVED: gcc.c-torture/execute/builtins/strcat.c execution,  -O3 -fomit-frame-pointer -funroll-all-loops -finline-functions 
FAIL: gcc.c-torture/execute/builtins/strcat.c compilation,  -O3 -g 
UNRESOLVED: gcc.c-torture/execute/builtins/strcat.c execution,  -O3 -g 
FAIL: gcc.c-torture/execute/builtins/strcat.c compilation,  -Os 
UNRESOLVED: gcc.c-torture/execute/builtins/strcat.c execution,  -Os 
FAIL: gcc.c-torture/execute/builtins/strncat.c compilation,  -O0 
UNRESOLVED: gcc.c-torture/execute/builtins/strncat.c execution,  -O0 
FAIL: gcc.c-torture/execute/builtins/strncat.c compilation,  -O1 
UNRESOLVED: gcc.c-torture/execute/builtins/strncat.c execution,  -O1 
FAIL: gcc.c-torture/execute/builtins/strncat.c compilation,  -O2 
UNRESOLVED: gcc.c-torture/execute/builtins/strncat.c execution,  -O2 
FAIL: gcc.c-torture/execute/builtins/strncat.c compilation,  -O3 -fomit-frame-pointer 
UNRESOLVED: gcc.c-torture/execute/builtins/strncat.c execution,  -O3 -fomit-frame-pointer 
FAIL: gcc.c-torture/execute/builtins/strncat.c compilation,  -O3 -g 
UNRESOLVED: gcc.c-torture/execute/builtins/strncat.c execution,  -O3 -g 
FAIL: gcc.c-torture/execute/builtins/strncat.c compilation,  -Os 
UNRESOLVED: gcc.c-torture/execute/builtins/strncat.c execution,  -Os 
FAIL: gcc.c-torture/execute/builtins/strncpy.c compilation,  -O0 
UNRESOLVED: gcc.c-torture/execute/builtins/strncpy.c execution,  -O0 
FAIL: gcc.c-torture/execute/builtins/strncpy.c compilation,  -O1 
UNRESOLVED: gcc.c-torture/execute/builtins/strncpy.c execution,  -O1 
FAIL: gcc.c-torture/execute/builtins/strncpy.c compilation,  -O2 
UNRESOLVED: gcc.c-torture/execute/builtins/strncpy.c execution,  -O2 
FAIL: gcc.c-torture/execute/builtins/strncpy.c compilation,  -O3 -fomit-frame-pointer 
UNRESOLVED: gcc.c-torture/execute/builtins/strncpy.c execution,  -O3 -fomit-frame-pointer 
FAIL: gcc.c-torture/execute/builtins/strncpy.c compilation,  -O3 -g 
UNRESOLVED: gcc.c-torture/execute/builtins/strncpy.c execution,  -O3 -g 
FAIL: gcc.c-torture/execute/builtins/strncpy.c compilation,  -Os 
UNRESOLVED: gcc.c-torture/execute/builtins/strncpy.c execution,  -Os 
FAIL: gcc.c-torture/execute/comp-goto-1.c compilation,  -O1 
UNRESOLVED: gcc.c-torture/execute/comp-goto-1.c execution,  -O1 
FAIL: gcc.c-torture/execute/comp-goto-1.c compilation,  -Os 
UNRESOLVED: gcc.c-torture/execute/comp-goto-1.c execution,  -Os 
FAIL: gcc.c-torture/execute/memcpy-bi.c compilation,  -O0 
UNRESOLVED: gcc.c-torture/execute/memcpy-bi.c execution,  -O0 
FAIL: gcc.c-torture/execute/memcpy-bi.c compilation,  -O1 
UNRESOLVED: gcc.c-torture/execute/memcpy-bi.c execution,  -O1 
FAIL: gcc.c-torture/execute/memcpy-bi.c compilation,  -O2 
UNRESOLVED: gcc.c-torture/execute/memcpy-bi.c execution,  -O2 
FAIL: gcc.c-torture/execute/memcpy-bi.c compilation,  -O3 -fomit-frame-pointer 
UNRESOLVED: gcc.c-torture/execute/memcpy-bi.c execution,  -O3 -fomit-frame-pointer 
FAIL: gcc.c-torture/execute/memcpy-bi.c compilation,  -O3 -fomit-frame-pointer -funroll-loops 
UNRESOLVED: gcc.c-torture/execute/memcpy-bi.c execution,  -O3 -fomit-frame-pointer -funroll-loops 
FAIL: gcc.c-torture/execute/memcpy-bi.c compilation,  -O3 -fomit-frame-pointer -funroll-all-loops -finline-functions 
UNRESOLVED: gcc.c-torture/execute/memcpy-bi.c execution,  -O3 -fomit-frame-pointer -funroll-all-loops -finline-functions 
FAIL: gcc.c-torture/execute/memcpy-bi.c compilation,  -O3 -g 
UNRESOLVED: gcc.c-torture/execute/memcpy-bi.c execution,  -O3 -g 
FAIL: gcc.c-torture/execute/memcpy-bi.c compilation,  -Os 
UNRESOLVED: gcc.c-torture/execute/memcpy-bi.c execution,  -Os 
FAIL: gcc.c-torture/execute/string-opt-18.c compilation,  -O0 
UNRESOLVED: gcc.c-torture/execute/string-opt-18.c execution,  -O0 
FAIL: gcc.c-torture/execute/string-opt-18.c compilation,  -O1 
UNRESOLVED: gcc.c-torture/execute/string-opt-18.c execution,  -O1 
FAIL: gcc.c-torture/execute/string-opt-18.c compilation,  -O2 
UNRESOLVED: gcc.c-torture/execute/string-opt-18.c execution,  -O2 
FAIL: gcc.c-torture/execute/string-opt-18.c compilation,  -O3 -fomit-frame-pointer 
UNRESOLVED: gcc.c-torture/execute/string-opt-18.c execution,  -O3 -fomit-frame-pointer 
FAIL: gcc.c-torture/execute/string-opt-18.c compilation,  -O3 -g 
UNRESOLVED: gcc.c-torture/execute/string-opt-18.c execution,  -O3 -g 
FAIL: gcc.c-torture/execute/string-opt-18.c compilation,  -Os 
UNRESOLVED: gcc.c-torture/execute/string-opt-18.c execution,  -Os 
FAIL: gcc.dg/20021029-1.c (test for excess errors)
ERROR: gcc.dg/20021029-1.c: error executing dg-final: couldn't open "20021029-1.s": no such file or directory
UNRESOLVED: gcc.dg/20021029-1.c: error executing dg-final: couldn't open "20021029-1.s": no such file or directory
FAIL: gcc.dg/builtins-10.c (test for excess errors)
FAIL: gcc.dg/builtins-2.c (test for excess errors)
FAIL: gcc.dg/builtins-21.c (test for excess errors)
FAIL: gcc.dg/builtins-26.c (test for excess errors)
FAIL: gcc.dg/builtins-47.c (test for excess errors)
WARNING: gcc.dg/builtins-47.c compilation failed to produce executable
ERROR: gcc.dg/builtins-47.c: error executing dg-final: no files matched glob pattern "builtins-47.c.t??.gimple"
UNRESOLVED: gcc.dg/builtins-47.c: error executing dg-final: no files matched glob pattern "builtins-47.c.t??.gimple"
FAIL: gcc.dg/builtins-52.c (test for excess errors)
FAIL: gcc.dg/builtins-7.c (test for excess errors)
FAIL: gcc.dg/pr16973.c (test for excess errors)
FAIL: gcc.dg/pr19402-1.c (test for excess errors)
ERROR: gcc.dg/pr19402-1.c: error executing dg-final: couldn't open "pr19402-1.s": no such file or directory
UNRESOLVED: gcc.dg/pr19402-1.c: error executing dg-final: couldn't open "pr19402-1.s": no such file or directory
FAIL: gcc.dg/unordered-1.c  (test for errors, line 16)
FAIL: gcc.dg/unordered-1.c  (test for errors, line 17)
FAIL: gcc.dg/unordered-1.c (test for excess errors)
FAIL: gcc.dg/tls/opt-11.c (test for excess errors)
WARNING: gcc.dg/tls/opt-11.c compilation failed to produce executable
FAIL: gcc.dg/torture/builtin-explog-1.c  -O0  (test for excess errors)
FAIL: gcc.dg/torture/builtin-explog-1.c  -O1  (test for excess errors)
FAIL: gcc.dg/torture/builtin-explog-1.c  -O2  (test for excess errors)
FAIL: gcc.dg/torture/builtin-explog-1.c  -O3 -fomit-frame-pointer  (test for excess errors)
FAIL: gcc.dg/torture/builtin-explog-1.c  -O3 -g  (test for excess errors)
FAIL: gcc.dg/torture/builtin-explog-1.c  -Os  (test for excess errors)
FAIL: gcc.dg/torture/builtin-integral-1.c  -O0  (test for excess errors)
FAIL: gcc.dg/torture/builtin-integral-1.c  -O1  (test for excess errors)
FAIL: gcc.dg/torture/builtin-integral-1.c  -O2  (test for excess errors)
FAIL: gcc.dg/torture/builtin-integral-1.c  -O3 -fomit-frame-pointer  (test for excess errors)
FAIL: gcc.dg/torture/builtin-integral-1.c  -O3 -g  (test for excess errors)
FAIL: gcc.dg/torture/builtin-integral-1.c  -Os  (test for excess errors)

		=== gcc Summary ===

# of expected passes		34792
# of unexpected failures	106
# of expected failures		95
# of unresolved testcases	45
# of untested testcases		28
# of unsupported tests		549
/caip/u12/kishgcc/gcc-testing/gcc-testing/40/build/gcc/xgcc  version 4.0.3 20060207 (prerelease)

		=== gfortran tests ===


Running target unix

		=== gfortran Summary ===

# of expected passes		8805
# of expected failures		1
# of unsupported tests		25
/caip/u12/kishgcc/gcc-testing/gcc-testing/40/build/gcc/testsuite/../gfortran  version 4.0.3 20060207 (prerelease)

		=== objc tests ===


Running target unix

		=== objc Summary ===

# of expected passes		1548
# of unsupported tests		10
/caip/u12/kishgcc/gcc-testing/gcc-testing/40/build/gcc/xgcc  version 4.0.3 20060207 (prerelease)

		=== treelang tests ===


Running target unix

		=== treelang Summary ===

# of expected passes		48
		=== libffi tests ===


Running target unix

		=== libffi Summary ===

# of expected passes		219
# of unsupported tests		2
		=== libjava tests ===


Running target unix
FAIL: Array_3 execution - gij test
FAIL: Array_3 execution - gij test
FAIL: FileHandleGcTest execution - source compiled test
FAIL: FileHandleGcTest execution - gij test
FAIL: FileHandleGcTest execution - bytecode->native test
FAIL: FileHandleGcTest -O3 execution - source compiled test
FAIL: FileHandleGcTest execution - gij test
FAIL: FileHandleGcTest -O3 execution - bytecode->native test

		=== libjava Summary ===

# of expected passes		3883
# of unexpected failures	8
# of expected failures		10
# of untested testcases		16
		=== libstdc++ tests ===


Running target unix
WARNING: program timed out.
FAIL: 22_locale/money_get/2.cc (test for excess errors)
WARNING: program timed out.
FAIL: 22_locale/money_get/3.cc (test for excess errors)
WARNING: program timed out.
FAIL: 22_locale/num_get/2.cc (test for excess errors)
WARNING: program timed out.
FAIL: 22_locale/num_get/3.cc (test for excess errors)
WARNING: program timed out.
FAIL: 22_locale/num_get/get/char/wrapped_env.cc (test for excess errors)
WARNING: 22_locale/num_get/get/char/wrapped_env.cc compilation failed to produce executable
WARNING: program timed out.
FAIL: 22_locale/num_get/get/char/wrapped_locale.cc (test for excess errors)
WARNING: 22_locale/num_get/get/char/wrapped_locale.cc compilation failed to produce executable
WARNING: program timed out.
FAIL: 22_locale/num_get/get/wchar_t/wrapped_env.cc (test for excess errors)
WARNING: 22_locale/num_get/get/wchar_t/wrapped_env.cc compilation failed to produce executable
WARNING: program timed out.
FAIL: 22_locale/num_get/get/wchar_t/wrapped_locale.cc (test for excess errors)
WARNING: 22_locale/num_get/get/wchar_t/wrapped_locale.cc compilation failed to produce executable
WARNING: program timed out.
FAIL: 26_numerics/complex/complex_inserters_extractors.cc (test for excess errors)
WARNING: 26_numerics/complex/complex_inserters_extractors.cc compilation failed to produce executable
WARNING: program timed out.
FAIL: 27_io/basic_ios/imbue/14072.cc (test for excess errors)
WARNING: 27_io/basic_ios/imbue/14072.cc compilation failed to produce executable
XPASS: 27_io/basic_istream/extractors_arithmetic/char/12.cc execution test
XPASS: 27_io/basic_istream/extractors_arithmetic/wchar_t/12.cc execution test

		=== libstdc++ Summary ===

# of expected passes		3678
# of unexpected failures	10
# of unexpected successes	2
# of expected failures		12
# of unsupported tests		9

Compiler version: 4.0.3 20060207 (prerelease) 
Platform: sparc-sun-solaris2.10
configure flags: --verbose --enable-checking=yes,rtl,fold --with-local-prefix=/tmp/local --without-libiconv-prefix --with-mpfr=/caip/u12/kishgcc/gcc-testing/_gmp --enable-languages=c,c++,f95,java,objc,treelang


Index Nav: [Date Index] [Subject Index] [Author Index] [Thread Index]
Message Nav: [Date Prev] [Date Next] [Thread Prev] [Thread Next]