This is the mail archive of the gcc-testresults@gcc.gnu.org mailing list for the GCC project.


Index Nav: [Date Index] [Subject Index] [Author Index] [Thread Index]
Message Nav: [Date Prev] [Date Next] [Thread Prev] [Thread Next]
Other format: [Raw text]

Results for 3.4.0 20031230 (experimental) testsuite on sparc-sun-solaris2.9


LAST_UPDATED: Tue Dec 30 15:33:23 UTC 2003

Native configuration is sparc-sun-solaris2.9

		=== g++ tests ===


Running target unix
WARNING: g++.dg/eh/simd-1.C compilation failed to produce executable
WARNING: g++.dg/eh/simd-2.C compilation failed to produce executable
XPASS: g++.dg/ext/lvalue1.C not an lvalue (test for errors, line 7)
XPASS: g++.dg/warn/Wunused-2.C  (test for warnings, line 5)
WARNING: g++.old-deja/g++.mike/p10769a.C compilation failed to produce executable
WARNING: g++.old-deja/g++.other/enum5.C compilation failed to produce executable
WARNING: g++.old-deja/g++.pt/friend44.C compilation failed to produce executable

		=== g++ Summary ===

# of expected passes		9226
# of unexpected successes	2
# of expected failures		57
# of unsupported tests		66
/opt/gcc/gcc-cvs/objdir/gcc/testsuite/../g++ version 3.4.0 20031230 (experimental)

		=== gcc tests ===


Running target unix
FAIL: gcc.c-torture/execute/20030307-1.c execution,  -O2 
FAIL: gcc.c-torture/execute/20030307-1.c execution,  -Os 
UNRESOLVED: gcc.c-torture/execute/simd-4.c execution,  -O0 
UNRESOLVED: gcc.c-torture/execute/va-arg-25.c execution,  -O0 
UNRESOLVED: gcc.c-torture/execute/va-arg-25.c execution,  -O1 
UNRESOLVED: gcc.c-torture/execute/va-arg-25.c execution,  -O2 
UNRESOLVED: gcc.c-torture/execute/va-arg-25.c execution,  -O3 -fomit-frame-pointer 
UNRESOLVED: gcc.c-torture/execute/va-arg-25.c execution,  -O3 -g 
UNRESOLVED: gcc.c-torture/execute/va-arg-25.c execution,  -Os 
UNRESOLVED: gcc.dg/compat/vector-1 c_compat_x_tst.o-c_compat_y_tst.o link 
UNRESOLVED: gcc.dg/compat/vector-1 c_compat_x_tst.o-c_compat_y_tst.o execute 
UNRESOLVED: gcc.dg/compat/vector-2 c_compat_x_tst.o-c_compat_y_tst.o link 
UNRESOLVED: gcc.dg/compat/vector-2 c_compat_x_tst.o-c_compat_y_tst.o execute 
WARNING: gcc.dg/20021014-1.c compilation failed to produce executable
FAIL: gcc.dg/20031202-1.c execution test
XPASS: gcc.dg/uninit-4.c uninitialized variable warning (test for bogus messages, line 26)
UNRESOLVED: gcc.dg/visibility-1.c
UNRESOLVED: gcc.dg/visibility-2.c
UNRESOLVED: gcc.dg/visibility-3.c
UNRESOLVED: gcc.dg/visibility-4.c
UNRESOLVED: gcc.dg/visibility-5.c
UNRESOLVED: gcc.dg/visibility-6.c
UNRESOLVED: gcc.dg/visibility-7.c

		=== gcc Summary ===

# of expected passes		24439
# of unexpected failures	3
# of unexpected successes	1
# of expected failures		81
# of unresolved testcases	18
# of untested testcases		7
# of unsupported tests		287
/opt/gcc/gcc-cvs/objdir/gcc/xgcc version 3.4.0 20031230 (experimental)

		=== libffi tests ===


Running target unix
FAIL: libffi.call/cls_12byte.c execution test
FAIL: libffi.call/cls_16byte.c execution test
FAIL: libffi.call/cls_18byte.c execution test
FAIL: libffi.call/cls_19byte.c execution test
FAIL: libffi.call/cls_1_1byte.c execution test
FAIL: libffi.call/cls_20byte.c execution test
FAIL: libffi.call/cls_20byte1.c execution test
FAIL: libffi.call/cls_24byte.c execution test
FAIL: libffi.call/cls_2byte.c execution test
FAIL: libffi.call/cls_3_1byte.c execution test
FAIL: libffi.call/cls_3byte1.c execution test
FAIL: libffi.call/cls_3byte2.c execution test
FAIL: libffi.call/cls_4_1byte.c execution test
FAIL: libffi.call/cls_4byte.c execution test
FAIL: libffi.call/cls_5byte.c execution test
FAIL: libffi.call/cls_64byte.c execution test
FAIL: libffi.call/cls_6byte.c execution test
FAIL: libffi.call/cls_7byte.c execution test
FAIL: libffi.call/cls_8byte.c execution test
FAIL: libffi.call/cls_9byte1.c execution test
FAIL: libffi.call/cls_9byte2.c execution test
FAIL: libffi.call/cls_align_double.c execution test
FAIL: libffi.call/cls_align_float.c execution test
FAIL: libffi.call/cls_align_longdouble.c execution test
FAIL: libffi.call/cls_align_pointer.c execution test
FAIL: libffi.call/cls_align_sint16.c execution test
FAIL: libffi.call/cls_align_sint32.c execution test
FAIL: libffi.call/cls_align_sint64.c execution test
FAIL: libffi.call/cls_align_uint16.c execution test
FAIL: libffi.call/cls_align_uint32.c execution test
FAIL: libffi.call/cls_align_uint64.c execution test
FAIL: libffi.call/nested_struct.c execution test
FAIL: libffi.call/nested_struct1.c execution test
FAIL: libffi.call/nested_struct2.c execution test
FAIL: libffi.call/nested_struct3.c execution test
FAIL: libffi.call/problem1.c execution test
FAIL: libffi.call/struct3.c execution test

		=== libffi Summary ===

# of expected passes		139
# of unexpected failures	37
# of unsupported tests		2
		=== libjava tests ===


Running target unix
ERROR: tcl error sourcing /opt/gcc/gcc-cvs/gcc/libjava/testsuite/libjava.compile/compile.exp.
ERROR: can't read "x": no such variable
FAIL: 10.6-syntax-4
FAIL: 14.10-assignable-2
FAIL: 14.10-assignable-8
FAIL: 14.10-assignable-9
FAIL: 14.10-assignable-10
FAIL: 14.10-assignable-11
FAIL: 14.10-assignable-12
FAIL: 14.20-block-5
FAIL: 14.20-block-10
FAIL: 14.20-label-6
FAIL: 14.20-switch-9
FAIL: 14.20-switch-15
FAIL: 14.20-while-5
FAIL: 14.20-do-7
FAIL: 14.20-for-5
FAIL: 14.20-for-9
FAIL: 14.20-abrupt-3
FAIL: 14.20-abrupt-7
FAIL: 14.20-abrupt-11
FAIL: 14.20-abrupt-15
FAIL: 14.20-synchronized-4
FAIL: 14.20-try-4
FAIL: 14.20-try-10
FAIL: 14.20-try-15
FAIL: 14.20-try-19
FAIL: 14.20-try-23
FAIL: 14.20-try-28
FAIL: 14.20-try-32
FAIL: 14.20-catch-1
FAIL: 14.20-catch-2
FAIL: 14.20-catch-10
FAIL: 14.20-catch-12
FAIL: 14.20-catch-13
FAIL: 14.20-catch-14
FAIL: 14.20-catch-16
FAIL: 14.20-catch-18
FAIL: 14.20-catch-20
FAIL: 14.20-if-7
FAIL: 8.1.3-circular-1
FAIL: 8.1.3-circular-2
FAIL: 8.1.3-circular-5
FAIL: 8.2-accessibility-inherited-member-5
FAIL: 8.8.3-invalid-modifiers-5
FAIL: 5.2-byte-narrowing-1
FAIL: 5.2-short-narrowing-1
FAIL: 5.2-short-narrowing-2
FAIL: 5.2-char-narrowing-1
FAIL: 5.2-char-narrowing-2
FAIL: 5.1.1-reference-2
FAIL: 16.2.7-final-2
XPASS: 16.2.7-final-4
XPASS: 16.2.7-final-6
FAIL: 16.2.8-final-3
FAIL: 16.2.8-unassigned-4
XPASS: 16.2.8-unassigned-6
FAIL: 15.18.2-assoc-2
FAIL: 15.18.2-assoc-3
FAIL: 15.18.1-5
FAIL: 15.18.1-6
FAIL: 15.18.1-7
FAIL: 15.10-initializer-syntax-4
XPASS: 15.9.1-unqualified-anonymous-2
XPASS: 15.9.1-unqualified-anonymous-4
XPASS: 15.9.1-unqualified-anonymous-5
XPASS: 15.9.1-unqualified-anonymous-12
XPASS: 15.9.1-unqualified-anonymous-14
XPASS: 15.9.1-unqualified-anonymous-15
XPASS: 15.9.1-unqualified-anonymous-24
XPASS: 15.9.1-qualified-anonymous-4
XPASS: 15.9.1-qualified-anonymous-5
FAIL: 15.9.1-qualified-anonymous-6
FAIL: 15.9.1-qualified-anonymous-7
XPASS: 15.9.1-unqualified-concrete-2
XPASS: 15.9.1-unqualified-concrete-4
XPASS: 15.9.1-unqualified-concrete-5
FAIL: 15.9.1-unqualified-concrete-6
FAIL: 15.9.1-unqualified-concrete-7
XPASS: 15.9.1-unqualified-concrete-14
XPASS: 15.9.1-qualified-concrete-4
XPASS: 15.9.1-qualified-concrete-5
FAIL: 15.9.1-qualified-concrete-6
FAIL: 15.9.1-qualified-concrete-7
FAIL: 15.25-byte-operand-type-mismatch-4
FAIL: 15.25-short-operand-type-mismatch-5
FAIL: 15.25-char-operand-type-mismatch-4
FAIL: 15.28-primitive-4
XPASS: 15.28-primitive-15
FAIL: 15.28-simple-name-9
FAIL: 15.28-string-1
FAIL: 15.28-string-3
FAIL: 15.28-string-4
FAIL: 15.28-string-6
FAIL: 15.28-string-7
FAIL: 15.28-string-8
FAIL: 15.28-string-10
FAIL: 15.28-string-12
FAIL: 15.28-string-14
FAIL: 15.28-qualified-namestr-1
XPASS: 15.28-qualified-namestr-7
XPASS: 15.28-qualified-namestr-8
XPASS: 15.28-qualified-namestr-9
XPASS: 15.28-notstring-1
XPASS: 15.28-null-3
FAIL: 15.28-example-2
FAIL: 15.28-instanceof-1
XPASS: 15.28-instanceof-3
FAIL: 15.17-type-3
FAIL: 15.17.2-int-3
FAIL: 15.17.2-long-3
FAIL: 15.17.1-assoc-2
FAIL: 15.17.1-assoc-3
FAIL: 15.17.3-int-2
FAIL: 15.17.3-int-3
FAIL: 15.17.3-long-2
FAIL: 15.17.3-long-3
FAIL: 15.14.2-argument-9
FAIL: 15.14.1-argument-9
FAIL: 15.15-group-1
FAIL: 15.15.2-argument-9
FAIL: 15.15.1-argument-9
FAIL: 3.7-16
FAIL: 3.10.7-valid-13
FAIL: 3.10.7-valid-15
FAIL: 3.10.2-round-5
XPASS: 3.10.2-round-7
FAIL: 3.10.2-float-13
FAIL: 3.10.1-invalid-5
FAIL: 3.10.1-invalid-6
FAIL: 3.10.1-invalid-10
FAIL: 3.10.1-invalid-11
FAIL: 3.10.1-invalid-13
FAIL: 7.3-1
FAIL: 7.3-2
FAIL: 7.3-3
FAIL: 7.3-5
XPASS: 7.4.2-2
FAIL: 7.6-syntax-1
XPASS: 7.6-optional-restrictions-1
FAIL: linking simple
FAIL: /opt/gcc/gcc-cvs/gcc/libjava/testsuite/libjava.jar/simple.jar execution - gij test
FAIL: Array_3 execution - gij test
FAIL: Array_3 execution - gij test
FAIL: SyncTest execution - gij test
FAIL: SyncTest execution - gij test
FAIL: TLtest execution - gij test
FAIL: TLtest execution - gij test
FAIL: Thread_Join execution - gij test
FAIL: Thread_Monitor execution - gij test
FAIL: Thread_Monitor execution - gij test
FAIL: Thread_Wait_Interrupt execution - gij test
FAIL: Thread_Wait_Interrupt execution - gij test
FAIL: gnu.testlet.java.awt.geom.CubicCurve2D.solveCubic: uncaught exception at "1.0x^3 - 1.0 = 0" number 1: java.lang.Error: not implemented
FAIL: gnu.testlet.java.awt.geom.QuadCurve2D.solveQuadratic: 4.0x^2 = 0 (number 1)
FAIL: gnu.testlet.java.awt.geom.QuadCurve2D.solveQuadratic: 0.1x^2 + 20.0x + 1000.0 = 0 (number 1)
FAIL: gnu.testlet.java.awt.geom.QuadCurve2D.solveQuadratic: 4.0x^2 - 20.0x + 25.0 = 0 (number 1)
FAIL: gnu.testlet.java.awt.geom.RoundRectangle2D.intersects (number 10)
FAIL: gnu.testlet.java.awt.geom.RoundRectangle2D.intersects (number 11)
FAIL: gnu.testlet.java.awt.geom.RoundRectangle2D.intersects (number 12)
FAIL: gnu.testlet.java.awt.geom.RoundRectangle2D.intersects (number 16)
FAIL: gnu.testlet.java.awt.geom.RoundRectangle2D.intersects (number 20)
FAIL: gnu.testlet.java.awt.geom.RoundRectangle2D.intersects (number 23)
FAIL: gnu.testlet.java.awt.geom.RoundRectangle2D.intersects (number 27)
FAIL: gnu.testlet.java.awt.geom.RoundRectangle2D.intersects (number 30)
FAIL: gnu.testlet.java.awt.geom.RoundRectangle2D.intersects (number 34)
FAIL: gnu.testlet.java.awt.geom.RoundRectangle2D.intersects (number 38)
FAIL: gnu.testlet.java.awt.geom.RoundRectangle2D.intersects (number 39)
FAIL: gnu.testlet.java.awt.geom.RoundRectangle2D.intersects (number 40)
FAIL: gnu.testlet.java.awt.image.PixelGrabber.SimpleGrabber: uncaught exception at  number 1: java.awt.AWTError: Cannot load AWT toolkit: 
FAIL: gnu.testlet.java.io.File.security: dir.canWrite() (number 1)
FAIL: gnu.testlet.java.io.File.security: dir.canRead() (number 1)
FAIL: gnu.testlet.java.io.File.security: file.createNewFile() (number 1)
FAIL: gnu.testlet.java.io.File.security: file.delete() (number 1)
FAIL: gnu.testlet.java.io.File.security: dir.list(null) (number 1)
FAIL: gnu.testlet.java.io.File.security: dir.list() (number 1)
FAIL: gnu.testlet.java.io.File.security: dir.listFiles() (number 1)
FAIL: gnu.testlet.java.io.File.security: dir.listFiles(FilenameFilter) (number 1)
FAIL: gnu.testlet.java.io.File.security: dir.listFiles(FileFilter) (number 1)
FAIL: gnu.testlet.java.io.File.security: dir.createTempFile(2-args) (number 1)
FAIL: gnu.testlet.java.io.File.security: File.createTempFile(3-args) (number 1)
FAIL: gnu.testlet.java.io.File.security: dir.setReadOnly() (number 1)
FAIL: gnu.testlet.java.io.File.security: File.listRoots() (number 1)
FAIL: gnu.testlet.java.io.File.security: file.renameTo() (number 1)
FAIL: gnu.testlet.java.io.File.security: dir.setLastModified() (number 1)
FAIL: gnu.testlet.java.io.File.security: dir.deleteOnExit() (number 1)
FAIL: gnu.testlet.java.io.ObjectInputOutput.Compat2: Compatibility test for type mismatch when calling get methods (number 2)
FAIL: gnu.testlet.java.io.ObjectInputOutput.Compat2: Compatibility test for type mismatch when calling get methods (number 3)
FAIL: gnu.testlet.java.io.ObjectInputOutput.InputTest: gnu.testlet.java.io.ObjectInputOutput.Test\$GetPutField (number 1)
FAIL: gnu.testlet.java.io.OutputStreamWriter.jdk11: OutputStreamWriter(writer, encoding) (number 1)
FAIL: gnu.testlet.java.io.OutputStreamWriter.jdk11: OutputStreamWriter(writer, encoding) // alias (number 1)
FAIL: gnu.testlet.java.io.PrintWriter.jdk11: checkError() after close() (number 1)
FAIL: gnu.testlet.java.lang.Math.MathTest: Error : test_asinacosatan failed - 4 (number 1)
FAIL: gnu.testlet.java.lang.Math.MathTest: Error : test_asinacosatan failed - 6 (number 1)
FAIL: gnu.testlet.java.lang.Math.MathTest: Error : test_log failed - 2 (number 1)
WARNING: program timed out.
FAIL: gnu.testlet.java.lang.Package.getPackage: uncaught exception at  number 1: java.lang.ArrayIndexOutOfBoundsException: 1
FAIL: gnu.testlet.java.lang.String.getBytes13: String.getBytes("Cp1252") (number 1)
FAIL: gnu.testlet.java.lang.String.getBytes14: String.getBytes("windows-1252") (number 1)
FAIL: gnu.testlet.java.lang.Thread.contextClassLoader: null is a valid contextClassLoader (number 1)
FAIL: gnu.testlet.java.lang.Thread.contextClassLoader: New thread inherits null classloader (number 1)
FAIL: gnu.testlet.java.lang.Thread.daemon: Can change daemon state on an exitted Thread (number 1)
FAIL: gnu.testlet.java.lang.Thread.daemon: Daemon status changed when set on an exitted Thread (number 1)
FAIL: gnu.testlet.java.lang.Thread.stop: Unexpected exception during test() (number 1)
FAIL: gnu.testlet.java.lang.reflect.Constructor.newInstance: int arg (number 1)
FAIL: gnu.testlet.java.lang.reflect.Constructor.newInstance: uncaught exception at "int arg" number 2: java.lang.ClassCastException: java.lang.IllegalAccessException cannot be cast to gnu.testlet.java.lang.reflect.Constructor.newInstance
FAIL: Link for gnu.testlet.java.lang.reflect.ReflectAccess
FAIL: gnu.testlet.java.net.DatagramPacket.DatagramPacketOffset: DatagramPacket Offset Test java.io.IOException: Invalid argument (number 1)
FAIL: gnu.testlet.java.net.URL.newURL: http://www.kaffe.org + foo/bar = http://www.kaffe.org/foo/bar (number 1)
FAIL: gnu.testlet.java.net.URLClassLoader.getResource: Unexpected exception: java.io.IOException: Permission denied (number 1)
FAIL: gnu.testlet.java.text.DecimalFormat.formatExp: pattern ##0.####E0 (number 2)
FAIL: gnu.testlet.java.text.DecimalFormat.formatExp: pattern ##.###E0 (number 2)
FAIL: gnu.testlet.java.text.RuleBasedCollator.jdk11: constructor rule parsing (number 4)
FAIL: gnu.testlet.java.text.RuleBasedCollator.jdk11: constructor rule parsing (number 5)
FAIL: gnu.testlet.java.text.RuleBasedCollator.jdk11: constructor rule parsing (number 21)
FAIL: gnu.testlet.java.text.RuleBasedCollator.jdk11: constructor rule parsing (number 22)
FAIL: gnu.testlet.java.text.RuleBasedCollator.jdk11: constructor rule parsing (number 23)
FAIL: gnu.testlet.java.text.RuleBasedCollator.jdk11: constructor rule parsing (number 24)
FAIL: gnu.testlet.java.text.RuleBasedCollator.jdk11: constructor rule parsing (number 25)
FAIL: gnu.testlet.java.text.RuleBasedCollator.jdk11: constructor rule parsing (number 26)
FAIL: gnu.testlet.java.text.RuleBasedCollator.jdk11: constructor rule parsing (number 27)
FAIL: gnu.testlet.java.text.RuleBasedCollator.jdk11: constructor rule parsing (number 28)
FAIL: gnu.testlet.java.text.RuleBasedCollator.jdk11: constructor rule parsing (number 29)
FAIL: gnu.testlet.java.text.RuleBasedCollator.jdk11: constructor rule parsing (number 30)
FAIL: gnu.testlet.java.text.RuleBasedCollator.jdk11: constructor rule parsing (number 31)
FAIL: gnu.testlet.java.text.RuleBasedCollator.jdk11: single character ordering (number 19)
FAIL: gnu.testlet.java.text.RuleBasedCollator.jdk11: single character ordering (number 73)
FAIL: gnu.testlet.java.text.RuleBasedCollator.jdk11: contraction ordering (number 5)
FAIL: gnu.testlet.java.text.RuleBasedCollator.jdk11: expansion ordering: ParseException (offset is 26) (number 1)
XPASS: gnu.testlet.java.text.SimpleDateFormat.Test: parse() strict (number 1)
FAIL: gnu.testlet.java.util.zip.ZipFile.newZipFile: java.io.IOException: Permission denied (number 1)

		=== libjava Summary ===

# of expected passes		15288
# of unexpected failures	199
# of unexpected successes	29
# of expected failures		343
# of untested testcases		12
		=== libstdc++ tests ===


Running target unix

		=== libstdc++ Summary ===

# of expected passes		2470
# of expected failures		12

Compiler version: 3.4.0 20031230 (experimental) 
Platform: sparc-sun-solaris2.9
configure flags: --prefix=/var/tmp --enable-languages=c,c++,java --with-dwarf2 --disable-checking

Index Nav: [Date Index] [Subject Index] [Author Index] [Thread Index]
Message Nav: [Date Prev] [Date Next] [Thread Prev] [Thread Next]