This is the mail archive of the gcc-testresults@gcc.gnu.org mailing list for the GCC project.


Index Nav: [Date Index] [Subject Index] [Author Index] [Thread Index]
Message Nav: [Date Prev] [Date Next] [Thread Prev] [Thread Next]
Other format: [Raw text]

Results for 3.4.0 20031220 (experimental) testsuite on sparc-sun-solaris2.8


LAST_UPDATED: Sat Dec 20 04:08:19 UTC 2003

Native configuration is sparc-sun-solaris2.8

		=== g++ tests ===


Running target unix/-m64
WARNING: g++.dg/eh/simd-1.C compilation failed to produce executable
WARNING: g++.dg/eh/simd-2.C compilation failed to produce executable
XPASS: g++.dg/ext/lvalue1.C not an lvalue (test for errors, line 7)
XPASS: g++.dg/warn/Wunused-2.C  (test for warnings, line 5)
WARNING: g++.old-deja/g++.mike/p10769a.C compilation failed to produce executable
FAIL: g++.old-deja/g++.other/comdat1.C (test for excess errors)
WARNING: g++.old-deja/g++.other/comdat1.C compilation failed to produce executable
FAIL: g++.old-deja/g++.other/comdat2.C (test for excess errors)
WARNING: g++.old-deja/g++.other/comdat2.C compilation failed to produce executable
FAIL: g++.old-deja/g++.other/comdat3.C (test for excess errors)
WARNING: g++.old-deja/g++.other/comdat3.C compilation failed to produce executable
FAIL: g++.old-deja/g++.other/crash34.C (test for excess errors)
FAIL: g++.old-deja/g++.other/ctor1.C (test for excess errors)
WARNING: g++.old-deja/g++.other/ctor1.C compilation failed to produce executable
WARNING: g++.old-deja/g++.other/enum5.C compilation failed to produce executable
WARNING: g++.old-deja/g++.pt/friend44.C compilation failed to produce executable
FAIL: g++.old-deja/g++.pt/instantiate5.C (test for excess errors)

		=== g++ Summary for unix/-m64 ===

# of expected passes		9192
# of unexpected failures	6
# of unexpected successes	2
# of expected failures		57
# of unsupported tests		66

Running target unix
FAIL: g++.dg/eh/simd-1.C (test for excess errors)
WARNING: g++.dg/eh/simd-1.C compilation failed to produce executable
FAIL: g++.dg/eh/simd-2.C (test for excess errors)
WARNING: g++.dg/eh/simd-2.C compilation failed to produce executable
XPASS: g++.dg/ext/lvalue1.C not an lvalue (test for errors, line 7)
XPASS: g++.dg/warn/Wunused-2.C  (test for warnings, line 5)
WARNING: g++.old-deja/g++.mike/p10769a.C compilation failed to produce executable
FAIL: g++.old-deja/g++.other/comdat1.C (test for excess errors)
WARNING: g++.old-deja/g++.other/comdat1.C compilation failed to produce executable
FAIL: g++.old-deja/g++.other/comdat2.C (test for excess errors)
WARNING: g++.old-deja/g++.other/comdat2.C compilation failed to produce executable
FAIL: g++.old-deja/g++.other/comdat3.C (test for excess errors)
WARNING: g++.old-deja/g++.other/comdat3.C compilation failed to produce executable
FAIL: g++.old-deja/g++.other/ctor1.C (test for excess errors)
WARNING: g++.old-deja/g++.other/ctor1.C compilation failed to produce executable
WARNING: g++.old-deja/g++.other/enum5.C compilation failed to produce executable
WARNING: g++.old-deja/g++.pt/friend44.C compilation failed to produce executable
FAIL: g++.old-deja/g++.pt/instantiate5.C (test for excess errors)

		=== g++ Summary for unix ===

# of expected passes		9191
# of unexpected failures	7
# of unexpected successes	2
# of expected failures		57
# of unsupported tests		66

		=== g++ Summary ===

# of expected passes		18383
# of unexpected failures	13
# of unexpected successes	4
# of expected failures		114
# of unsupported tests		132
/export/mdd0/users/lucier/programs/gcc/gcc-3.4/objdir/gcc/testsuite/../g++ version 3.4.0 20031220 (experimental)

		=== g77 tests ===


Running target unix/-m64

		=== g77 Summary for unix/-m64 ===

# of expected passes		1774
# of expected failures		1
# of untested testcases		1
# of unsupported tests		6

Running target unix

		=== g77 Summary for unix ===

# of expected passes		1774
# of expected failures		1
# of untested testcases		1
# of unsupported tests		6

		=== g77 Summary ===

# of expected passes		3548
# of expected failures		2
# of untested testcases		2
# of unsupported tests		12
/export/mdd0/users/lucier/programs/gcc/gcc-3.4/objdir/gcc/testsuite/../g77 version 3.4.0 20031220 (experimental)

		=== gcc tests ===


Running target unix/-m64
UNRESOLVED: gcc.c-torture/execute/simd-4.c execution,  -O0 
UNRESOLVED: gcc.c-torture/execute/va-arg-25.c execution,  -O0 
UNRESOLVED: gcc.c-torture/execute/va-arg-25.c execution,  -O1 
UNRESOLVED: gcc.c-torture/execute/va-arg-25.c execution,  -O2 
UNRESOLVED: gcc.c-torture/execute/va-arg-25.c execution,  -O3 -fomit-frame-pointer 
UNRESOLVED: gcc.c-torture/execute/va-arg-25.c execution,  -O3 -g 
UNRESOLVED: gcc.c-torture/execute/va-arg-25.c execution,  -Os 
UNRESOLVED: gcc.dg/compat/vector-1 c_compat_x_tst.o-c_compat_y_tst.o link 
UNRESOLVED: gcc.dg/compat/vector-1 c_compat_x_tst.o-c_compat_y_tst.o execute 
UNRESOLVED: gcc.dg/compat/vector-2 c_compat_x_tst.o-c_compat_y_tst.o link 
UNRESOLVED: gcc.dg/compat/vector-2 c_compat_x_tst.o-c_compat_y_tst.o execute 
FAIL: gcc.dg/cpp/19990228-1.c scan-file-not [^\\n]#
FAIL: gcc.dg/cpp/_Pragma4.c scan-file (^|\\n)#pragma bar(\$|\\n)
FAIL: gcc.dg/cpp/avoidpaste2.c scan-file (^|\\n): : : - > - >
FAIL: gcc.dg/cpp/avoidpaste2.c scan-file (^|\\n):2: :22 22:
FAIL: gcc.dg/cpp/cmdlne-dD-dM.c scan-file (^|\\n)#define foo bar(\$|\\n)
FAIL: gcc.dg/cpp/cmdlne-dM-M.c scan-file (^|\\n)#define foo bar(\$|\\n)
FAIL: gcc.dg/cpp/cmdlne-dM-dD.c scan-file (^|\\n)#define foo bar(\$|\\n)
FAIL: gcc.dg/cpp/maccom1.c scan-file (^|\\n)passed
WARNING: gcc.dg/20021014-1.c compilation failed to produce executable
ERROR: gcc.dg/const-elim-2.c: error executing dg-final: bad switch "-inline": must be -indices, -nocase, or --
UNRESOLVED: gcc.dg/const-elim-2.c: error executing dg-final: bad switch "-inline": must be -indices, -nocase, or --
FAIL: gcc.dg/sparc-ret.c (test for excess errors)
ERROR: gcc.dg/sparc-ret.c: error executing dg-final: couldn't open "sparc-ret.s": no such file or directory
UNRESOLVED: gcc.dg/sparc-ret.c: error executing dg-final: couldn't open "sparc-ret.s": no such file or directory
XPASS: gcc.dg/uninit-4.c uninitialized variable warning (test for bogus messages, line 26)
UNRESOLVED: gcc.dg/visibility-1.c
UNRESOLVED: gcc.dg/visibility-2.c
UNRESOLVED: gcc.dg/visibility-3.c
UNRESOLVED: gcc.dg/visibility-4.c
UNRESOLVED: gcc.dg/visibility-5.c
UNRESOLVED: gcc.dg/visibility-6.c
UNRESOLVED: gcc.dg/visibility-7.c

		=== gcc Summary for unix/-m64 ===

# of expected passes		23690
# of unexpected failures	9
# of unexpected successes	1
# of expected failures		87
# of unresolved testcases	20
# of untested testcases		7
# of unsupported tests		285

Running target unix
FAIL: gcc.c-torture/execute/20030307-1.c execution,  -O2 
FAIL: gcc.c-torture/execute/20030307-1.c execution,  -Os 
UNRESOLVED: gcc.c-torture/execute/simd-4.c execution,  -O0 
UNRESOLVED: gcc.c-torture/execute/va-arg-25.c execution,  -O0 
UNRESOLVED: gcc.c-torture/execute/va-arg-25.c execution,  -O1 
UNRESOLVED: gcc.c-torture/execute/va-arg-25.c execution,  -O2 
UNRESOLVED: gcc.c-torture/execute/va-arg-25.c execution,  -O3 -fomit-frame-pointer 
UNRESOLVED: gcc.c-torture/execute/va-arg-25.c execution,  -O3 -g 
UNRESOLVED: gcc.c-torture/execute/va-arg-25.c execution,  -Os 
UNRESOLVED: gcc.dg/compat/vector-1 c_compat_x_tst.o-c_compat_y_tst.o link 
UNRESOLVED: gcc.dg/compat/vector-1 c_compat_x_tst.o-c_compat_y_tst.o execute 
UNRESOLVED: gcc.dg/compat/vector-2 c_compat_x_tst.o-c_compat_y_tst.o link 
UNRESOLVED: gcc.dg/compat/vector-2 c_compat_x_tst.o-c_compat_y_tst.o execute 
FAIL: gcc.dg/cpp/19990228-1.c scan-file-not [^\\n]#
FAIL: gcc.dg/cpp/_Pragma4.c scan-file (^|\\n)#pragma bar(\$|\\n)
FAIL: gcc.dg/cpp/avoidpaste2.c scan-file (^|\\n): : : - > - >
FAIL: gcc.dg/cpp/avoidpaste2.c scan-file (^|\\n):2: :22 22:
FAIL: gcc.dg/cpp/cmdlne-dD-dM.c scan-file (^|\\n)#define foo bar(\$|\\n)
FAIL: gcc.dg/cpp/cmdlne-dM-M.c scan-file (^|\\n)#define foo bar(\$|\\n)
FAIL: gcc.dg/cpp/cmdlne-dM-dD.c scan-file (^|\\n)#define foo bar(\$|\\n)
FAIL: gcc.dg/cpp/maccom1.c scan-file (^|\\n)passed
WARNING: gcc.dg/20021014-1.c compilation failed to produce executable
FAIL: gcc.dg/20031202-1.c execution test
ERROR: gcc.dg/const-elim-2.c: error executing dg-final: bad switch "-inline": must be -indices, -nocase, or --
UNRESOLVED: gcc.dg/const-elim-2.c: error executing dg-final: bad switch "-inline": must be -indices, -nocase, or --
XPASS: gcc.dg/uninit-4.c uninitialized variable warning (test for bogus messages, line 26)
UNRESOLVED: gcc.dg/visibility-1.c
UNRESOLVED: gcc.dg/visibility-2.c
UNRESOLVED: gcc.dg/visibility-3.c
UNRESOLVED: gcc.dg/visibility-4.c
UNRESOLVED: gcc.dg/visibility-5.c
UNRESOLVED: gcc.dg/visibility-6.c
UNRESOLVED: gcc.dg/visibility-7.c

		=== gcc Summary for unix ===

# of expected passes		23696
# of unexpected failures	11
# of unexpected successes	1
# of expected failures		81
# of unresolved testcases	19
# of untested testcases		7
# of unsupported tests		285

		=== gcc Summary ===

# of expected passes		47386
# of unexpected failures	20
# of unexpected successes	2
# of expected failures		168
# of unresolved testcases	39
# of untested testcases		14
# of unsupported tests		570
/export/mdd0/users/lucier/programs/gcc/gcc-3.4/objdir/gcc/xgcc version 3.4.0 20031220 (experimental)

		=== objc tests ===


Running target unix/-m64
FAIL: objc.dg/call-super-2.m (test for excess errors)
FAIL: objc.dg/desig-init-1.m (test for excess errors)
FAIL: objc.dg/encode-2.m execution test
FAIL: objc.dg/encode-3.m execution test
FAIL: objc.dg/proto-qual-1.m execution test

		=== objc Summary for unix/-m64 ===

# of expected passes		1334
# of unexpected failures	5
# of unsupported tests		7

Running target unix

		=== objc Summary for unix ===

# of expected passes		1339
# of unsupported tests		7

		=== objc Summary ===

# of expected passes		2673
# of unexpected failures	5
# of unsupported tests		14
/export/mdd0/users/lucier/programs/gcc/gcc-3.4/objdir/gcc/xgcc version 3.4.0 20031220 (experimental)

		=== libffi tests ===


Running target unix/-m64
FAIL: libffi.call/cls_12byte.c execution test
FAIL: libffi.call/cls_16byte.c output pattern test, is 7 8 9 1 9 3: 8 17 12
FAIL: libffi.call/cls_18byte.c output pattern test, is 1 127 126 3 4 125 124 5: 5 252 250 8
FAIL: libffi.call/cls_19byte.c output pattern test, is 1 127 126 3 120 4 125 124 5 119: 5 252 250 8 239
FAIL: libffi.call/cls_1_1byte.c execution test
FAIL: libffi.call/cls_20byte.c output pattern test, is 1 2 3 4 5 7: 5 7 10
FAIL: libffi.call/cls_20byte1.c output pattern test, is 1 2 3 4 5 7: 5 7 10
FAIL: libffi.call/cls_24byte.c output pattern test, is 9 2 6 5 1 2 3 7 4 5 7 9 8 6 1 9: 22 15 17 25
FAIL: libffi.call/cls_2byte.c execution test
FAIL: libffi.call/cls_3_1byte.c execution test
FAIL: libffi.call/cls_3byte1.c execution test
FAIL: libffi.call/cls_3byte2.c execution test
FAIL: libffi.call/cls_4_1byte.c execution test
FAIL: libffi.call/cls_4byte.c execution test
FAIL: libffi.call/cls_5byte.c execution test
FAIL: libffi.call/cls_64byte.c output pattern test, is -NaN -NaN 11 20 3 -NaN 11 -NaN
FAIL: libffi.call/cls_6byte.c execution test
FAIL: libffi.call/cls_7byte.c execution test
FAIL: libffi.call/cls_8byte.c execution test
FAIL: libffi.call/cls_9byte1.c execution test
FAIL: libffi.call/cls_9byte2.c execution test
FAIL: libffi.call/cls_align_double.c output pattern test, is 12 4951 127 1 9320 13: 13 14271 140
FAIL: libffi.call/cls_align_float.c execution test
FAIL: libffi.call/cls_align_longdouble.c execution test
FAIL: libffi.call/cls_align_pointer.c output pattern test, is 12 4951 127 1 9320 13: 13 14271 140
FAIL: libffi.call/cls_align_sint16.c execution test
FAIL: libffi.call/cls_align_sint32.c execution test
FAIL: libffi.call/cls_align_sint64.c output pattern test, is 12 4951 127 1 9320 13: 13 14271 140
FAIL: libffi.call/cls_align_uint16.c execution test
FAIL: libffi.call/cls_align_uint32.c execution test
FAIL: libffi.call/cls_align_uint64.c output pattern test, is 12 4951 127 1 9320 13: 13 14271 140
FAIL: libffi.call/cls_uint.c output pattern test, is 2147483647: 2147483647
FAIL: libffi.call/nested_struct.c execution test
FAIL: libffi.call/nested_struct1.c execution test
FAIL: libffi.call/nested_struct2.c execution test
FAIL: libffi.call/nested_struct3.c execution test
FAIL: libffi.call/problem1.c output pattern test, is 1 2 3 1 2 3: 2 4 6
FAIL: libffi.call/pyobjc-tc.c execution test

		=== libffi Summary for unix/-m64 ===

# of expected passes		150
# of unexpected failures	38
# of unsupported tests		2

Running target unix
FAIL: libffi.call/cls_12byte.c execution test
FAIL: libffi.call/cls_16byte.c execution test
FAIL: libffi.call/cls_18byte.c execution test
FAIL: libffi.call/cls_19byte.c execution test
FAIL: libffi.call/cls_1_1byte.c execution test
FAIL: libffi.call/cls_20byte.c execution test
FAIL: libffi.call/cls_20byte1.c execution test
FAIL: libffi.call/cls_24byte.c execution test
FAIL: libffi.call/cls_2byte.c execution test
FAIL: libffi.call/cls_3_1byte.c execution test
FAIL: libffi.call/cls_3byte1.c execution test
FAIL: libffi.call/cls_3byte2.c execution test
FAIL: libffi.call/cls_4_1byte.c execution test
FAIL: libffi.call/cls_4byte.c execution test
FAIL: libffi.call/cls_5byte.c execution test
FAIL: libffi.call/cls_64byte.c execution test
FAIL: libffi.call/cls_6byte.c execution test
FAIL: libffi.call/cls_7byte.c execution test
FAIL: libffi.call/cls_8byte.c execution test
FAIL: libffi.call/cls_9byte1.c execution test
FAIL: libffi.call/cls_9byte2.c execution test
FAIL: libffi.call/cls_align_double.c execution test
FAIL: libffi.call/cls_align_float.c execution test
FAIL: libffi.call/cls_align_longdouble.c execution test
FAIL: libffi.call/cls_align_pointer.c execution test
FAIL: libffi.call/cls_align_sint16.c execution test
FAIL: libffi.call/cls_align_sint32.c execution test
FAIL: libffi.call/cls_align_sint64.c execution test
FAIL: libffi.call/cls_align_uint16.c execution test
FAIL: libffi.call/cls_align_uint32.c execution test
FAIL: libffi.call/cls_align_uint64.c execution test
FAIL: libffi.call/nested_struct.c execution test
FAIL: libffi.call/nested_struct1.c execution test
FAIL: libffi.call/nested_struct2.c execution test
FAIL: libffi.call/nested_struct3.c execution test
FAIL: libffi.call/problem1.c execution test
FAIL: libffi.call/struct3.c execution test

		=== libffi Summary for unix ===

# of expected passes		139
# of unexpected failures	37
# of unsupported tests		2

		=== libffi Summary ===

# of expected passes		289
# of unexpected failures	75
# of unsupported tests		4
		=== libjava tests ===


Running target unix/-m64
FAIL: linking simple
FAIL: /homes/lucier/programs/gcc/gcc-3.4/libjava/testsuite/libjava.jar/simple.jar execution - gij test
FAIL: Array_3 execution - gij test
FAIL: Array_3 execution - gij test
FAIL: FileHandleGcTest execution - source compiled test
FAIL: FileHandleGcTest execution - gij test
FAIL: FileHandleGcTest execution - bytecode->native test
FAIL: FileHandleGcTest -O3 execution - source compiled test
FAIL: FileHandleGcTest execution - gij test
FAIL: FileHandleGcTest -O3 execution - bytecode->native test

		=== libjava Summary for unix/-m64 ===

# of expected passes		3242
# of unexpected failures	10
# of expected failures		11
# of untested testcases		17

Running target unix
FAIL: linking simple
FAIL: /homes/lucier/programs/gcc/gcc-3.4/libjava/testsuite/libjava.jar/simple.jar execution - gij test
FAIL: Array_3 execution - gij test
FAIL: Array_3 execution - gij test
FAIL: SyncTest execution - gij test
FAIL: SyncTest execution - gij test
FAIL: TLtest execution - gij test
FAIL: TLtest execution - gij test
FAIL: Thread_Join execution - gij test
FAIL: Thread_Join execution - gij test
FAIL: Thread_Monitor execution - gij test
FAIL: Thread_Wait_2 execution - gij test
FAIL: Thread_Wait_2 execution - gij test

		=== libjava Summary for unix ===

# of expected passes		3236
# of unexpected failures	13
# of expected failures		11
# of untested testcases		20

		=== libjava Summary ===

# of expected passes		6478
# of unexpected failures	23
# of expected failures		22
# of untested testcases		37
		=== libstdc++ tests ===


Running target unix/-m64
FAIL: 22_locale/num_get/get/char/10.cc execution test
FAIL: 22_locale/num_get/get/char/7.cc execution test
FAIL: 22_locale/num_get/get/wchar_t/7.cc execution test
FAIL: 27_io/basic_filebuf/overflow/char/1.cc execution test
FAIL: 27_io/basic_filebuf/seekoff/12790-3.cc execution test
FAIL: 27_io/basic_filebuf/seekpos/12790-1.cc execution test
FAIL: 27_io/basic_filebuf/seekpos/12790-2.cc execution test
FAIL: 27_io/basic_istream/extractors_arithmetic/char/01.cc execution test
FAIL: 27_io/basic_streambuf/overflow/char/2.cc execution test
FAIL: 27_io/basic_stringbuf/overflow/char/2.cc execution test
FAIL: 27_io/manipulators/adjustfield/char/1.cc execution test

		=== libstdc++ Summary for unix/-m64 ===

# of expected passes		2451
# of unexpected failures	11
# of expected failures		12

Running target unix

		=== libstdc++ Summary for unix ===

# of expected passes		2462
# of expected failures		12

		=== libstdc++ Summary ===

# of expected passes		4913
# of unexpected failures	11
# of expected failures		24

Compiler version: 3.4.0 20031220 (experimental) 
Platform: sparc-sun-solaris2.8
configure flags: none
Counting all warnings,
there are 23 warnings in stage3 of this bootstrap.

Number of warnings per file:
      5	/pkgs/gnu/share/bison.simple
      4	gcc/unwind-dw2.c
      4	gcc/libgcc2.c
      3	g-3128
      2	gcc/objc/lang-specs.h
      2	gcc/gcc.c
      2	gcc/f/sta.c
      1	gcc/java/jvspec.c

Number of warning types:
      8	old-style parameter declaration
      5	string length \`???' is greater than the length \`???' ISO C89 compilers are required to support
      2	missing braces around initializer
      2	implicit declaration of function \`???'
      2	dereferencing type-punned pointer will break strict-aliasing rules
      2	comparison between signed and unsigned
      2	(near initialization for \`???')


Index Nav: [Date Index] [Subject Index] [Author Index] [Thread Index]
Message Nav: [Date Prev] [Date Next] [Thread Prev] [Thread Next]