This is the mail archive of the gcc-regression@gcc.gnu.org mailing list for the GCC project.


Index Nav: [Date Index] [Subject Index] [Author Index] [Thread Index]
Message Nav: [Date Prev] [Date Next] [Thread Prev] [Thread Next]
Other format: [Raw text]

Gcc [trunk revision 249892] failed to profiledbootstrap on x86_64!


cd bld; \
 RUNTESTFLAGS="--target_board='unix{-m32,}'" ../src-trunk/configure \
	 --prefix=/usr/8.0.0 --enable-clocale=gnu --with-system-zlib --enable-shared --with-demangler-in-ld --enable-libmpx --with-build-config=bootstrap-lto --disable-werror --with-fpmath=sse 
checking build system type... x86_64-pc-linux-gnu
checking host system type... x86_64-pc-linux-gnu
checking target system type... x86_64-pc-linux-gnu
checking for a BSD-compatible install... /bin/install -c
    grep "Error " makelog.249892.trunk.x86_64 >> makelog.249892.trunk.x86_64.mail; \
make[7]: *** [/tmp/ccmmJQpT.ltrans0.ltrans.o] Error 1
make[6]: *** [collect2] Error 1
make[7]: *** [/tmp/ccHWjxC1.ltrans0.ltrans.o] Error 1
make[6]: *** [gcov-tool] Error 1
make[7]: *** [/tmp/cc2ccbHq.ltrans0.ltrans.o] Error 1
make[6]: *** [lto-wrapper] Error 1
make[5]: *** [all-stagefeedback-gcc] Error 2
make[4]: *** [stagefeedback-bubble] Error 2
make[3]: *** [profiledbootstrap] Error 2
make[2]: *** [profiledbootstrap] Error 2
lto-wrapper: fatal error: make returned 2 exit status
compilation terminated.
/usr/local/bin/ld: error: lto-wrapper failed
collect2: error: ld returned 1 exit status
Makefile:2112: recipe for target 'collect2' failed
make[6]: *** [collect2] Error 1
make[6]: *** Waiting for unfinished jobs....
during GIMPLE pass: vrp
../../src-trunk/gcc/hash-table.h: In member function ‘alloc_entries’:
../../src-trunk/gcc/hash-table.h:642:1: internal compiler error: in to_reg_br_prob_base, at profile-count.h:189
 hash_table<Descriptor, Allocator>::alloc_entries (size_t n MEM_STAT_DECL) const
 ^
0x13ee1f4 profile_probability::to_reg_br_prob_base() const
	../../src-trunk/gcc/profile-count.h:189
0x13ee1f4 compute_path_counts(redirection_data*, ssa_local_info_t*, profile_count*, profile_count*, int*) [clone .isra.45]
	../../src-trunk/gcc/tree-ssa-threadupdate.c:767
0x13ee1f4 ssa_fix_duplicate_block_edges(redirection_data*, ssa_local_info_t*)
	../../src-trunk/gcc/tree-ssa-threadupdate.c:1153
0x13ef42e ssa_fixup_template_block(redirection_data**, ssa_local_info_t*)
	../../src-trunk/gcc/tree-ssa-threadupdate.c:1385
0x13ef42e traverse_noresize
	../../src-trunk/gcc/hash-table.h:969
0x13ef42e traverse
	../../src-trunk/gcc/hash-table.h:990
0x13ef42e thread_block_1
	../../src-trunk/gcc/tree-ssa-threadupdate.c:1615
0x13ef553 thread_block
	../../src-trunk/gcc/tree-ssa-threadupdate.c:1651
0x1415f66 thread_through_all_blocks(bool)
	../../src-trunk/gcc/tree-ssa-threadupdate.c:2549
0x13204ec execute_vrp
	../../src-trunk/gcc/tree-vrp.c:11437
0x13204ec execute
	../../src-trunk/gcc/tree-vrp.c:11506
Please submit a full bug report,
with preprocessed source if appropriate.
Please include the complete backtrace with any bug report.
See <https://gcc.gnu.org/bugs/> for instructions.
make[7]: *** [/tmp/ccHWjxC1.ltrans0.ltrans.o] Error 1
lto-wrapper: fatal error: make returned 2 exit status
compilation terminated.
/usr/local/bin/ld: error: lto-wrapper failed
collect2: error: ld returned 1 exit status
Makefile:2891: recipe for target 'gcov-tool' failed
make[6]: *** [gcov-tool] Error 1
during GIMPLE pass: vrp
../../src-trunk/gcc/hash-table.h: In member function ‘alloc_entries’:
../../src-trunk/gcc/hash-table.h:642:1: internal compiler error: in to_reg_br_prob_base, at profile-count.h:189
 hash_table<Descriptor, Allocator>::alloc_entries (size_t n MEM_STAT_DECL) const
 ^
0x13ee1f4 profile_probability::to_reg_br_prob_base() const
	../../src-trunk/gcc/profile-count.h:189
0x13ee1f4 compute_path_counts(redirection_data*, ssa_local_info_t*, profile_count*, profile_count*, int*) [clone .isra.45]
	../../src-trunk/gcc/tree-ssa-threadupdate.c:767
0x13ee1f4 ssa_fix_duplicate_block_edges(redirection_data*, ssa_local_info_t*)
	../../src-trunk/gcc/tree-ssa-threadupdate.c:1153
0x13ef42e ssa_fixup_template_block(redirection_data**, ssa_local_info_t*)
	../../src-trunk/gcc/tree-ssa-threadupdate.c:1385
0x13ef42e traverse_noresize
	../../src-trunk/gcc/hash-table.h:969
0x13ef42e traverse
	../../src-trunk/gcc/hash-table.h:990
0x13ef42e thread_block_1
	../../src-trunk/gcc/tree-ssa-threadupdate.c:1615
0x13ef553 thread_block
	../../src-trunk/gcc/tree-ssa-threadupdate.c:1651
0x1415f66 thread_through_all_blocks(bool)
	../../src-trunk/gcc/tree-ssa-threadupdate.c:2549
0x13204ec execute_vrp
	../../src-trunk/gcc/tree-vrp.c:11437
0x13204ec execute
	../../src-trunk/gcc/tree-vrp.c:11506
Please submit a full bug report,
with preprocessed source if appropriate.
Please include the complete backtrace with any bug report.
See <https://gcc.gnu.org/bugs/> for instructions.
make[7]: *** [/tmp/cc2ccbHq.ltrans0.ltrans.o] Error 1
make[7]: *** Waiting for unfinished jobs....
lto-wrapper: fatal error: make returned 2 exit status
compilation terminated.
/usr/local/bin/ld: error: lto-wrapper failed
collect2: error: ld returned 1 exit status
Makefile:2121: recipe for target 'lto-wrapper' failed
make[6]: *** [lto-wrapper] Error 1
rm fsf-funding.pod gcov.pod gpl.pod cpp.pod gfdl.pod gcc.pod gcov-dump.pod gfortran.pod gcov-tool.pod
make[6]: Leaving directory '/export/gnu/import/git/gcc-test-profiled/bld/gcc'
Makefile:4878: recipe for target 'all-stagefeedback-gcc' failed
make[5]: *** [all-stagefeedback-gcc] Error 2
make[5]: Leaving directory '/export/gnu/import/git/gcc-test-profiled/bld'
Makefile:24787: recipe for target 'stagefeedback-bubble' failed
make[4]: *** [stagefeedback-bubble] Error 2
make[4]: Leaving directory '/export/gnu/import/git/gcc-test-profiled/bld'
Makefile:24806: recipe for target 'profiledbootstrap' failed
make[3]: *** [profiledbootstrap] Error 2
make[3]: Leaving directory '/export/gnu/import/git/gcc-test-profiled/bld'
98388.85user 779.79system 4:24:49elapsed 624%CPU (0avgtext+0avgdata 1081428maxresident)k
18220352inputs+68670296outputs (116141major+203436122minor)pagefaults 0swaps
Makefile:288: recipe for target 'profiledbootstrap' failed
make[2]: *** [profiledbootstrap] Error 2
make[2]: Leaving directory '/export/gnu/import/git/gcc-test-profiled'


Index Nav: [Date Index] [Subject Index] [Author Index] [Thread Index]
Message Nav: [Date Prev] [Date Next] [Thread Prev] [Thread Next]