This is the mail archive of the gcc-regression@gcc.gnu.org mailing list for the GCC project.


Index Nav: [Date Index] [Subject Index] [Author Index] [Thread Index]
Message Nav: [Date Prev] [Date Next] [Thread Prev] [Thread Next]
Other format: [Raw text]

Gcc [trunk revision 213517] failed to bootstrap on i686!


cd bld; \
 CC="gcc -m32" CXX="g++ -m32" ../src-trunk/configure \
	--with-arch=core2 --with-cpu=slm --prefix=/usr/4.10.0 --enable-clocale=gnu --with-system-zlib --enable-shared --with-demangler-in-ld i686-linux --with-fpmath=sse --enable-languages=c,c++,fortran,java,lto,objc
configure: WARNING: you should use --build, --host, --target
checking build system type... i686-pc-linux-gnu
checking host system type... i686-pc-linux-gnu
checking target system type... i686-pc-linux-gnu
    grep "Error " makelog.213517.trunk.i686.slm >> makelog.213517.trunk.i686.slm.mail; \
make[6]: *** [java/lang.lo] Error 1
make[5]: *** [all-recursive] Error 1
make[4]: *** [all-target-libjava] Error 2
make[3]: *** [bootstrap] Error 2
make[2]: *** [bootstrap] Error 2
                 from /export/gnu/import/git/gcc-test-ia32/src-trunk/libjava/classpath/java/lang/InternalError.java:71,
                 from /export/gnu/import/git/gcc-test-ia32/src-trunk/libjava/classpath/java/lang/Integer.java:1,
                 from /export/gnu/import/git/gcc-test-ia32/src-trunk/libjava/classpath/java/lang/InstantiationException.java:73,
                 from /export/gnu/import/git/gcc-test-ia32/src-trunk/libjava/classpath/java/lang/InstantiationError.java:74,
                 from /export/gnu/import/git/gcc-test-ia32/src-trunk/libjava/classpath/java/lang/InheritableThreadLocal.java:97,
                 from /export/gnu/import/git/gcc-test-ia32/src-trunk/libjava/classpath/java/lang/IndexOutOfBoundsException.java:74,
                 from /export/gnu/import/git/gcc-test-ia32/src-trunk/libjava/classpath/java/lang/IncompatibleClassChangeError.java:72,
                 from /export/gnu/import/git/gcc-test-ia32/src-trunk/libjava/classpath/java/lang/IllegalThreadStateException.java:74,
                 from /export/gnu/import/git/gcc-test-ia32/src-trunk/libjava/classpath/java/lang/IllegalStateException.java:132,
                 from /export/gnu/import/git/gcc-test-ia32/src-trunk/libjava/classpath/java/lang/IllegalMonitorStateException.java:77,
                 from /export/gnu/import/git/gcc-test-ia32/src-trunk/libjava/classpath/java/lang/IllegalArgumentException.java:127,
                 from /export/gnu/import/git/gcc-test-ia32/src-trunk/libjava/classpath/java/lang/IllegalAccessException.java:98,
                 from /export/gnu/import/git/gcc-test-ia32/src-trunk/libjava/classpath/java/lang/IllegalAccessError.java:75,
                 from /export/gnu/import/git/gcc-test-ia32/src-trunk/libjava/classpath/java/lang/Float.java:1,
                 from /export/gnu/import/git/gcc-test-ia32/src-trunk/libjava/classpath/java/lang/ExceptionInInitializerError.java:121,
                 from /export/gnu/import/git/gcc-test-ia32/src-trunk/libjava/classpath/java/lang/Exception.java:103,
                 from /export/gnu/import/git/gcc-test-ia32/src-trunk/libjava/classpath/java/lang/Error.java:106,
                 from /export/gnu/import/git/gcc-test-ia32/src-trunk/libjava/classpath/java/lang/EnumConstantNotPresentException.java:94,
                 from /export/gnu/import/git/gcc-test-ia32/src-trunk/libjava/classpath/java/lang/Enum.java:1,
                 from /export/gnu/import/git/gcc-test-ia32/src-trunk/libjava/classpath/java/lang/Double.java:1,
                 from /export/gnu/import/git/gcc-test-ia32/src-trunk/libjava/classpath/java/lang/Deprecated.java:0,
                 from /export/gnu/import/git/gcc-test-ia32/src-trunk/libjava/classpath/java/lang/Compiler.java:126,
                 from /export/gnu/import/git/gcc-test-ia32/src-trunk/libjava/classpath/java/lang/Comparable.java:0,
                 from /export/gnu/import/git/gcc-test-ia32/src-trunk/libjava/classpath/java/lang/CloneNotSupportedException.java:91,
                 from /export/gnu/import/git/gcc-test-ia32/src-trunk/libjava/classpath/java/lang/Cloneable.java:0,
                 from /export/gnu/import/git/gcc-test-ia32/src-trunk/libjava/classpath/java/lang/ClassNotFoundException.java:124,
                 from /export/gnu/import/git/gcc-test-ia32/src-trunk/libjava/java/lang/ClassLoader.java:1143,
                 from /export/gnu/import/git/gcc-test-ia32/src-trunk/libjava/java/lang/ClassLoader.java:216,
                 from /export/gnu/import/git/gcc-test-ia32/src-trunk/libjava/classpath/java/lang/ClassFormatError.java:71,
                 from /export/gnu/import/git/gcc-test-ia32/src-trunk/libjava/classpath/java/lang/ClassCircularityError.java:72,
                 from /export/gnu/import/git/gcc-test-ia32/src-trunk/libjava/classpath/java/lang/ClassCastException.java:75,
                 from /export/gnu/import/git/gcc-test-ia32/src-trunk/libjava/java/lang/Class.java:1426,
                 from /export/gnu/import/git/gcc-test-ia32/src-trunk/libjava/classpath/java/lang/CharSequence.java:1,
                 from /export/gnu/import/git/gcc-test-ia32/src-trunk/libjava/java/lang/Character.java:1,
                 from /export/gnu/import/git/gcc-test-ia32/src-trunk/libjava/java/lang/Character.java:154,
                 from /export/gnu/import/git/gcc-test-ia32/src-trunk/libjava/java/lang/Character.java:137,
                 from /export/gnu/import/git/gcc-test-ia32/src-trunk/libjava/java/lang/Character.java:1,
                 from /export/gnu/import/git/gcc-test-ia32/src-trunk/libjava/classpath/java/lang/Byte.java:1,
                 from /export/gnu/import/git/gcc-test-ia32/src-trunk/libjava/classpath/java/lang/Boolean.java:1,
                 from /export/gnu/import/git/gcc-test-ia32/src-trunk/libjava/classpath/java/lang/AutoCloseable.java:0,
                 from /export/gnu/import/git/gcc-test-ia32/src-trunk/libjava/classpath/java/lang/AssertionError.java:159,
                 from /export/gnu/import/git/gcc-test-ia32/src-trunk/libjava/classpath/java/lang/ArrayStoreException.java:76,
                 from /export/gnu/import/git/gcc-test-ia32/src-trunk/libjava/classpath/java/lang/ArrayIndexOutOfBoundsException.java:86,
                 from /export/gnu/import/git/gcc-test-ia32/src-trunk/libjava/classpath/java/lang/ArithmeticException.java:76,
                 from /export/gnu/import/git/gcc-test-ia32/src-trunk/libjava/classpath/java/lang/Appendable.java:0,
                 from /export/gnu/import/git/gcc-test-ia32/src-trunk/libjava/java/lang/AbstractStringBuffer.java:1,
                 from /export/gnu/import/git/gcc-test-ia32/src-trunk/libjava/classpath/java/lang/AbstractMethodError.java:77,
                 from <built-in>:134:
/export/gnu/import/git/gcc-test-ia32/src-trunk/libjava/classpath/java/lang/Long.java:186:0: internal compiler error: in splice, at vec.h:844
     if (radix < Character.MIN_RADIX || radix > Character.MAX_RADIX)
 ^
0x87c7166 vec<_edge_var_map, va_heap, vl_embed>::splice(vec<_edge_var_map, va_heap, vl_embed>&)
	../../src-trunk/gcc/vec.h:844
0x87c7166 vec<_edge_var_map, va_heap, vl_ptr>::splice(vec<_edge_var_map, va_heap, vl_ptr>&)
	../../src-trunk/gcc/vec.h:1495
0x87c7166 vec<_edge_var_map, va_heap, vl_ptr>::safe_splice(vec<_edge_var_map, va_heap, vl_ptr>&)
	../../src-trunk/gcc/vec.h:1512
0x87c7166 redirect_edge_var_map_dup(edge_def*, edge_def*)
	../../src-trunk/gcc/tree-ssa.c:113
0x820461c redirect_edge_succ_nodup(edge_def*, basic_block_def*)
	../../src-trunk/gcc/cfghooks.c:437
0x860fa20 gimple_try_redirect_by_replacing_jump
	../../src-trunk/gcc/tree-cfg.c:5419
0x860fa20 gimple_redirect_edge_and_branch
	../../src-trunk/gcc/tree-cfg.c:5450
0x8204432 redirect_edge_and_branch(edge_def*, basic_block_def*)
	../../src-trunk/gcc/cfghooks.c:356
0x8614109 remove_forwarder_block
	../../src-trunk/gcc/tree-cfgcleanup.c:445
0x8614109 cleanup_tree_cfg_bb
	../../src-trunk/gcc/tree-cfgcleanup.c:633
0x8615e70 cleanup_tree_cfg_1
	../../src-trunk/gcc/tree-cfgcleanup.c:675
0x8615e70 cleanup_tree_cfg_noloop
	../../src-trunk/gcc/tree-cfgcleanup.c:731
0x8615e70 cleanup_tree_cfg()
	../../src-trunk/gcc/tree-cfgcleanup.c:786
0x850bb54 execute_function_todo
	../../src-trunk/gcc/passes.c:1702
0x850c3d1 do_per_function
	../../src-trunk/gcc/passes.c:1476
0x850c59b execute_todo
	../../src-trunk/gcc/passes.c:1806
Please submit a full bug report,
with preprocessed source if appropriate.
Please include the complete backtrace with any bug report.
See <http://gcc.gnu.org/bugs.html> for instructions.
make[6]: *** [java/lang.lo] Error 1
make[6]: *** Waiting for unfinished jobs....
make[6]: Leaving directory `/export/gnu/import/git/gcc-test-ia32/bld/i686-linux/libjava'
make[5]: *** [all-recursive] Error 1
make[5]: Leaving directory `/export/gnu/import/git/gcc-test-ia32/bld/i686-linux/libjava'
make[4]: *** [all-target-libjava] Error 2
make[4]: Leaving directory `/export/gnu/import/git/gcc-test-ia32/bld'
make[3]: *** [bootstrap] Error 2
make[3]: Leaving directory `/export/gnu/import/git/gcc-test-ia32/bld'
9712.81user 270.66system 46:15.59elapsed 359%CPU (0avgtext+0avgdata 470984maxresident)k
104inputs+6779200outputs (0major+80809912minor)pagefaults 0swaps
make[2]: *** [bootstrap] Error 2
make[2]: Leaving directory `/export/gnu/import/git/gcc-test-ia32'


Index Nav: [Date Index] [Subject Index] [Author Index] [Thread Index]
Message Nav: [Date Prev] [Date Next] [Thread Prev] [Thread Next]