This is the mail archive of the libstdc++@gcc.gnu.org mailing list for the libstdc++ project.


Index Nav: [Date Index] [Subject Index] [Author Index] [Thread Index]
Message Nav: [Date Prev] [Date Next] [Thread Prev] [Thread Next]
Other format: [Raw text]

[Fwd: check error with libstdc++]


Hello,
This error is still occuring and we still have no responce. Can anyone help with this?
Thank you,
-Mike Cleary

--
*********************************************
Michael Cleary Email: mcleary@iol.unh.edu
Linux Consortium UNH InterOperability Lab
121 Technology Dr., Suite 2, Durham, NH 03824
Phone: 603-862-0401 http://www.iol.unh.edu
http://linux.iol.unh.edu/
*********************************************


--- Begin Message --- Greetings,
I have found the following check error on an alpha with the alphaev56 configuration in several sets of baseline and package. It occured with the bootstrap-gcc_2.95.3 baseline and the gcc-3_2-branch package, and with the basic baseline and the gcc-3_2-branch package, and with the basic-gcc_2.95.3 baseline and the gcc-3_2-branch package, and with the basic-gcc_3.2 baseline and the gcc-3_2-branch package.

=== libstdc++-v3 tests ===

Schedule of variations:
unix

Running target unix
Using /home/toolchain/baseline/install/alpha9/bootstrap-gcc_2.95.3/native/dejagnu-1.4
.3/share/dejagnu/baseboards/unix.exp as board description file for target.
Using /home/toolchain/baseline/install/alpha9/bootstrap-gcc_2.95.3/native/dejagnu-1.4
.3/share/dejagnu/config/unix.exp as generic interface file for target.
Using /mnt/u9/toolchain/buildsys/source/gcc-3_2-branch/libstdc++-v3/testsuite/config/
default.exp as tool-and-target-specific interface file.
Running /mnt/u9/toolchain/buildsys/source/gcc-3_2-branch/libstdc++-v3/testsuite/libst
dc++-v3.dg/dg.exp ...
FAIL: 22_locale/codecvt_members_char_char.cc (test for excess errors)
WARNING: 22_locale/codecvt_members_char_char.cc compilation failed to produce executa
ble
XPASS: 22_locale/collate_members_wchar_t.cc execution test
XPASS: 22_locale/ctype_is_wchar_t.cc execution test
FAIL: 22_locale/facet.cc (test for excess errors)
WARNING: 22_locale/facet.cc compilation failed to produce executable
FAIL: 22_locale/global_templates.cc (test for excess errors)
WARNING: 22_locale/global_templates.cc compilation failed to produce executable
XPASS: 22_locale/money_get_members_wchar_t.cc execution test
XPASS: 22_locale/money_put_members_wchar_t.cc execution test
XPASS: 22_locale/moneypunct_members_wchar_t.cc execution test
XPASS: 22_locale/num_get_members_wchar_t.cc execution test
XPASS: 22_locale/num_put_members_wchar_t.cc execution test
XPASS: 22_locale/numpunct_members_wchar_t.cc execution test
FAIL: 22_locale/operators.cc (test for excess errors)
WARNING: 22_locale/operators.cc compilation failed to produce executable
FAIL: 22_locale/static_members.cc (test for excess errors)
WARNING: 22_locale/static_members.cc compilation failed to produce executable
XPASS: 22_locale/time_get_members_wchar_t.cc execution test
XPASS: 22_locale/time_put_members_wchar_t.cc execution test
FAIL: 26_numerics/c99_classification_macros_c.cc (test for excess errors)
FAIL: ext/allocators.cc execution test
FAIL: ext/rope.cc execution test
WARNING: program timed out.
FAIL: thread/pthread1.cc execution test
FAIL: thread/pthread4.cc execution test
FAIL: thread/pthread5.cc execution test
FAIL: thread/pthread6.cc execution test

=== libstdc++-v3 Summary ===

# of expected passes 416
# of unexpected failures 12
# of unexpected successes 10
# of expected failures 16
make[4]: *** [check-DEJAGNU] Error 1
make[4]: Leaving directory `/mnt/u9/toolchain/buildsys/build/alpha9/bootstrap-gcc_2.9
5.3/native/gcc-3_2-branch/alphaev56-unknown-linux-gnu/libstdc++-v3/testsuite'
make[3]: *** [check-am] Error 2
make[3]: Target `check' not remade because of errors.
make[3]: Leaving directory `/mnt/u9/toolchain/buildsys/build/alpha9/bootstrap-gcc_2.9
5.3/native/gcc-3_2-branch/alphaev56-unknown-linux-gnu/libstdc++-v3/testsuite'
make[3]: Entering directory `/mnt/u9/toolchain/buildsys/build/alpha9/bootstrap-gcc_2.
95.3/native/gcc-3_2-branch/alphaev56-unknown-linux-gnu/libstdc++-v3'
make[3]: Nothing to be done for `check-am'.
make[3]: Leaving directory `/mnt/u9/toolchain/buildsys/build/alpha9/bootstrap-gcc_2.9
5.3/native/gcc-3_2-branch/alphaev56-unknown-linux-gnu/libstdc++-v3'
make[2]: *** [check-recursive] Error 1
make[2]: Target `check' not remade because of errors.
make[2]: Leaving directory `/mnt/u9/toolchain/buildsys/build/alpha9/bootstrap-gcc_2.9
5.3/native/gcc-3_2-branch/alphaev56-unknown-linux-gnu/libstdc++-v3'
make[1]: *** [check-target-libstdc++-v3] Error 2

If anyone can help with this it would be greatly appreciated.
Salutations,
-Mike Cleary

--
*********************************************
Michael Cleary Email: mcleary@iol.unh.edu
Linux Consortium UNH InterOperability Lab
121 Technology Dr., Suite 2, Durham, NH 03824
Phone: 603-862-0401 http://www.iol.unh.edu
http://linux.iol.unh.edu/
*********************************************



--- End Message ---

Index Nav: [Date Index] [Subject Index] [Author Index] [Thread Index]
Message Nav: [Date Prev] [Date Next] [Thread Prev] [Thread Next]