This is the mail archive of the libstdc++@gcc.gnu.org mailing list for the libstdc++ project.


Index Nav: [Date Index] [Subject Index] [Author Index] [Thread Index]
Message Nav: [Date Prev] [Date Next] [Thread Prev] [Thread Next]

bootstrap failure with colons in objdir


<singing>Oops, I did it again...</singing>

This was fixed a few months ago, but now reappeared: libstdc++ causes
a bootstrap failure if the name of objdir contains a colon.

gmake[2]: Entering directory `/files/pfeifer/OBJ:NOW/i386-unknown-freebsd4.3/libstdc++-v3'
gmake "AR_FLAGS=rc" 	"CC_FOR_BUILD=gcc" 	"CC_FOR_TARGET=/files/pfeifer/OBJ:NOW/gcc/xgcc -B/files/pfeifer/OBJ:NOW/gcc/ -B/files/pfeifer/GCC/i386-unknown-freebsd4.3/bin/ -B/files/pfeifer/GCC/i386-unknown-freebsd4.3/lib/ -isystem /files/pfeifer/GCC/i386-unknown-freebsd4.3/include" 	"CFLAGS=-g -O2" 	"CXXFLAGS=-g -O2" 	"CFLAGS_FOR_BUILD=" 	"CFLAGS_FOR_TARGET=-g -O2" 	"INSTALL=/bin/sh /.amd_mnt/vexpert/files8/test/gcc/cvs/install-sh -c" 	"INSTALL_DATA=/bin/sh /.amd_mnt/vexpert/files8/test/gcc/cvs/install-sh -c -m 644" 	"INSTALL_PROGRAM=/bin/sh /.amd_mnt/vexpert/files8/test/gcc/cvs/install-sh -c " 	"INSTALL_SCRIPT=/bin/sh /.amd_mnt/vexpert/files8/test/gcc/cvs/install-sh -c" 	"LDFLAGS=" 	"LIBCFLAGS=-g -O2" 	"LIBCFLAGS_FOR_TARGET=-g -O2" 	"MAKE=gmake" 	"MAKEINFO=makeinfo   " 	"PICFLAG=" 	"PICFLAG_FOR_TARGET=" 	"SHELL=/bin/sh" 	"RUNTESTFLAGS=" 	"exec_prefix=/files/pfeifer/GCC" 	"infodir=/files/pfeifer/GCC/info" 	"libdir=/files/pfeifer/GCC/lib" 	"includedir=/files/pfeifer/GCC/include" !
	"prefix=/files/pfeifer/GCC" 	"tooldir=/files/pfeifer/GCC/i386-unknown-freebsd4.3" 	"AR=ar" 	"AS=as" 	"LD=ld" 	"LIBCFLAGS=-g -O2" 	"PICFLAG=" 	"RANLIB=ranlib" 	"NM=nm" 	"NM_FOR_BUILD=" 	"NM_FOR_TARGET=nm" 	"DESTDIR=" 	"WERROR="  all-recursive
gmake[3]: Entering directory `/files/pfeifer/OBJ:NOW/i386-unknown-freebsd4.3/libstdc++-v3'
Making all in include
gmake[4]: Entering directory `/files/pfeifer/OBJ:NOW/i386-unknown-freebsd4.3/libstdc++-v3/include'
Makefile:367: *** target pattern contains no `%'.  Stop.
gmake[4]: Leaving directory `/files/pfeifer/OBJ:NOW/i386-unknown-freebsd4.3/libstdc++-v3/include'
gmake[3]: *** [all-recursive] Error 1
gmake[3]: Leaving directory `/files/pfeifer/OBJ:NOW/i386-unknown-freebsd4.3/libstdc++-v3'
gmake[2]: *** [all-recursive-am] Error 2
gmake[2]: Leaving directory `/files/pfeifer/OBJ:NOW/i386-unknown-freebsd4.3/libstdc++-v3'
gmake[1]: *** [all-target-libstdc++-v3] Error 2
gmake[1]: Leaving directory `/files/pfeifer/OBJ:NOW'
gmake: *** [bootstrap] Error 2

Seen on i386-unknown-freebsd4.3 with GNU make 3.79.1.

Gerald


Index Nav: [Date Index] [Subject Index] [Author Index] [Thread Index]
Message Nav: [Date Prev] [Date Next] [Thread Prev] [Thread Next]