This is the mail archive of the java-patches@gcc.gnu.org mailing list for the Java project.


Index Nav: [Date Index] [Subject Index] [Author Index] [Thread Index]
Message Nav: [Date Prev] [Date Next] [Thread Prev] [Thread Next]
Other format: [Raw text]

Last patch breaks bootstrap of mainline


Michael, probably due to your patch?

/usr/src/GNU/builds-combined/build-native/gcc/gcj -B/usr/src/GNU/builds-combined/build-native/i686-pc-linux-gnu/libjava/ -B/usr/src/GNU/builds-combined/build-native/gcc/ --encoding=UTF-8 -Wno-deprecated -C -g -classpath '' -bootclasspath /usr/src/GNU/builds-combined/build-native/i686-pc-linux-gnu/libjava:../../../../combined/libjava -d /usr/src/GNU/builds-combined/build-native/i686-pc-linux-gnu/libjava ../../../../combined/libjava/gnu/java/nio/SelectorImpl.java
../../../../combined/libjava/gnu/java/nio/SelectorImpl.java: In class `gnu.java.nio.SelectorImpl':
../../../../combined/libjava/gnu/java/nio/SelectorImpl.java: In method `gnu.java.nio.SelectorImpl.getFDsAsArray(int)':
../../../../combined/libjava/gnu/java/nio/SelectorImpl.java:128: error: No variable `fd' defined in type `gnu.java.nio.SelectionKeyImpl'.
               result[counter] = key.fd;
                                    ^
../../../../combined/libjava/gnu/java/nio/SelectorImpl.java: In method `gnu.java.nio.SelectorImpl.select(long)':
../../../../combined/libjava/gnu/java/nio/SelectorImpl.java:175: error: No variable `fd' defined in type `gnu.java.nio.SelectionKeyImpl'.
               if (key.fd == read[i])
                      ^
../../../../combined/libjava/gnu/java/nio/SelectorImpl.java:191: error: No variable `fd' defined in type `gnu.java.nio.SelectionKeyImpl'.
               if (key.fd == write[i])
                      ^
../../../../combined/libjava/gnu/java/nio/SelectorImpl.java: In method `gnu.java.nio.SelectorImpl.register(java.nio.channels.spi.AbstractSelectableChannel,int,java.lang.Object)':
../../../../combined/libjava/gnu/java/nio/SelectorImpl.java:256: error: Class `SelectionKeyImpl' is an abstract class. It can't be instantiated.
           result = new SelectionKeyImpl (ch, this, 0); // FIXME: last argument
                        ^
4 errors
make[1]: *** [gnu/java/nio/SelectorImpl.class] Error 1
make[1]: Leaving directory `/usr/src/GNU/builds-combined/build-native/i686-pc-linux-gnu/libjava'
make: *** [all-target-libjava] Error 2

-- 
Carlo Wood <carlo@alinoe.com>


Index Nav: [Date Index] [Subject Index] [Author Index] [Thread Index]
Message Nav: [Date Prev] [Date Next] [Thread Prev] [Thread Next]