This is the mail archive of the gcc@gcc.gnu.org mailing list for the GCC project.


Index Nav: [Date Index] [Subject Index] [Author Index] [Thread Index]
Message Nav: [Date Prev] [Date Next] [Thread Prev] [Thread Next]
Other format: [Raw text]

[tree-ssa] bootstrap failure on powerpc-apple-darwin6.6


Ever since the mainline was merged into the tree-ssa branch I cannot bootstrap on powerpc-apple-darwin6.6:

I am using GNU make 3.80, 2.05a.0(1)-release as /bin/sh.

I configure with "/Volumes/UFS_Partition/pinskia/src/gccssa/src/configure --enable-threads=posix --disable-nls --disable-multilib --prefix=/Volumes/UFS_Partition/pinskia/gccssa_c --enable-languages=c" inside "/Volumes/UFS_Partition/pinskia/src/gccssa/src/objdir_c"

Then I do a "make bootstrap"

Here is the error I get:
make[2]: Leaving directory `/Volumes/UFS_Partition/pinskia/src/gccssa/src/objdir_c/gcc'
echo timestamp > stage1_copy
echo stage2_build > stage_last
s=`/Volumes/UFS_Partition/pinskia/src/gccssa/src/objdir_c/gcc`; export s && cd ../libbanshee && echo `/Volumes/UFS_Partition/pinskia/src/gccssa/src/objdir_c/gcc` && make clean && make CC=" $s/stage1/xgcc -B$s/stage1/ -B/Volumes/UFS_Partition/pinskia/gccssa_c/powerpc-apple-darwin6.6/bin/" CFLAGS="-g -O2 " WERROR="-Werror" && cd ../gcc
/bin/sh: /Volumes/UFS_Partition/pinskia/src/gccssa/src/objdir_c/gcc: is a directory
/bin/sh: /Volumes/UFS_Partition/pinskia/src/gccssa/src/objdir_c/gcc: is a directory


make[2]: Entering directory `/Volumes/UFS_Partition/pinskia/src/gccssa/src/objdir_c/libbanshee'
Making clean in .
make[3]: Entering directory `/Volumes/UFS_Partition/pinskia/src/gccssa/src/objdir_c/libbanshee'
make[3]: Nothing to be done for `clean-am'.
make[3]: Leaving directory `/Volumes/UFS_Partition/pinskia/src/gccssa/src/objdir_c/libbanshee'
Making clean in libcompat
make[3]: Entering directory `/Volumes/UFS_Partition/pinskia/src/gccssa/src/objdir_c/libbanshee/ libcompat'
test -z "libbansheecompat.a" || rm -f libbansheecompat.a
rm -f *.o core *.core
make[3]: Leaving directory `/Volumes/UFS_Partition/pinskia/src/gccssa/src/objdir_c/libbanshee/ libcompat'
Making clean in points-to
make[3]: Entering directory `/Volumes/UFS_Partition/pinskia/src/gccssa/src/objdir_c/libbanshee/ points-to'
test -z "libandersen.a" || rm -f libandersen.a
rm -f *.o core *.core
make[3]: Leaving directory `/Volumes/UFS_Partition/pinskia/src/gccssa/src/objdir_c/libbanshee/ points-to'
Making clean in engine
make[3]: Entering directory `/Volumes/UFS_Partition/pinskia/src/gccssa/src/objdir_c/libbanshee/ engine'
test -z "libbansheeengine.a" || rm -f libbansheeengine.a
rm -f *.o core *.core
make[3]: Leaving directory `/Volumes/UFS_Partition/pinskia/src/gccssa/src/objdir_c/libbanshee/ engine'
make[2]: Leaving directory `/Volumes/UFS_Partition/pinskia/src/gccssa/src/objdir_c/libbanshee'
make[2]: Entering directory `/Volumes/UFS_Partition/pinskia/src/gccssa/src/objdir_c/libbanshee'
make "AR_FLAGS=rc" "CC_FOR_BUILD=gcc" "CFLAGS=-g -O2 " "CXXFLAGS=-g -O2" "CFLAGS_FOR_BUILD=-g -O2" "CFLAGS_FOR_TARGET=-O2 -g -O2" "INSTALL=/usr/bin/install -c" "INSTALL_DATA=/usr/bin/install -c -m 644" "INSTALL_PROGRAM=/usr/bin/install -c " "INSTALL_SCRIPT=/usr/bin/install -c" "LDFLAGS=" "LIBCFLAGS=-g -O2" "LIBCFLAGS_FOR_TARGET=-O2 -g -O2" "MAKE=make" "MAKEINFO=makeinfo " "PICFLAG=" "PICFLAG_FOR_TARGET=" "SHELL=/bin/sh" "EXPECT=expect" "RUNTEST=runtest" "RUNTESTFLAGS=" "exec_prefix=/Volumes/UFS_Partition/pinskia/gccssa_c" "infodir=/Volumes/UFS_Partition/pinskia/gccssa_c/info" "libdir=/Volumes/UFS_Partition/pinskia/gccssa_c/lib" "prefix=/Volumes/UFS_Partition/pinskia/gccssa_c" "tooldir=/Volumes/UFS_Partition/pinskia/gccssa_c/powerpc-apple- darwin6.6" "AR=ar" "AS=as" "CC=/stage1/xgcc -B/stage1/ -B/Volumes/UFS_Partition/pinskia/gccssa_c/powerpc-apple-darwin6.6/bin/" "CXX=c++" "LD=ld" "LIBCFLAGS=-g -O2" "NM=nm" "PICFLAG=" "RANLIB=ranlib" "DESTDIR=" all-recursive
make[3]: Entering directory `/Volumes/UFS_Partition/pinskia/src/gccssa/src/objdir_c/libbanshee'
Making all in engine
make[4]: Entering directory `/Volumes/UFS_Partition/pinskia/src/gccssa/src/objdir_c/libbanshee/ engine'
/stage1/xgcc -B/stage1/ -B/Volumes/UFS_Partition/pinskia/gccssa_c/powerpc-apple-darwin6.6/bin/ -DHAVE_CONFIG_H -I. -I/Volumes/UFS_Partition/pinskia/src/gccssa/src/libbanshee/engine -I.. -I/Volumes/UFS_Partition/pinskia/src/gccssa/src/libbanshee/engine/../ libcompat -I/Volumes/UFS_Partition/pinskia/src/gccssa/src/libbanshee/engine/../ include -I. -Ddeletes= -Dtraditional= -Dsameregion= -Dparentptr= -fno-strict-aliasing -g -O2 -c /Volumes/UFS_Partition/pinskia/src/gccssa/src/libbanshee/engine/array.c
/bin/sh: /stage1/xgcc: No such file or directory
make[4]: *** [array.o] Error 127
make[4]: Leaving directory `/Volumes/UFS_Partition/pinskia/src/gccssa/src/objdir_c/libbanshee/ engine'
make[3]: *** [all-recursive] Error 1
make[3]: Leaving directory `/Volumes/UFS_Partition/pinskia/src/gccssa/src/objdir_c/libbanshee'
make[2]: *** [all-recursive-am] Error 2
make[2]: Leaving directory `/Volumes/UFS_Partition/pinskia/src/gccssa/src/objdir_c/libbanshee'
make[1]: *** [stage2_build] Error 2
make[1]: Leaving directory `/Volumes/UFS_Partition/pinskia/src/gccssa/src/objdir_c/gcc'
make: *** [bootstrap] Error 2
gcc_build: error: Could not bootstrap the compiler



Index Nav: [Date Index] [Subject Index] [Author Index] [Thread Index]
Message Nav: [Date Prev] [Date Next] [Thread Prev] [Thread Next]