This is the mail archive of the gcc-testresults@gcc.gnu.org mailing list for the GCC project.


Index Nav: [Date Index] [Subject Index] [Author Index] [Thread Index]
Message Nav: [Date Prev] [Date Next] [Thread Prev] [Thread Next]
Other format: [Raw text]

Results for 4.6.0 20110304 (experimental) [trunk revision 170678] (GCC) testsuite on i386-pc-rtems4.11


LAST_UPDATED: Fri Mar  4 16:23:50 UTC 2011 (revision 170678)

Target is i386-pc-rtems4.11
Host   is x86_64-unknown-linux-gnu

		=== gcc tests ===


Running target rtems-i386-qemu
FAIL: gcc.c-torture/compile/limits-exprparen.c  -O0  (internal compiler error)
FAIL: gcc.c-torture/compile/limits-exprparen.c  -O0  (test for excess errors)
FAIL: gcc.c-torture/compile/limits-exprparen.c  -O1  (internal compiler error)
FAIL: gcc.c-torture/compile/limits-exprparen.c  -O1  (test for excess errors)
FAIL: gcc.c-torture/compile/limits-exprparen.c  -O2  (internal compiler error)
FAIL: gcc.c-torture/compile/limits-exprparen.c  -O2  (test for excess errors)
FAIL: gcc.c-torture/compile/limits-exprparen.c  -O3 -fomit-frame-pointer  (internal compiler error)
FAIL: gcc.c-torture/compile/limits-exprparen.c  -O3 -fomit-frame-pointer  (test for excess errors)
FAIL: gcc.c-torture/compile/limits-exprparen.c  -O3 -g  (internal compiler error)
FAIL: gcc.c-torture/compile/limits-exprparen.c  -O3 -g  (test for excess errors)
FAIL: gcc.c-torture/compile/limits-exprparen.c  -Os  (internal compiler error)
FAIL: gcc.c-torture/compile/limits-exprparen.c  -Os  (test for excess errors)
FAIL: gcc.c-torture/compile/limits-exprparen.c  -O2 -flto -flto-partition=none  (internal compiler error)
FAIL: gcc.c-torture/compile/limits-exprparen.c  -O2 -flto -flto-partition=none  (test for excess errors)
FAIL: gcc.c-torture/compile/limits-exprparen.c  -O2 -flto  (internal compiler error)
FAIL: gcc.c-torture/compile/limits-exprparen.c  -O2 -flto  (test for excess errors)
FAIL: gcc.c-torture/execute/builtins/20010124-1.c compilation,  -O2 -flto -flto-partition=none 
UNRESOLVED: gcc.c-torture/execute/builtins/20010124-1.c execution,  -O2 -flto -flto-partition=none 
FAIL: gcc.c-torture/execute/builtins/20010124-1.c compilation,  -O2 -flto 
UNRESOLVED: gcc.c-torture/execute/builtins/20010124-1.c execution,  -O2 -flto 
FAIL: gcc.c-torture/execute/builtins/fprintf.c compilation,  -O2 -flto -flto-partition=none 
UNRESOLVED: gcc.c-torture/execute/builtins/fprintf.c execution,  -O2 -flto -flto-partition=none 
FAIL: gcc.c-torture/execute/builtins/fprintf.c compilation,  -O2 -flto 
UNRESOLVED: gcc.c-torture/execute/builtins/fprintf.c execution,  -O2 -flto 
FAIL: gcc.c-torture/execute/builtins/memchr.c compilation,  -O2 -flto -flto-partition=none 
UNRESOLVED: gcc.c-torture/execute/builtins/memchr.c execution,  -O2 -flto -flto-partition=none 
FAIL: gcc.c-torture/execute/builtins/memchr.c compilation,  -O2 -flto 
UNRESOLVED: gcc.c-torture/execute/builtins/memchr.c execution,  -O2 -flto 
FAIL: gcc.c-torture/execute/builtins/memcmp.c compilation,  -O2 -flto -flto-partition=none 
UNRESOLVED: gcc.c-torture/execute/builtins/memcmp.c execution,  -O2 -flto -flto-partition=none 
FAIL: gcc.c-torture/execute/builtins/memcmp.c compilation,  -O2 -flto 
UNRESOLVED: gcc.c-torture/execute/builtins/memcmp.c execution,  -O2 -flto 
FAIL: gcc.c-torture/execute/builtins/memcpy-chk.c compilation,  -O2 -flto -flto-partition=none 
UNRESOLVED: gcc.c-torture/execute/builtins/memcpy-chk.c execution,  -O2 -flto -flto-partition=none 
FAIL: gcc.c-torture/execute/builtins/memcpy-chk.c compilation,  -O2 -flto 
UNRESOLVED: gcc.c-torture/execute/builtins/memcpy-chk.c execution,  -O2 -flto 
FAIL: gcc.c-torture/execute/builtins/memmove-2.c compilation,  -O2 -flto -flto-partition=none 
UNRESOLVED: gcc.c-torture/execute/builtins/memmove-2.c execution,  -O2 -flto -flto-partition=none 
FAIL: gcc.c-torture/execute/builtins/memmove-2.c compilation,  -O2 -flto 
UNRESOLVED: gcc.c-torture/execute/builtins/memmove-2.c execution,  -O2 -flto 
FAIL: gcc.c-torture/execute/builtins/memmove-chk.c compilation,  -O2 -flto -flto-partition=none 
UNRESOLVED: gcc.c-torture/execute/builtins/memmove-chk.c execution,  -O2 -flto -flto-partition=none 
FAIL: gcc.c-torture/execute/builtins/memmove-chk.c compilation,  -O2 -flto 
UNRESOLVED: gcc.c-torture/execute/builtins/memmove-chk.c execution,  -O2 -flto 
FAIL: gcc.c-torture/execute/builtins/memmove.c compilation,  -O2 -flto -flto-partition=none 
UNRESOLVED: gcc.c-torture/execute/builtins/memmove.c execution,  -O2 -flto -flto-partition=none 
FAIL: gcc.c-torture/execute/builtins/memmove.c compilation,  -O2 -flto 
UNRESOLVED: gcc.c-torture/execute/builtins/memmove.c execution,  -O2 -flto 
FAIL: gcc.c-torture/execute/builtins/memops-asm.c compilation,  -O2 -flto -flto-partition=none 
UNRESOLVED: gcc.c-torture/execute/builtins/memops-asm.c execution,  -O2 -flto -flto-partition=none 
FAIL: gcc.c-torture/execute/builtins/memops-asm.c compilation,  -O2 -flto 
UNRESOLVED: gcc.c-torture/execute/builtins/memops-asm.c execution,  -O2 -flto 
FAIL: gcc.c-torture/execute/builtins/mempcpy-chk.c compilation,  -O2 -flto -flto-partition=none 
UNRESOLVED: gcc.c-torture/execute/builtins/mempcpy-chk.c execution,  -O2 -flto -flto-partition=none 
FAIL: gcc.c-torture/execute/builtins/mempcpy-chk.c compilation,  -O2 -flto 
UNRESOLVED: gcc.c-torture/execute/builtins/mempcpy-chk.c execution,  -O2 -flto 
FAIL: gcc.c-torture/execute/builtins/memset-chk.c compilation,  -O2 -flto -flto-partition=none 
UNRESOLVED: gcc.c-torture/execute/builtins/memset-chk.c execution,  -O2 -flto -flto-partition=none 
FAIL: gcc.c-torture/execute/builtins/memset-chk.c compilation,  -O2 -flto 
UNRESOLVED: gcc.c-torture/execute/builtins/memset-chk.c execution,  -O2 -flto 
FAIL: gcc.c-torture/execute/builtins/memset.c compilation,  -O2 -flto -flto-partition=none 
UNRESOLVED: gcc.c-torture/execute/builtins/memset.c execution,  -O2 -flto -flto-partition=none 
FAIL: gcc.c-torture/execute/builtins/memset.c compilation,  -O2 -flto 
UNRESOLVED: gcc.c-torture/execute/builtins/memset.c execution,  -O2 -flto 
FAIL: gcc.c-torture/execute/builtins/pr22237.c compilation,  -O2 -flto -flto-partition=none 
UNRESOLVED: gcc.c-torture/execute/builtins/pr22237.c execution,  -O2 -flto -flto-partition=none 
FAIL: gcc.c-torture/execute/builtins/pr22237.c compilation,  -O2 -flto 
UNRESOLVED: gcc.c-torture/execute/builtins/pr22237.c execution,  -O2 -flto 
FAIL: gcc.c-torture/execute/builtins/pr23484-chk.c compilation,  -O2 -flto -flto-partition=none 
UNRESOLVED: gcc.c-torture/execute/builtins/pr23484-chk.c execution,  -O2 -flto -flto-partition=none 
FAIL: gcc.c-torture/execute/builtins/pr23484-chk.c compilation,  -O2 -flto 
UNRESOLVED: gcc.c-torture/execute/builtins/pr23484-chk.c execution,  -O2 -flto 
FAIL: gcc.c-torture/execute/builtins/snprintf-chk.c compilation,  -O2 -flto -flto-partition=none 
UNRESOLVED: gcc.c-torture/execute/builtins/snprintf-chk.c execution,  -O2 -flto -flto-partition=none 
FAIL: gcc.c-torture/execute/builtins/snprintf-chk.c compilation,  -O2 -flto 
UNRESOLVED: gcc.c-torture/execute/builtins/snprintf-chk.c execution,  -O2 -flto 
FAIL: gcc.c-torture/execute/builtins/sprintf-chk.c compilation,  -O2 -flto -flto-partition=none 
UNRESOLVED: gcc.c-torture/execute/builtins/sprintf-chk.c execution,  -O2 -flto -flto-partition=none 
FAIL: gcc.c-torture/execute/builtins/sprintf-chk.c compilation,  -O2 -flto 
UNRESOLVED: gcc.c-torture/execute/builtins/sprintf-chk.c execution,  -O2 -flto 
FAIL: gcc.c-torture/execute/builtins/sprintf.c compilation,  -O2 -flto -flto-partition=none 
UNRESOLVED: gcc.c-torture/execute/builtins/sprintf.c execution,  -O2 -flto -flto-partition=none 
FAIL: gcc.c-torture/execute/builtins/sprintf.c compilation,  -O2 -flto 
UNRESOLVED: gcc.c-torture/execute/builtins/sprintf.c execution,  -O2 -flto 
FAIL: gcc.c-torture/execute/builtins/stpcpy-chk.c compilation,  -O2 -flto -flto-partition=none 
UNRESOLVED: gcc.c-torture/execute/builtins/stpcpy-chk.c execution,  -O2 -flto -flto-partition=none 
FAIL: gcc.c-torture/execute/builtins/stpcpy-chk.c compilation,  -O2 -flto 
UNRESOLVED: gcc.c-torture/execute/builtins/stpcpy-chk.c execution,  -O2 -flto 
FAIL: gcc.c-torture/execute/builtins/strcat-chk.c compilation,  -O2 -flto -flto-partition=none 
UNRESOLVED: gcc.c-torture/execute/builtins/strcat-chk.c execution,  -O2 -flto -flto-partition=none 
FAIL: gcc.c-torture/execute/builtins/strcat-chk.c compilation,  -O2 -flto 
UNRESOLVED: gcc.c-torture/execute/builtins/strcat-chk.c execution,  -O2 -flto 
FAIL: gcc.c-torture/execute/builtins/strcat.c compilation,  -O2 -flto -flto-partition=none 
UNRESOLVED: gcc.c-torture/execute/builtins/strcat.c execution,  -O2 -flto -flto-partition=none 
FAIL: gcc.c-torture/execute/builtins/strcat.c compilation,  -O2 -flto 
UNRESOLVED: gcc.c-torture/execute/builtins/strcat.c execution,  -O2 -flto 
FAIL: gcc.c-torture/execute/builtins/strchr.c compilation,  -O2 -flto -flto-partition=none 
UNRESOLVED: gcc.c-torture/execute/builtins/strchr.c execution,  -O2 -flto -flto-partition=none 
FAIL: gcc.c-torture/execute/builtins/strchr.c compilation,  -O2 -flto 
UNRESOLVED: gcc.c-torture/execute/builtins/strchr.c execution,  -O2 -flto 
FAIL: gcc.c-torture/execute/builtins/strcmp.c compilation,  -O2 -flto -flto-partition=none 
UNRESOLVED: gcc.c-torture/execute/builtins/strcmp.c execution,  -O2 -flto -flto-partition=none 
FAIL: gcc.c-torture/execute/builtins/strcmp.c compilation,  -O2 -flto 
UNRESOLVED: gcc.c-torture/execute/builtins/strcmp.c execution,  -O2 -flto 
FAIL: gcc.c-torture/execute/builtins/strcpy-2.c compilation,  -O2 -flto -flto-partition=none 
UNRESOLVED: gcc.c-torture/execute/builtins/strcpy-2.c execution,  -O2 -flto -flto-partition=none 
FAIL: gcc.c-torture/execute/builtins/strcpy-2.c compilation,  -O2 -flto 
UNRESOLVED: gcc.c-torture/execute/builtins/strcpy-2.c execution,  -O2 -flto 
FAIL: gcc.c-torture/execute/builtins/strcpy-chk.c compilation,  -O2 -flto -flto-partition=none 
UNRESOLVED: gcc.c-torture/execute/builtins/strcpy-chk.c execution,  -O2 -flto -flto-partition=none 
FAIL: gcc.c-torture/execute/builtins/strcpy-chk.c compilation,  -O2 -flto 
UNRESOLVED: gcc.c-torture/execute/builtins/strcpy-chk.c execution,  -O2 -flto 
FAIL: gcc.c-torture/execute/builtins/strcpy.c compilation,  -O2 -flto -flto-partition=none 
UNRESOLVED: gcc.c-torture/execute/builtins/strcpy.c execution,  -O2 -flto -flto-partition=none 
FAIL: gcc.c-torture/execute/builtins/strcpy.c compilation,  -O2 -flto 
UNRESOLVED: gcc.c-torture/execute/builtins/strcpy.c execution,  -O2 -flto 
FAIL: gcc.c-torture/execute/builtins/strlen-2.c compilation,  -O2 -flto -flto-partition=none 
UNRESOLVED: gcc.c-torture/execute/builtins/strlen-2.c execution,  -O2 -flto -flto-partition=none 
FAIL: gcc.c-torture/execute/builtins/strlen-2.c compilation,  -O2 -flto 
UNRESOLVED: gcc.c-torture/execute/builtins/strlen-2.c execution,  -O2 -flto 
FAIL: gcc.c-torture/execute/builtins/strlen-3.c compilation,  -O2 -flto -flto-partition=none 
UNRESOLVED: gcc.c-torture/execute/builtins/strlen-3.c execution,  -O2 -flto -flto-partition=none 
FAIL: gcc.c-torture/execute/builtins/strlen-3.c compilation,  -O2 -flto 
UNRESOLVED: gcc.c-torture/execute/builtins/strlen-3.c execution,  -O2 -flto 
FAIL: gcc.c-torture/execute/builtins/strlen.c compilation,  -O2 -flto -flto-partition=none 
UNRESOLVED: gcc.c-torture/execute/builtins/strlen.c execution,  -O2 -flto -flto-partition=none 
FAIL: gcc.c-torture/execute/builtins/strlen.c compilation,  -O2 -flto 
UNRESOLVED: gcc.c-torture/execute/builtins/strlen.c execution,  -O2 -flto 
FAIL: gcc.c-torture/execute/builtins/strncat-chk.c compilation,  -O2 -flto -flto-partition=none 
UNRESOLVED: gcc.c-torture/execute/builtins/strncat-chk.c execution,  -O2 -flto -flto-partition=none 
FAIL: gcc.c-torture/execute/builtins/strncat-chk.c compilation,  -O2 -flto 
UNRESOLVED: gcc.c-torture/execute/builtins/strncat-chk.c execution,  -O2 -flto 
FAIL: gcc.c-torture/execute/builtins/strncmp-2.c compilation,  -O2 -flto -flto-partition=none 
UNRESOLVED: gcc.c-torture/execute/builtins/strncmp-2.c execution,  -O2 -flto -flto-partition=none 
FAIL: gcc.c-torture/execute/builtins/strncmp-2.c compilation,  -O2 -flto 
UNRESOLVED: gcc.c-torture/execute/builtins/strncmp-2.c execution,  -O2 -flto 
FAIL: gcc.c-torture/execute/builtins/strncmp.c compilation,  -O2 -flto -flto-partition=none 
UNRESOLVED: gcc.c-torture/execute/builtins/strncmp.c execution,  -O2 -flto -flto-partition=none 
FAIL: gcc.c-torture/execute/builtins/strncmp.c compilation,  -O2 -flto 
UNRESOLVED: gcc.c-torture/execute/builtins/strncmp.c execution,  -O2 -flto 
FAIL: gcc.c-torture/execute/builtins/strncpy-chk.c compilation,  -O2 -flto -flto-partition=none 
UNRESOLVED: gcc.c-torture/execute/builtins/strncpy-chk.c execution,  -O2 -flto -flto-partition=none 
FAIL: gcc.c-torture/execute/builtins/strncpy-chk.c compilation,  -O2 -flto 
UNRESOLVED: gcc.c-torture/execute/builtins/strncpy-chk.c execution,  -O2 -flto 
FAIL: gcc.c-torture/execute/builtins/strncpy.c compilation,  -O2 -flto -flto-partition=none 
UNRESOLVED: gcc.c-torture/execute/builtins/strncpy.c execution,  -O2 -flto -flto-partition=none 
FAIL: gcc.c-torture/execute/builtins/strncpy.c compilation,  -O2 -flto 
UNRESOLVED: gcc.c-torture/execute/builtins/strncpy.c execution,  -O2 -flto 
FAIL: gcc.c-torture/execute/builtins/strstr-asm.c compilation,  -O2 -flto -flto-partition=none 
UNRESOLVED: gcc.c-torture/execute/builtins/strstr-asm.c execution,  -O2 -flto -flto-partition=none 
FAIL: gcc.c-torture/execute/builtins/strstr-asm.c compilation,  -O2 -flto 
UNRESOLVED: gcc.c-torture/execute/builtins/strstr-asm.c execution,  -O2 -flto 
FAIL: gcc.c-torture/execute/builtins/strstr.c compilation,  -O2 -flto -flto-partition=none 
UNRESOLVED: gcc.c-torture/execute/builtins/strstr.c execution,  -O2 -flto -flto-partition=none 
FAIL: gcc.c-torture/execute/builtins/strstr.c compilation,  -O2 -flto 
UNRESOLVED: gcc.c-torture/execute/builtins/strstr.c execution,  -O2 -flto 
FAIL: gcc.c-torture/execute/builtins/vsnprintf-chk.c compilation,  -O2 -flto -flto-partition=none 
UNRESOLVED: gcc.c-torture/execute/builtins/vsnprintf-chk.c execution,  -O2 -flto -flto-partition=none 
FAIL: gcc.c-torture/execute/builtins/vsnprintf-chk.c compilation,  -O2 -flto 
UNRESOLVED: gcc.c-torture/execute/builtins/vsnprintf-chk.c execution,  -O2 -flto 
FAIL: gcc.c-torture/execute/builtins/vsprintf-chk.c compilation,  -O2 -flto -flto-partition=none 
UNRESOLVED: gcc.c-torture/execute/builtins/vsprintf-chk.c execution,  -O2 -flto -flto-partition=none 
FAIL: gcc.c-torture/execute/builtins/vsprintf-chk.c compilation,  -O2 -flto 
UNRESOLVED: gcc.c-torture/execute/builtins/vsprintf-chk.c execution,  -O2 -flto 
WARNING: program timed out.
FAIL: gcc.c-torture/execute/20101011-1.c execution,  -O0 
WARNING: program timed out.
FAIL: gcc.c-torture/execute/20101011-1.c execution,  -O1 
WARNING: program timed out.
FAIL: gcc.c-torture/execute/20101011-1.c execution,  -O2 
FAIL: gcc.c-torture/execute/20101011-1.c execution,  -O3 -fomit-frame-pointer 
WARNING: program timed out.
FAIL: gcc.c-torture/execute/20101011-1.c execution,  -O3 -g 
WARNING: program timed out.
FAIL: gcc.c-torture/execute/20101011-1.c execution,  -Os 
WARNING: program timed out.
FAIL: gcc.c-torture/execute/20101011-1.c execution,  -O2 -flto -flto-partition=none 
WARNING: program timed out.
FAIL: gcc.c-torture/execute/20101011-1.c execution,  -O2 -flto 
FAIL: gcc.c-torture/execute/980709-1.c compilation,  -O2 -flto -flto-partition=none 
UNRESOLVED: gcc.c-torture/execute/980709-1.c execution,  -O2 -flto -flto-partition=none 
FAIL: gcc.c-torture/execute/980709-1.c compilation,  -O2 -flto 
UNRESOLVED: gcc.c-torture/execute/980709-1.c execution,  -O2 -flto 
FAIL: gcc.c-torture/execute/memcpy-1.c execution,  -O0 
FAIL: gcc.c-torture/execute/memcpy-1.c execution,  -O1 
FAIL: gcc.c-torture/execute/memcpy-1.c execution,  -O2 
FAIL: gcc.c-torture/execute/memcpy-1.c execution,  -O3 -fomit-frame-pointer 
FAIL: gcc.c-torture/execute/memcpy-1.c execution,  -O3 -fomit-frame-pointer -funroll-loops 
FAIL: gcc.c-torture/execute/memcpy-1.c execution,  -O3 -fomit-frame-pointer -funroll-all-loops -finline-functions 
FAIL: gcc.c-torture/execute/memcpy-1.c execution,  -O3 -g 
FAIL: gcc.c-torture/execute/memcpy-1.c execution,  -Os 
FAIL: gcc.c-torture/execute/memcpy-1.c execution,  -O2 -flto -flto-partition=none 
FAIL: gcc.c-torture/execute/memcpy-1.c execution,  -O2 -flto 
FAIL: gcc.c-torture/execute/pr28982b.c execution,  -O0 
FAIL: gcc.c-torture/execute/pr28982b.c execution,  -O1 
FAIL: gcc.c-torture/execute/pr28982b.c execution,  -O2 
FAIL: gcc.c-torture/execute/pr28982b.c execution,  -O3 -fomit-frame-pointer 
FAIL: gcc.c-torture/execute/pr28982b.c execution,  -O3 -fomit-frame-pointer -funroll-loops 
FAIL: gcc.c-torture/execute/pr28982b.c execution,  -O3 -fomit-frame-pointer -funroll-all-loops -finline-functions 
FAIL: gcc.c-torture/execute/pr28982b.c execution,  -O3 -g 
FAIL: gcc.c-torture/execute/pr28982b.c execution,  -Os 
FAIL: gcc.c-torture/execute/pr28982b.c execution,  -O2 -flto -flto-partition=none 
FAIL: gcc.c-torture/execute/pr28982b.c execution,  -O2 -flto 
FAIL: gcc.c-torture/execute/ieee/20041213-1.c compilation,  -O2 -flto -flto-partition=none 
UNRESOLVED: gcc.c-torture/execute/ieee/20041213-1.c execution,  -O2 -flto -flto-partition=none 
FAIL: gcc.c-torture/execute/ieee/20041213-1.c compilation,  -O2 -flto 
UNRESOLVED: gcc.c-torture/execute/ieee/20041213-1.c execution,  -O2 -flto 
FAIL: gcc.dg/debug/dwarf2/global-used-types.c scan-assembler-times DIE \\\\(0x[^\\n]*\\\\) DW_TAG_enumeration_type 1
FAIL: gcc.dg/debug/dwarf2/global-used-types.c scan-assembler-times DIE \\\\(0x[^\\n]*\\\\) DW_TAG_enumerator 2
FAIL: gcc.dg/debug/dwarf2/global-used-types.c scan-assembler-times ascii "a.0"[\\t ]+[^\\n]*DW_AT_name 1
FAIL: gcc.dg/debug/dwarf2/global-used-types.c scan-assembler-times ascii "b.0"[\\t ]+[^\\n]*DW_AT_name 1
FAIL: gcc.dg/debug/dwarf2/inline2.c scan-assembler-times \\\\(DIE \\\\([^\\n]*\\\\) DW_TAG_inlined_subroutine 6
FAIL: gcc.dg/debug/dwarf2/inline2.c scan-assembler-times \\\\(DIE \\\\([^\\n]*\\\\) DW_TAG_lexical_block 6
FAIL: gcc.dg/debug/dwarf2/inline2.c scan-assembler-times (?:byte|data1)[^\\n]*0x3[^\\n]* DW_AT_inline 3
FAIL: gcc.dg/debug/dwarf2/inline3.c scan-assembler-times  DW_AT_const_value 1
FAIL: gcc.dg/debug/dwarf2/pr37726.c scan-assembler-times "parm[^\\n]*"[^\\n]*DW_AT_name 2
FAIL: gcc.dg/debug/dwarf2/pr37726.c scan-assembler-times "var[^\\n]*"[^\\n]*DW_AT_name 2
FAIL: gcc.dg/debug/dwarf2/pr41445-1.c scan-assembler DW_TAG_variable[^\\\\r\\\\n]*[\\\\r\\\\n]+[^\\\\r\\\\n]*"varh[^\\\\r\\\\n]*DW_AT_name([^\\\\r\\\\n]*[\\\\r\\\\n]+[^\\\\r\\\\n]*DW_AT_)*[^\\\\r\\\\n]*[\\\\r\\\\n]+[^\\\\r\\\\n]*[^0-9a-fA-FxX](0x)?8[^0-9a-fA-FxX][^\\\\r\\\\n]*DW_AT_decl_line
FAIL: gcc.dg/debug/dwarf2/pr41445-1.c scan-assembler DW_TAG_variable[^\\\\r\\\\n]*[\\\\r\\\\n]+[^\\\\r\\\\n]*"vari[^\\\\r\\\\n]*DW_AT_name([^\\\\r\\\\n]*[\\\\r\\\\n]+[^\\\\r\\\\n]*DW_AT_)*[^\\\\r\\\\n]*[\\\\r\\\\n]+[^\\\\r\\\\n]*[^0-9a-fA-FxX](0xc|12)[^0-9a-fA-FxX][^\\\\r\\\\n]*DW_AT_decl_line
FAIL: gcc.dg/debug/dwarf2/pr41445-1.c scan-assembler DW_TAG_variable[^\\\\r\\\\n]*[\\\\r\\\\n]+[^\\\\r\\\\n]*"varj[^\\\\r\\\\n]*DW_AT_name([^\\\\r\\\\n]*[\\\\r\\\\n]+[^\\\\r\\\\n]*DW_AT_)*[^\\\\r\\\\n]*[\\\\r\\\\n]+[^\\\\r\\\\n]*[^0-9a-fA-FxX](0xd|13)[^0-9a-fA-FxX][^\\\\r\\\\n]*DW_AT_decl_line
FAIL: gcc.dg/debug/dwarf2/pr41445-2.c scan-assembler DW_TAG_variable[^\\\\r\\\\n]*[\\\\r\\\\n]+[^\\\\r\\\\n]*"varh[^\\\\r\\\\n]*DW_AT_name([^\\\\r\\\\n]*[\\\\r\\\\n]+[^\\\\r\\\\n]*DW_AT_)*[^\\\\r\\\\n]*[\\\\r\\\\n]+[^\\\\r\\\\n]*[^0-9a-fA-FxX](0x)?8[^0-9a-fA-FxX][^\\\\r\\\\n]*DW_AT_decl_line
FAIL: gcc.dg/debug/dwarf2/pr41445-2.c scan-assembler DW_TAG_variable[^\\\\r\\\\n]*[\\\\r\\\\n]+[^\\\\r\\\\n]*"vari[^\\\\r\\\\n]*DW_AT_name([^\\\\r\\\\n]*[\\\\r\\\\n]+[^\\\\r\\\\n]*DW_AT_)*[^\\\\r\\\\n]*[\\\\r\\\\n]+[^\\\\r\\\\n]*[^0-9a-fA-FxX](0xc|12)[^0-9a-fA-FxX][^\\\\r\\\\n]*DW_AT_decl_line
FAIL: gcc.dg/debug/dwarf2/pr41445-2.c scan-assembler DW_TAG_variable[^\\\\r\\\\n]*[\\\\r\\\\n]+[^\\\\r\\\\n]*"varj[^\\\\r\\\\n]*DW_AT_name([^\\\\r\\\\n]*[\\\\r\\\\n]+[^\\\\r\\\\n]*DW_AT_)*[^\\\\r\\\\n]*[\\\\r\\\\n]+[^\\\\r\\\\n]*[^0-9a-fA-FxX](0xd|13)[^0-9a-fA-FxX][^\\\\r\\\\n]*DW_AT_decl_line
FAIL: gcc.dg/debug/dwarf2/pr41445-3.c scan-assembler DW_TAG_variable[^\\\\r\\\\n]*[\\\\r\\\\n]+[^\\\\r\\\\n]*"varh[^\\\\r\\\\n]*DW_AT_name([^\\\\r\\\\n]*[\\\\r\\\\n]+[^\\\\r\\\\n]*DW_AT_)*[^\\\\r\\\\n]*[\\\\r\\\\n]+[^\\\\r\\\\n]*[^0-9a-fA-FxX](0x)?8[^0-9a-fA-FxX][^\\\\r\\\\n]*DW_AT_decl_line
FAIL: gcc.dg/debug/dwarf2/pr41445-3.c scan-assembler DW_TAG_variable[^\\\\r\\\\n]*[\\\\r\\\\n]+[^\\\\r\\\\n]*"vari[^\\\\r\\\\n]*DW_AT_name([^\\\\r\\\\n]*[\\\\r\\\\n]+[^\\\\r\\\\n]*DW_AT_)*[^\\\\r\\\\n]*[\\\\r\\\\n]+[^\\\\r\\\\n]*[^0-9a-fA-FxX](0xc|12)[^0-9a-fA-FxX][^\\\\r\\\\n]*DW_AT_decl_line
FAIL: gcc.dg/debug/dwarf2/pr41445-3.c scan-assembler DW_TAG_variable[^\\\\r\\\\n]*[\\\\r\\\\n]+[^\\\\r\\\\n]*"varj[^\\\\r\\\\n]*DW_AT_name([^\\\\r\\\\n]*[\\\\r\\\\n]+[^\\\\r\\\\n]*DW_AT_)*[^\\\\r\\\\n]*[\\\\r\\\\n]+[^\\\\r\\\\n]*[^0-9a-fA-FxX](0xd|13)[^0-9a-fA-FxX][^\\\\r\\\\n]*DW_AT_decl_line
FAIL: gcc.dg/debug/dwarf2/pr41445-4.c scan-assembler DW_TAG_variable[^\\\\r\\\\n]*[\\\\r\\\\n]+[^\\\\r\\\\n]*"varh[^\\\\r\\\\n]*DW_AT_name([^\\\\r\\\\n]*[\\\\r\\\\n]+[^\\\\r\\\\n]*DW_AT_)*[^\\\\r\\\\n]*[\\\\r\\\\n]+[^\\\\r\\\\n]*[^0-9a-fA-FxX](0x)?8[^0-9a-fA-FxX][^\\\\r\\\\n]*DW_AT_decl_line
FAIL: gcc.dg/debug/dwarf2/pr41445-4.c scan-assembler DW_TAG_variable[^\\\\r\\\\n]*[\\\\r\\\\n]+[^\\\\r\\\\n]*"vari[^\\\\r\\\\n]*DW_AT_name([^\\\\r\\\\n]*[\\\\r\\\\n]+[^\\\\r\\\\n]*DW_AT_)*[^\\\\r\\\\n]*[\\\\r\\\\n]+[^\\\\r\\\\n]*[^0-9a-fA-FxX](0xc|12)[^0-9a-fA-FxX][^\\\\r\\\\n]*DW_AT_decl_line
FAIL: gcc.dg/debug/dwarf2/pr41445-4.c scan-assembler DW_TAG_variable[^\\\\r\\\\n]*[\\\\r\\\\n]+[^\\\\r\\\\n]*"varj[^\\\\r\\\\n]*DW_AT_name([^\\\\r\\\\n]*[\\\\r\\\\n]+[^\\\\r\\\\n]*DW_AT_)*[^\\\\r\\\\n]*[\\\\r\\\\n]+[^\\\\r\\\\n]*[^0-9a-fA-FxX](0xd|13)[^0-9a-fA-FxX][^\\\\r\\\\n]*DW_AT_decl_line
FAIL: gcc.dg/debug/dwarf2/pr41445-5.c scan-assembler DW_TAG_variable[^\\\\r\\\\n]*[\\\\r\\\\n]+[^\\\\r\\\\n]*"vari[^\\\\r\\\\n]*DW_AT_name([^\\\\r\\\\n]*[\\\\r\\\\n]+[^\\\\r\\\\n]*DW_AT_)*[^\\\\r\\\\n]*[\\\\r\\\\n]+[^\\\\r\\\\n]*[^0-9a-fA-FxX](0x)?7[^0-9a-fA-FxX][^\\\\r\\\\n]*DW_AT_decl_line
FAIL: gcc.dg/debug/dwarf2/pr41445-5.c scan-assembler DW_TAG_variable[^\\\\r\\\\n]*[\\\\r\\\\n]+[^\\\\r\\\\n]*"varj[^\\\\r\\\\n]*DW_AT_name([^\\\\r\\\\n]*[\\\\r\\\\n]+[^\\\\r\\\\n]*DW_AT_)*[^\\\\r\\\\n]*[\\\\r\\\\n]+[^\\\\r\\\\n]*[^0-9a-fA-FxX](0xa|10)[^0-9a-fA-FxX][^\\\\r\\\\n]*DW_AT_decl_line
FAIL: gcc.dg/debug/dwarf2/pr41445-6.c scan-assembler DW_TAG_variable[^\\\\r\\\\n]*[\\\\r\\\\n]+[^\\\\r\\\\n]*"vari[^\\\\r\\\\n]*DW_AT_name([^\\\\r\\\\n]*[\\\\r\\\\n]+[^\\\\r\\\\n]*DW_AT_)*[^\\\\r\\\\n]*[\\\\r\\\\n]+[^\\\\r\\\\n]*[^0-9a-fA-FxX](0x)?7[^0-9a-fA-FxX][^\\\\r\\\\n]*DW_AT_decl_line
FAIL: gcc.dg/debug/dwarf2/pr41445-6.c scan-assembler DW_TAG_variable[^\\\\r\\\\n]*[\\\\r\\\\n]+[^\\\\r\\\\n]*"varj[^\\\\r\\\\n]*DW_AT_name([^\\\\r\\\\n]*[\\\\r\\\\n]+[^\\\\r\\\\n]*DW_AT_)*[^\\\\r\\\\n]*[\\\\r\\\\n]+[^\\\\r\\\\n]*[^0-9a-fA-FxX](0xa|10)[^0-9a-fA-FxX][^\\\\r\\\\n]*DW_AT_decl_line
FAIL: gcc.dg/debug/dwarf2/struct-loc1.c scan-assembler DW_TAG_structure_type[^\\\\r\\\\n]*[\\\\r\\\\n]+[^\\\\r\\\\n]*"foo[^\\\\r\\\\n]*DW_AT_name([^\\\\r\\\\n]*[\\\\r\\\\n]+[^\\\\r\\\\n]*DW_AT_)*[^\\\\r\\\\n]*[\\\\r\\\\n]+[^\\\\r\\\\n]*[^0-9a-fA-FxX](0x)?6[^0-9a-fA-FxX][^\\\\r\\\\n]*DW_AT_decl_line
FAIL: gcc.dg/uninit-pred-7_a.c bogus warning (test for bogus messages, line 26)
FAIL: gcc.dg/uninit-pred-8_a.c bogus warning (test for bogus messages, line 26)
FAIL: gcc.dg/graphite/run-id-1.c execution test
WARNING: program timed out.
FAIL: gcc.dg/graphite/interchange-7.c execution test
FAIL: gcc.dg/graphite/pr43012.c execution test
FAIL: gcc.dg/torture/fp-int-convert-float128-timode.c  -O0  (test for excess errors)
WARNING: gcc.dg/torture/fp-int-convert-float128-timode.c  -O0  compilation failed to produce executable
FAIL: gcc.dg/torture/fp-int-convert-float128-timode.c  -O1  (test for excess errors)
WARNING: gcc.dg/torture/fp-int-convert-float128-timode.c  -O1  compilation failed to produce executable
FAIL: gcc.dg/torture/fp-int-convert-float128-timode.c  -O2  (test for excess errors)
WARNING: gcc.dg/torture/fp-int-convert-float128-timode.c  -O2  compilation failed to produce executable
FAIL: gcc.dg/torture/fp-int-convert-float128-timode.c  -O3 -fomit-frame-pointer  (test for excess errors)
WARNING: gcc.dg/torture/fp-int-convert-float128-timode.c  -O3 -fomit-frame-pointer  compilation failed to produce executable
FAIL: gcc.dg/torture/fp-int-convert-float128-timode.c  -O3 -g  (test for excess errors)
WARNING: gcc.dg/torture/fp-int-convert-float128-timode.c  -O3 -g  compilation failed to produce executable
FAIL: gcc.dg/torture/fp-int-convert-float128-timode.c  -Os  (test for excess errors)
WARNING: gcc.dg/torture/fp-int-convert-float128-timode.c  -Os  compilation failed to produce executable
FAIL: gcc.dg/torture/fp-int-convert-float128-timode.c  -O2 -flto -flto-partition=none  (test for excess errors)
WARNING: gcc.dg/torture/fp-int-convert-float128-timode.c  -O2 -flto -flto-partition=none  compilation failed to produce executable
FAIL: gcc.dg/torture/fp-int-convert-float128-timode.c  -O2 -flto  (test for excess errors)
WARNING: gcc.dg/torture/fp-int-convert-float128-timode.c  -O2 -flto  compilation failed to produce executable
FAIL: gcc.dg/torture/fp-int-convert-float128.c  -O0  (test for excess errors)
WARNING: gcc.dg/torture/fp-int-convert-float128.c  -O0  compilation failed to produce executable
FAIL: gcc.dg/torture/fp-int-convert-float128.c  -O1  (test for excess errors)
WARNING: gcc.dg/torture/fp-int-convert-float128.c  -O1  compilation failed to produce executable
FAIL: gcc.dg/torture/fp-int-convert-float128.c  -O2  (test for excess errors)
WARNING: gcc.dg/torture/fp-int-convert-float128.c  -O2  compilation failed to produce executable
FAIL: gcc.dg/torture/fp-int-convert-float128.c  -O3 -fomit-frame-pointer  (test for excess errors)
WARNING: gcc.dg/torture/fp-int-convert-float128.c  -O3 -fomit-frame-pointer  compilation failed to produce executable
FAIL: gcc.dg/torture/fp-int-convert-float128.c  -O3 -g  (test for excess errors)
WARNING: gcc.dg/torture/fp-int-convert-float128.c  -O3 -g  compilation failed to produce executable
FAIL: gcc.dg/torture/fp-int-convert-float128.c  -Os  (test for excess errors)
WARNING: gcc.dg/torture/fp-int-convert-float128.c  -Os  compilation failed to produce executable
FAIL: gcc.dg/torture/fp-int-convert-float128.c  -O2 -flto -flto-partition=none  (test for excess errors)
WARNING: gcc.dg/torture/fp-int-convert-float128.c  -O2 -flto -flto-partition=none  compilation failed to produce executable
FAIL: gcc.dg/torture/fp-int-convert-float128.c  -O2 -flto  (test for excess errors)
WARNING: gcc.dg/torture/fp-int-convert-float128.c  -O2 -flto  compilation failed to produce executable
FAIL: gcc.dg/torture/pr47968.c  -O0  (test for excess errors)
FAIL: gcc.dg/torture/pr47968.c  -O1  (test for excess errors)
FAIL: gcc.dg/torture/pr47968.c  -O2  (test for excess errors)
FAIL: gcc.dg/torture/pr47968.c  -O3 -fomit-frame-pointer  (test for excess errors)
FAIL: gcc.dg/torture/pr47968.c  -O3 -g  (test for excess errors)
FAIL: gcc.dg/torture/pr47968.c  -Os  (test for excess errors)
FAIL: gcc.dg/torture/pr47968.c  -O2 -flto -flto-partition=none  (test for excess errors)
FAIL: gcc.dg/torture/pr47968.c  -O2 -flto  (test for excess errors)
FAIL: gcc.target/i386/387-3.c scan-assembler fldpi
FAIL: gcc.target/i386/387-4.c scan-assembler fldpi
FAIL: gcc.target/i386/abi-1.c scan-assembler-times xmm0 1
XPASS: gcc.target/i386/builtin-apply-mmx.c execution test
FAIL: gcc.target/i386/combine-mul.c scan-assembler-not 12345
FAIL: gcc.target/i386/float128-1.c (test for excess errors)
WARNING: gcc.target/i386/float128-1.c compilation failed to produce executable
FAIL: gcc.target/i386/pr22076.c scan-assembler-times movq 3
FAIL: gcc.target/i386/pr22076.c scan-assembler-not movl
FAIL: gcc.target/i386/pr22152.c scan-assembler-times movq[ \\\\t]+[^\\n]*%mm 1
FAIL: gcc.target/i386/rdrand-1.c (internal compiler error)
FAIL: gcc.target/i386/rdrand-1.c (test for excess errors)
ERROR: gcc.target/i386/rdrand-1.c: error executing dg-final: couldn't open "rdrand-1.s": no such file or directory
UNRESOLVED: gcc.target/i386/rdrand-1.c: error executing dg-final: couldn't open "rdrand-1.s": no such file or directory
FAIL: gcc.target/i386/rdrand-2.c (internal compiler error)
FAIL: gcc.target/i386/rdrand-2.c (test for excess errors)
ERROR: gcc.target/i386/rdrand-2.c: error executing dg-final: couldn't open "rdrand-2.s": no such file or directory
UNRESOLVED: gcc.target/i386/rdrand-2.c: error executing dg-final: couldn't open "rdrand-2.s": no such file or directory

		=== gcc Summary ===

# of expected passes		73601
# of unexpected failures	190
# of unexpected successes	1
# of expected failures		201
# of unresolved testcases	80
# of unsupported tests		1074
/users/joel/test-gcc/b-i386-gcc/gcc/xgcc  version 4.6.0 20110304 (experimental) [trunk revision 170678] (GCC) 

Host   is x86_64-unknown-linux-gnu

		=== g++ tests ===


Running target rtems-i386-qemu
FAIL: g++.dg/debug/dwarf2/accessibility1.C scan-assembler-times 3[^\\\\r\\\\n]* DW_AT_accessibility 6
FAIL: g++.dg/debug/dwarf2/accessibility1.C scan-assembler-times 2[^\\\\r\\\\n]* DW_AT_accessibility 2
FAIL: g++.dg/debug/dwarf2/enum1.C scan-assembler-times DIE[^\\n\\r]*DW_TAG_enumeration_type 3
FAIL: g++.dg/debug/dwarf2/enum1.C scan-assembler-times  DW_AT_enum_class 2
FAIL: g++.dg/debug/dwarf2/explicit-constructor.C scan-assembler-times DW_AT_explicit 2
FAIL: g++.dg/debug/dwarf2/global-used-types-1.C scan-assembler-times DIE \\\\(0x[^\\n]*\\\\) DW_TAG_enumeration_type 1
FAIL: g++.dg/debug/dwarf2/global-used-types-1.C scan-assembler-times DIE \\\\(0x[^\\n]*\\\\) DW_TAG_enumerator 2
FAIL: g++.dg/debug/dwarf2/global-used-types-1.C scan-assembler-times ascii "a.0"[\\t ]+[^\\n]*DW_AT_name 1
FAIL: g++.dg/debug/dwarf2/global-used-types-1.C scan-assembler-times ascii "b.0"[\\t ]+[^\\n]*DW_AT_name 1
FAIL: g++.dg/debug/dwarf2/imported-module-2.C scan-assembler DW_TAG_imported_module
FAIL: g++.dg/debug/dwarf2/imported-module-3.C scan-assembler DW_TAG_imported_module
FAIL: g++.dg/debug/dwarf2/imported-module-4.C scan-assembler DW_TAG_imported_module
FAIL: g++.dg/debug/dwarf2/lineno-simple1.C scan-assembler _ZN1CC[12]Ev:[^\\\\t]*(\\\\t.(fnstart|frame|mask|file)[^\\\\t]*)*\\\\t[^:]+:4\\\\n
FAIL: g++.dg/debug/dwarf2/lineno-simple1.C scan-assembler _ZN1C3fooEv:[^\\\\t]*(\\\\t.(fnstart|frame|mask|file)[^\\\\t]*)*\\\\t[^:]+:6\\\\n
FAIL: g++.dg/debug/dwarf2/lineno-simple1.C scan-assembler main:[^\\\\t]*(\\\\t.(fnstart|frame|mask|file)[^\\\\t]*)*\\\\t[^:]+:12\\\\n
FAIL: g++.dg/debug/dwarf2/namespace-1.C scan-assembler-times DIE +\\\\([^\\n]*\\\\) DW_TAG_namespace 1
FAIL: g++.dg/debug/dwarf2/namespace-1.C scan-assembler-times "not_emitted.0"[^\\n]*DW_AT_name 1
FAIL: g++.dg/debug/dwarf2/namespace-1.C scan-assembler-times DIE +\\\\([^\\n]*\\\\) DW_TAG_typedef 1
FAIL: g++.dg/debug/dwarf2/namespace-1.C scan-assembler-times .ascii "T.0"[\\t ]+[^\\n]*DW_AT_name 1
FAIL: g++.dg/debug/dwarf2/nested-1.C scan-assembler DW_TAG_typedef
FAIL: g++.dg/debug/dwarf2/nested-2.C scan-assembler [^\\n\\r]*\\\\(DIE[^\\n\\r]*DW_TAG_structure_type\\\\)[\\n\\r]+[^\\n\\r]*"S\\\\\\\\0"[ \\t]+([@|#;!]|//?)[ \\t]+DW_AT_name[\\n\\r]+(.*)?\\\\(DIE[^\\n\\r]*DW_TAG_structure_type\\\\)[\\n\\r]+[^\\n\\r]*"T<int>\\\\\\\\0"[ \\t]+(.*)?\\\\(DIE[^\\n\\r]*DW_TAG_template_type_param\\\\)[\\n\\r]+[^\\n\\r]*[\\n\\r]+[^\\n\\r]*[\\n\\r]+[^\\n\\r]*([@|#;!]|//?)[ \\t]+end of children of DIE[^\\n\\r]*[\\n\\r]+[^\\n\\r]*end of children of DIE[^\\n\\r]*
FAIL: g++.dg/debug/dwarf2/pr44641.C scan-assembler _ZN12MisplacedDbgI4FullEC[12]Ev:[^\\\\t]*(\\\\t.(fnstart|frame|mask|file)[^\\\\t]*)*\\\\t[^:]+:21\\\\n
FAIL: g++.dg/debug/dwarf2/pr44641.C scan-assembler _ZN12MisplacedDbgI4FullED0Ev:[^\\\\t]*(\\\\t.(fnstart|frame|mask|file)[^\\\\t]*)*\\\\t[^:]+:21\\\\n
FAIL: g++.dg/debug/dwarf2/pr44641.C scan-assembler _ZN12MisplacedDbgIP3ArgEC[12]Ev:[^\\\\t]*(\\\\t.(fnstart|frame|mask|file)[^\\\\t]*)*\\\\t[^:]+:28\\\\n
FAIL: g++.dg/debug/dwarf2/pr44641.C scan-assembler _ZN12MisplacedDbgIP3ArgED0Ev:[^\\\\t]*(\\\\t.(fnstart|frame|mask|file)[^\\\\t]*)*\\\\t[^:]+:28\\\\n
FAIL: g++.dg/debug/dwarf2/pr44641.C scan-assembler _ZN12MisplacedDbgI3ArgEC[12]Ev:[^\\\\t]*(\\\\t.(fnstart|frame|mask|file)[^\\\\t]*)*\\\\t[^:]+:34\\\\n
FAIL: g++.dg/debug/dwarf2/pr44641.C scan-assembler _ZN12MisplacedDbgI3ArgED0Ev:[^\\\\t]*(\\\\t.(fnstart|frame|mask|file)[^\\\\t]*)*\\\\t[^:]+:34\\\\n
FAIL: g++.dg/debug/dwarf2/pr46527.C scan-assembler _ZN6StructIdE13defined_laterEv:[^\\\\t]*(\\\\t.(fnstart|frame|mask|file)[^\\\\t]*)*\\\\t[^:]+:12\\\\n
FAIL: g++.dg/debug/dwarf2/redeclaration-1.C scan-assembler-times [^\\n\\r]*\\\\(DIE [^\\n\\r]*DW_TAG_lexical_block\\\\)[\\n\\r]{1,2}[^\\n\\r]*DW_AT_low_pc[\\n\\r]{1,2}[^\\n\\r]*DW_AT_high_pc[\\n\\r]{1,2}[^\\n\\r]*\\\\(DIE [^\\n\\r]*DW_TAG_variable\\\\)[\\n\\r]{1,2}[^\\n\\r]*DW_AT_name 2
FAIL: g++.dg/debug/dwarf2/self-ref-1.C scan-assembler-times [^\\n\\r]*\\\\(DIE[^\\n\\r]*DW_TAG_pointer_type\\\\)[\\n\\r]{1,2}[^\\n\\r]*DW_AT_byte_size[\\n\\r]{1,2}[^\\n\\r]*DW_AT_type 4
FAIL: g++.dg/debug/dwarf2/self-ref-2.C scan-assembler-times [^\\n\\r]*\\\\(DIE[^\\n\\r]*DW_TAG_pointer_type\\\\)[\\n\\r]{1,2}[^\\n\\r]*DW_AT_byte_size[\\n\\r]{1,2}[^\\n\\r]*DW_AT_type 4
FAIL: g++.dg/debug/dwarf2/static-data-member1.C scan-assembler DW_TAG_member[^\\n\\r]*[\\n\\r]*[^\\n\\r]*staticdatamember[^\\n\\r]*DW_AT_name
FAIL: g++.dg/debug/dwarf2/static-data-member1.C scan-assembler DW_TAG_variable[^\\n\\r]*[\\n\\r]*[^\\n\\r]*DW_AT_specification
FAIL: g++.dg/debug/dwarf2/static-local-var-in-ctor.C scan-assembler DW_OP_addr[^\\n\\r]*[\\n\\r]*[^\\n\\r]*staticvar1
FAIL: g++.dg/debug/dwarf2/static-local-var-in-ctor.C scan-assembler DW_OP_addr[^\\n\\r]*[\\n\\r]*[^\\n\\r]*staticvar2
FAIL: g++.dg/debug/dwarf2/template-func-params-1.C scan-assembler DW_TAG_template_type_param
FAIL: g++.dg/debug/dwarf2/template-func-params-1.C scan-assembler U.*DW_AT_name
FAIL: g++.dg/debug/dwarf2/template-func-params-2.C scan-assembler DW_TAG_template_value_param
FAIL: g++.dg/debug/dwarf2/template-func-params-2.C scan-assembler i.*DW_AT_name
FAIL: g++.dg/debug/dwarf2/template-func-params-2.C scan-assembler 3.*DW_AT_const_value
FAIL: g++.dg/debug/dwarf2/template-func-params-3.C scan-assembler DW_TAG_template_value_param
FAIL: g++.dg/debug/dwarf2/template-func-params-3.C scan-assembler f.*DW_AT_name
FAIL: g++.dg/debug/dwarf2/template-func-params-3.C scan-assembler DW_AT_location[^\\\\r\\\\n]*[\\\\r\\\\n]*[^\\\\r\\\\n]*DW_OP_addr[^\\\\r\\\\n]*[\\\\r\\\\n]*[^\\\\r\\\\n]*_Z4blehv[^\\\\r\\\\n]*[\\\\r\\\\n]*[^\\\\r\\\\n]*DW_OP_stack_value
FAIL: g++.dg/debug/dwarf2/template-func-params-4.C scan-assembler-times DIE \\\\(0x[^\\n]*\\\\) DW_TAG_GNU_template_parameter_pack 1
FAIL: g++.dg/debug/dwarf2/template-func-params-4.C scan-assembler-times DIE \\\\(0x[^\\n]*\\\\) DW_TAG_template_type_param 3
FAIL: g++.dg/debug/dwarf2/template-func-params-5.C scan-assembler DW_TAG_template_type_param
FAIL: g++.dg/debug/dwarf2/template-func-params-5.C scan-assembler T.*DW_AT_name
FAIL: g++.dg/debug/dwarf2/template-func-params-6.C scan-assembler-times DW_TAG_GNU_template_template_param 2
FAIL: g++.dg/debug/dwarf2/template-func-params-6.C scan-assembler-times "vector.0".*?DW_AT_GNU_template_name 1
FAIL: g++.dg/debug/dwarf2/template-func-params-6.C scan-assembler-times .ascii "U.0".*?DW_AT_name 1
FAIL: g++.dg/debug/dwarf2/template-func-params-7.C scan-assembler-times DIE \\\\(0x[^\\n]*\\\\) DW_TAG_subprogram 5
FAIL: g++.dg/debug/dwarf2/template-func-params-7.C scan-assembler-times DIE \\\\(0x[^\\n]*\\\\) DW_TAG_template_type_param 6
FAIL: g++.dg/debug/dwarf2/template-func-params-7.C scan-assembler-times "printf<int, char, int>.0"[^\\n]*DW_AT_name 1
FAIL: g++.dg/debug/dwarf2/template-func-params-7.C scan-assembler-times "printf<char, int>.0"[^\\n]*DW_AT_name 1
FAIL: g++.dg/debug/dwarf2/template-func-params-7.C scan-assembler-times "printf<int>.0"[^\\n]*DW_AT_name 1
FAIL: g++.dg/debug/dwarf2/template-func-params-7.C scan-assembler-times "printf.0"[^\\n]*DW_AT_name 1
FAIL: g++.dg/debug/dwarf2/template-func-params-7.C scan-assembler-times DIE \\\\(0x[^\\n]*\\\\) DW_TAG_GNU_template_parameter_pack 3
FAIL: g++.dg/debug/dwarf2/template-func-params-7.C scan-assembler-times DIE \\\\(0x[^\\n]*\\\\) DW_TAG_GNU_formal_parameter_pack 3
FAIL: g++.dg/debug/dwarf2/template-params-1.C scan-assembler DW_TAG_template_type_param
FAIL: g++.dg/debug/dwarf2/template-params-1.C scan-assembler U.*DW_AT_name
FAIL: g++.dg/debug/dwarf2/template-params-10.C scan-assembler-times DIE \\\\([^\\n\\r]*\\\\) DW_TAG_template_value_param 1
FAIL: g++.dg/debug/dwarf2/template-params-2.C scan-assembler DW_TAG_template_value_param
FAIL: g++.dg/debug/dwarf2/template-params-2.C scan-assembler i.*DW_AT_name
FAIL: g++.dg/debug/dwarf2/template-params-2.C scan-assembler 3.*DW_AT_const_value
FAIL: g++.dg/debug/dwarf2/template-params-3.C scan-assembler DW_TAG_template_value_param
FAIL: g++.dg/debug/dwarf2/template-params-3.C scan-assembler f.*DW_AT_name
FAIL: g++.dg/debug/dwarf2/template-params-3.C scan-assembler DW_AT_location[^\\\\r\\\\n]*[\\\\r\\\\n]*[^\\\\r\\\\n]*DW_OP_addr[^\\\\r\\\\n]*[\\\\r\\\\n]*[^\\\\r\\\\n]*_Z4blehv[^\\\\r\\\\n]*[\\\\r\\\\n]*[^\\\\r\\\\n]*DW_OP_stack_value
FAIL: g++.dg/debug/dwarf2/template-params-4.C scan-assembler-times DIE \\\\(0x[^\\n]*\\\\) DW_TAG_GNU_template_parameter_pack 1
FAIL: g++.dg/debug/dwarf2/template-params-4.C scan-assembler-times DIE \\\\(0x[^\\n]*\\\\) DW_TAG_template_type_param 3
FAIL: g++.dg/debug/dwarf2/template-params-5.C scan-assembler DW_TAG_template_type_param
FAIL: g++.dg/debug/dwarf2/template-params-5.C scan-assembler T.*DW_AT_name
FAIL: g++.dg/debug/dwarf2/template-params-6.C scan-assembler-times DW_TAG_GNU_template_template_param 2
FAIL: g++.dg/debug/dwarf2/template-params-6.C scan-assembler-times "vector.0"[^\\n]*DW_AT_GNU_template_name 1
FAIL: g++.dg/debug/dwarf2/template-params-6.C scan-assembler-times .ascii "U.0"[^\\n]*DW_AT_name 1
FAIL: g++.dg/debug/dwarf2/template-params-7.C scan-assembler-times DIE \\\\(0x[^\\n]*\\\\) DW_TAG_GNU_template_parameter_pack 1
FAIL: g++.dg/debug/dwarf2/template-params-8.C scan-assembler-times [^\\n\\r]*DIE \\\\([^\\n\\r]*\\\\) DW_TAG_template_value_param[^\\n\\r]*[\\n\\r]{1,2}[^\\n\\r]*DW_AT_name[\\n\\r]{1,2}[^\\n\\r]*DW_AT_type[\\n\\r]{1,2}[^\\n\\r]*DW_AT_const_value[\\n\\r]{1,2} 1
FAIL: g++.dg/debug/dwarf2/template-params-9.C scan-assembler-times DIE \\\\([^\\n\\r]*\\\\) DW_TAG_template_type_param 2
FAIL: g++.dg/debug/dwarf2/template-params-9.C scan-assembler-times DIE \\\\([^\\n\\r]*\\\\) DW_TAG_template_value_param 3
FAIL: g++.dg/debug/dwarf2/typedef1.C scan-assembler-times DW_TAG_structure_type 2
FAIL: g++.dg/debug/dwarf2/typedef1.C scan-assembler-times DW_AT_name: "foo<1u>"|"foo<1u>.."[^\\n]*DW_AT_name 1
FAIL: g++.dg/debug/dwarf2/typedef1.C scan-assembler-times DW_TAG_enumeration_type 2
FAIL: g++.dg/debug/dwarf2/typedef1.C scan-assembler-times DW_AT_name: "typedef foo<1u>::type type"|"typedef foo<1u>::type type.."[^\\n]*DW_AT_name 1
FAIL: g++.dg/debug/dwarf2/typedef1.C scan-assembler-times DIE \\\\([^\\n]*\\\\) DW_TAG_enumeration_type 1
FAIL: g++.dg/debug/dwarf2/typedef1.C scan-assembler-times "e0.."[^\\n]*DW_AT_name 1
FAIL: g++.dg/debug/dwarf2/typedef1.C scan-assembler-times "e1.."[^\\n]*DW_AT_name 1
FAIL: g++.dg/debug/dwarf2/typedef2.C scan-assembler-times [^\\n\\r]*\\\\(DIE[^\\n\\r]*DW_TAG_formal_parameter\\\\)[\\n\\r]{1,2}[^\\n\\r]*DW_AT_type[\\n\\r]{1,2} 1
FAIL: g++.dg/debug/dwarf2/typedef3.C scan-assembler-times [^\\n\\r]*\\\\(DIE[^\\n\\r]*DW_TAG_typedef\\\\) 1
FAIL: g++.dg/debug/dwarf2/typedef3.C scan-assembler-times [^\\n\\r]*\\\\(DIE[^\\n\\r]*DW_TAG_structure_type\\\\) 1
FAIL: g++.dg/debug/dwarf2/typedef4.C scan-assembler-times DW_AT_byte_size 4
FAIL: g++.dg/other/unused1.C scan-assembler (string|ascii?)z?[\\t ]"printer("|\\\\\\\\0)
FAIL: g++.dg/lto/20081109 cp_lto_20081109_0.o-cp_lto_20081109_1.o execute -O0 -flto -flto-partition=none 
FAIL: g++.dg/lto/20081109 cp_lto_20081109_0.o-cp_lto_20081109_1.o execute -O2 -flto -flto-partition=none 
FAIL: g++.dg/lto/20081109 cp_lto_20081109_0.o-cp_lto_20081109_1.o execute -O0 -flto -flto-partition=1to1 
FAIL: g++.dg/lto/20081109 cp_lto_20081109_0.o-cp_lto_20081109_1.o execute -O2 -flto -flto-partition=1to1 
FAIL: g++.dg/lto/20081109 cp_lto_20081109_0.o-cp_lto_20081109_1.o execute -O0 -flto
FAIL: g++.dg/lto/20081109 cp_lto_20081109_0.o-cp_lto_20081109_1.o execute -O2 -flto
FAIL: g++.dg/pch/array-1.C  -g assembly comparison
FAIL: g++.dg/pch/array-1.C  -O2 -g assembly comparison
FAIL: g++.dg/pch/externc-1.C  -g assembly comparison
FAIL: g++.dg/pch/externc-1.C  -O2 -g assembly comparison
FAIL: g++.dg/pch/static-1.C  -g assembly comparison
FAIL: g++.dg/pch/static-1.C  -O2 -g assembly comparison
FAIL: g++.dg/pch/system-1.C  -g assembly comparison
FAIL: g++.dg/pch/system-1.C  -O2 -g assembly comparison
FAIL: g++.dg/pch/system-2.C  -g assembly comparison
FAIL: g++.dg/pch/system-2.C  -O2 -g assembly comparison
FAIL: g++.dg/pch/uninst.C  -g assembly comparison
FAIL: g++.dg/pch/uninst.C  -O2 -g assembly comparison
FAIL: g++.dg/pch/wchar-1.C  -g assembly comparison
FAIL: g++.dg/pch/wchar-1.C  -O2 -g assembly comparison
FAIL: g++.dg/torture/pr39002.C  -O2 -flto -flto-partition=none  (test for excess errors)
WARNING: g++.dg/torture/pr39002.C  -O2 -flto -flto-partition=none  compilation failed to produce executable
FAIL: g++.dg/torture/pr39002.C  -O2 -flto  (test for excess errors)
WARNING: g++.dg/torture/pr39002.C  -O2 -flto  compilation failed to produce executable
FAIL: g++.dg/torture/stackalign/eh-alloca-1.C  -O2 -flto -flto-partition=none  execution test
FAIL: g++.dg/torture/stackalign/eh-alloca-1.C  -O2 -flto  execution test
FAIL: g++.dg/torture/stackalign/eh-fastcall-1.C  -O2 -flto -flto-partition=none  execution test
FAIL: g++.dg/torture/stackalign/eh-fastcall-1.C  -O2 -flto  execution test
FAIL: g++.dg/torture/stackalign/eh-global-1.C  -O2 -flto -flto-partition=none  execution test
FAIL: g++.dg/torture/stackalign/eh-global-1.C  -O2 -flto  execution test
FAIL: g++.dg/torture/stackalign/eh-inline-1.C  -O2 -flto -flto-partition=none  execution test
FAIL: g++.dg/torture/stackalign/eh-inline-1.C  -O2 -flto  execution test
FAIL: g++.dg/torture/stackalign/eh-inline-2.C  -O2 -flto -flto-partition=none  execution test
FAIL: g++.dg/torture/stackalign/eh-inline-2.C  -O2 -flto  execution test
FAIL: g++.dg/torture/stackalign/eh-thiscall-1.C  -O2 -flto -flto-partition=none  execution test
FAIL: g++.dg/torture/stackalign/eh-thiscall-1.C  -O2 -flto  execution test
FAIL: g++.dg/torture/stackalign/eh-vararg-1.C  -O2 -flto -flto-partition=none  execution test
FAIL: g++.dg/torture/stackalign/eh-vararg-1.C  -O2 -flto  execution test
FAIL: g++.dg/torture/stackalign/eh-vararg-2.C  -O2 -flto -flto-partition=none  execution test
FAIL: g++.dg/torture/stackalign/eh-vararg-2.C  -O2 -flto  execution test
FAIL: g++.dg/torture/stackalign/throw-1.C  -O2 -flto -flto-partition=none  execution test
FAIL: g++.dg/torture/stackalign/throw-1.C  -O2 -flto  execution test
FAIL: g++.dg/torture/stackalign/throw-2.C  -O2 -flto -flto-partition=none  execution test
FAIL: g++.dg/torture/stackalign/throw-2.C  -O2 -flto  execution test
FAIL: g++.dg/torture/stackalign/throw-3.C  -O2 -flto -flto-partition=none  execution test
FAIL: g++.dg/torture/stackalign/throw-3.C  -O2 -flto  execution test
FAIL: g++.dg/torture/stackalign/unwind-0.C  -O2 -flto -flto-partition=none  execution test
FAIL: g++.dg/torture/stackalign/unwind-0.C  -O2 -flto  execution test
FAIL: g++.dg/torture/stackalign/unwind-1.C  -O2 -flto -flto-partition=none  execution test
FAIL: g++.dg/torture/stackalign/unwind-1.C  -O2 -flto  execution test
FAIL: g++.dg/torture/stackalign/unwind-2.C  -O2 -flto -flto-partition=none  execution test
FAIL: g++.dg/torture/stackalign/unwind-2.C  -O2 -flto  execution test
FAIL: g++.dg/torture/stackalign/unwind-3.C  -O2 -flto -flto-partition=none  execution test
FAIL: g++.dg/torture/stackalign/unwind-3.C  -O2 -flto  execution test
FAIL: g++.dg/torture/stackalign/unwind-4.C  -O2 -flto -flto-partition=none  execution test
FAIL: g++.dg/torture/stackalign/unwind-4.C  -O2 -flto  execution test
FAIL: g++.dg/torture/stackalign/unwind-5.C  -O2 -flto -flto-partition=none  execution test
FAIL: g++.dg/torture/stackalign/unwind-5.C  -O2 -flto  execution test
FAIL: g++.dg/torture/stackalign/unwind-6.C  -O2 -flto -flto-partition=none  execution test
FAIL: g++.dg/torture/stackalign/unwind-6.C  -O2 -flto  execution test
FAIL: g++.dg/torture/stackalign/eh-alloca-1.C  -O2 -flto -flto-partition=none  execution test
FAIL: g++.dg/torture/stackalign/eh-alloca-1.C  -O2 -flto  execution test
FAIL: g++.dg/torture/stackalign/eh-fastcall-1.C  -O2 -flto -flto-partition=none  execution test
FAIL: g++.dg/torture/stackalign/eh-fastcall-1.C  -O2 -flto  execution test
FAIL: g++.dg/torture/stackalign/eh-global-1.C  -O2 -flto -flto-partition=none  execution test
FAIL: g++.dg/torture/stackalign/eh-global-1.C  -O2 -flto  execution test
FAIL: g++.dg/torture/stackalign/eh-inline-1.C  -O2 -flto -flto-partition=none  execution test
FAIL: g++.dg/torture/stackalign/eh-inline-1.C  -O2 -flto  execution test
FAIL: g++.dg/torture/stackalign/eh-inline-2.C  -O2 -flto -flto-partition=none  execution test
FAIL: g++.dg/torture/stackalign/eh-inline-2.C  -O2 -flto  execution test
FAIL: g++.dg/torture/stackalign/eh-thiscall-1.C  -O2 -flto -flto-partition=none  execution test
FAIL: g++.dg/torture/stackalign/eh-thiscall-1.C  -O2 -flto  execution test
FAIL: g++.dg/torture/stackalign/eh-vararg-1.C  -O2 -flto -flto-partition=none  execution test
FAIL: g++.dg/torture/stackalign/eh-vararg-1.C  -O2 -flto  execution test
FAIL: g++.dg/torture/stackalign/eh-vararg-2.C  -O2 -flto -flto-partition=none  execution test
FAIL: g++.dg/torture/stackalign/eh-vararg-2.C  -O2 -flto  execution test
FAIL: g++.dg/torture/stackalign/throw-1.C  -O2 -flto -flto-partition=none  execution test
FAIL: g++.dg/torture/stackalign/throw-1.C  -O2 -flto  execution test
FAIL: g++.dg/torture/stackalign/throw-2.C  -O2 -flto -flto-partition=none  execution test
FAIL: g++.dg/torture/stackalign/throw-2.C  -O2 -flto  execution test
FAIL: g++.dg/torture/stackalign/throw-3.C  -O2 -flto -flto-partition=none  execution test
FAIL: g++.dg/torture/stackalign/throw-3.C  -O2 -flto  execution test
XPASS: g++.old-deja/g++.other/init19.C execution test

		=== g++ Summary ===

# of expected passes		25669
# of unexpected failures	170
# of unexpected successes	1
# of expected failures		160
# of unsupported tests		218
/users/joel/test-gcc/b-i386-gcc/gcc/testsuite/g++/../../g++  version 4.6.0 20110304 (experimental) [trunk revision 170678] (GCC) 


Compiler version: 4.6.0 20110304 (experimental) [trunk revision 170678] (GCC) 
Platform: i386-pc-rtems4.11
configure flags: --with-ppl=/users/joel/test-gcc/install-svn --disable-werror --enable-threads=rtems --with-gnu-as --enable-multilib --enable-newlib-mb --enable-newlib-iconv --with-gnu-ld --with-newlib --verbose --with-system-zlib --disable-nls --enable-version-specific-runtime-libs --enable-languages=c,c++ --target=i386-rtems4.11 --prefix=/users/joel/test-gcc/install-svn


Index Nav: [Date Index] [Subject Index] [Author Index] [Thread Index]
Message Nav: [Date Prev] [Date Next] [Thread Prev] [Thread Next]