This is the mail archive of the gcc-testresults@gcc.gnu.org mailing list for the GCC project.


Index Nav: [Date Index] [Subject Index] [Author Index] [Thread Index]
Message Nav: [Date Prev] [Date Next] [Thread Prev] [Thread Next]
Other format: [Raw text]

Results for 4.6.0 20100904 (experimental) (GCC) testsuite on x86_64-apple-darwin10.5.0


r163859 and from http://gcc.gnu.org/ml/gcc-patches/2010-08/msg01916.html to fix PR45234,
http://gcc.gnu.org/ml/gcc-patches/2010-09/msg00365.html to fix PR36502, 
PR42313 and PR44651 as well as http://gcc.gnu.org/bugzilla/attachment.cgi?id=21698
to fix PR45524.

Native configuration is x86_64-apple-darwin10.5.0

		=== g++ tests ===


Running target unix/-m32
WARNING: g++.dg/ext/label13.C compilation failed to produce executable
FAIL: g++.dg/ext/visibility/anon6.C scan-assembler 1BIiE1cE
FAIL: g++.dg/lto/20100723-1 cp_lto_20100723-1_0.o-cp_lto_20100723-1_0.o link, -fcompare-debug -flto (internal compiler error)
UNRESOLVED: g++.dg/lto/20100723-1 cp_lto_20100723-1_0.o-cp_lto_20100723-1_0.o execute -fcompare-debug -flto
FAIL: g++.dg/lto/20100723-1 cp_lto_20100723-1_0.o-cp_lto_20100723-1_0.o link, -fcompare-debug -fwhopr (internal compiler error)
UNRESOLVED: g++.dg/lto/20100723-1 cp_lto_20100723-1_0.o-cp_lto_20100723-1_0.o execute -fcompare-debug -fwhopr
FAIL: g++.dg/torture/stackalign/eh-alloca-1.C  -O3 -g  execution test
FAIL: g++.dg/torture/stackalign/eh-vararg-1.C  -O3 -g  execution test
FAIL: g++.dg/torture/stackalign/eh-vararg-2.C  -O3 -g  execution test
FAIL: g++.dg/torture/stackalign/eh-alloca-1.C  -O3 -g  execution test
FAIL: g++.dg/torture/stackalign/eh-vararg-1.C  -O3 -g  execution test
FAIL: g++.dg/torture/stackalign/eh-vararg-2.C  -O3 -g  execution test
FAIL: g++.dg/tree-prof/partition1.C compilation,  -g  -fprofile-use
UNRESOLVED: g++.dg/tree-prof/partition1.C execution,    -g  -fprofile-use
FAIL: g++.dg/tree-prof/partition1.C compilation,  -O3 -g  -fprofile-use
UNRESOLVED: g++.dg/tree-prof/partition1.C execution,    -O3 -g  -fprofile-use
FAIL: g++.dg/tree-prof/partition2.C compilation,  -O3 -g  -fprofile-use
UNRESOLVED: g++.dg/tree-prof/partition2.C execution,    -O3 -g  -fprofile-use

		=== g++ Summary for unix/-m32 ===

# of expected passes		24435
# of unexpected failures	12
# of expected failures		150
# of unresolved testcases	5
# of unsupported tests		171

Running target unix/-m64
WARNING: g++.dg/ext/label13.C compilation failed to produce executable
FAIL: g++.dg/ext/visibility/anon6.C scan-assembler 1BIiE1cE
FAIL: g++.dg/lto/20100723-1 cp_lto_20100723-1_0.o-cp_lto_20100723-1_0.o link, -fcompare-debug -flto (internal compiler error)
UNRESOLVED: g++.dg/lto/20100723-1 cp_lto_20100723-1_0.o-cp_lto_20100723-1_0.o execute -fcompare-debug -flto
FAIL: g++.dg/lto/20100723-1 cp_lto_20100723-1_0.o-cp_lto_20100723-1_0.o link, -fcompare-debug -fwhopr (internal compiler error)
UNRESOLVED: g++.dg/lto/20100723-1 cp_lto_20100723-1_0.o-cp_lto_20100723-1_0.o execute -fcompare-debug -fwhopr
FAIL: g++.dg/tree-prof/partition1.C compilation,  -g  -fprofile-use
UNRESOLVED: g++.dg/tree-prof/partition1.C execution,    -g  -fprofile-use
FAIL: g++.dg/tree-prof/partition1.C compilation,  -O3 -g  -fprofile-use
UNRESOLVED: g++.dg/tree-prof/partition1.C execution,    -O3 -g  -fprofile-use
FAIL: g++.dg/tree-prof/partition2.C compilation,  -O3 -g  -fprofile-use
UNRESOLVED: g++.dg/tree-prof/partition2.C execution,    -O3 -g  -fprofile-use

		=== g++ Summary for unix/-m64 ===

# of expected passes		24681
# of unexpected failures		6
# of expected failures		150
# of unresolved testcases	5
# of unsupported tests		365

		=== g++ Summary ===

# of expected passes		49116
# of unexpected failures	18
# of expected failures		300
# of unresolved testcases	10
# of unsupported tests		536
/sw/src/fink.build/gcc46-4.6.0-1000/darwin_objdir/gcc/testsuite/g++/../../g++  version 4.6.0 20100904 (experimental) (GCC) 

		=== gcc tests ===


Running target unix/-m32
FAIL: gcc.dg/framework-1.c (test for excess errors)
XPASS: gcc.dg/tree-ssa/20031106-3.c scan-tree-dump-times optimized "link_error" 0
XPASS: gcc.dg/tree-ssa/20040204-1.c scan-tree-dump-times optimized "link_error" 0
XPASS: gcc.dg/tree-ssa/fre-vce-1.c scan-tree-dump-times fre "sv.i" 2
FAIL: gcc.target/i386/combine-mul.c scan-assembler-not 12345

		=== gcc Summary for unix/-m32 ===

# of expected passes		71798
# of unexpected failures	2
# of unexpected successes	3
# of expected failures		212
# of unsupported tests		1286

Running target unix/-m64
FAIL: gcc.dg/framework-1.c (test for excess errors)
FAIL: gcc.dg/matrix/transpose-3.c execution,    -fprofile-use -fipa-matrix-reorg -fdump-ipa-matrix-reorg -O3 -fwhole-program -combine
XPASS: gcc.dg/tree-ssa/20031106-3.c scan-tree-dump-times optimized "link_error" 0
XPASS: gcc.dg/tree-ssa/20040204-1.c scan-tree-dump-times optimized "link_error" 0
XPASS: gcc.dg/tree-ssa/fre-vce-1.c scan-tree-dump-times fre "sv.i" 2
FAIL: gcc.dg/vect/vect-multitypes-1.c (internal compiler error)
FAIL: gcc.dg/vect/vect-multitypes-1.c (test for excess errors)
WARNING: gcc.dg/vect/vect-multitypes-1.c compilation failed to produce executable
FAIL: gcc.dg/vect/vect-multitypes-1.c scan-tree-dump-times vect "vectorized 1 loops" 2
FAIL: gcc.dg/vect/vect-multitypes-1.c scan-tree-dump-times vect "Alignment of access forced using peeling" 2
FAIL: gcc.dg/vect/vect-multitypes-1.c scan-tree-dump-times vect "Vectorizing an unaligned access" 4
FAIL: gcc.target/i386/combine-mul.c scan-assembler-not 12345

		=== gcc Summary for unix/-m64 ===

# of expected passes		71904
# of unexpected failures	8
# of unexpected successes	3
# of expected failures		213
# of unsupported tests		1648

		=== gcc Summary ===

# of expected passes		143702
# of unexpected failures	10
# of unexpected successes	6
# of expected failures		425
# of unsupported tests		2934
/sw/src/fink.build/gcc46-4.6.0-1000/darwin_objdir/gcc/xgcc  version 4.6.0 20100904 (experimental) (GCC) 

		=== gfortran tests ===


Running target unix/-m32
FAIL: gfortran.dg/float128_1.f90  -O  (test for excess errors)
FAIL: gfortran.dg/float128_1.f90  -O  scan-tree-dump original "sqrtq": dump file does not exist
FAIL: gfortran.dg/float128_1.f90  -O  scan-tree-dump original "cabsq": dump file does not exist
FAIL: gfortran.dg/float128_1.f90  -O  scan-tree-dump original "cosl": dump file does not exist
FAIL: gfortran.dg/forall_4.f90  -O1  (internal compiler error)
FAIL: gfortran.dg/forall_4.f90  -O1  (test for excess errors)
WARNING: gfortran.dg/forall_4.f90  -O1  compilation failed to produce executable

		=== gfortran Summary for unix/-m32 ===

# of expected passes		36143
# of unexpected failures	6
# of expected failures		50
# of unsupported tests		136

Running target unix/-m64
FAIL: gfortran.dg/backspace_1.f  -O2  (internal compiler error)
FAIL: gfortran.dg/backspace_1.f  -O2  (test for excess errors)
WARNING: gfortran.dg/backspace_1.f  -O2  compilation failed to produce executable
FAIL: gfortran.dg/backspace_1.f  -O3 -fomit-frame-pointer  (internal compiler error)
FAIL: gfortran.dg/backspace_1.f  -O3 -fomit-frame-pointer  (test for excess errors)
WARNING: gfortran.dg/backspace_1.f  -O3 -fomit-frame-pointer  compilation failed to produce executable
FAIL: gfortran.dg/backspace_1.f  -O3 -fomit-frame-pointer -funroll-loops  (internal compiler error)
FAIL: gfortran.dg/backspace_1.f  -O3 -fomit-frame-pointer -funroll-loops  (test for excess errors)
WARNING: gfortran.dg/backspace_1.f  -O3 -fomit-frame-pointer -funroll-loops  compilation failed to produce executable
FAIL: gfortran.dg/backspace_1.f  -O3 -fomit-frame-pointer -funroll-all-loops -finline-functions  (internal compiler error)
FAIL: gfortran.dg/backspace_1.f  -O3 -fomit-frame-pointer -funroll-all-loops -finline-functions  (test for excess errors)
WARNING: gfortran.dg/backspace_1.f  -O3 -fomit-frame-pointer -funroll-all-loops -finline-functions  compilation failed to produce executable
FAIL: gfortran.dg/backspace_1.f  -O3 -g  (internal compiler error)
FAIL: gfortran.dg/backspace_1.f  -O3 -g  (test for excess errors)
WARNING: gfortran.dg/backspace_1.f  -O3 -g  compilation failed to produce executable
FAIL: gfortran.dg/backspace_1.f  -Os  (internal compiler error)
FAIL: gfortran.dg/backspace_1.f  -Os  (test for excess errors)
WARNING: gfortran.dg/backspace_1.f  -Os  compilation failed to produce executable
FAIL: gfortran.dg/float128_1.f90  -O  (test for excess errors)
FAIL: gfortran.dg/float128_1.f90  -O  scan-tree-dump original "sqrtq": dump file does not exist
FAIL: gfortran.dg/float128_1.f90  -O  scan-tree-dump original "cabsq": dump file does not exist
FAIL: gfortran.dg/float128_1.f90  -O  scan-tree-dump original "cosl": dump file does not exist
FAIL: gfortran.dg/record_marker_2.f  -O2  (internal compiler error)
FAIL: gfortran.dg/record_marker_2.f  -O2  (test for excess errors)
WARNING: gfortran.dg/record_marker_2.f  -O2  compilation failed to produce executable
FAIL: gfortran.dg/record_marker_2.f  -O3 -fomit-frame-pointer  (internal compiler error)
FAIL: gfortran.dg/record_marker_2.f  -O3 -fomit-frame-pointer  (test for excess errors)
WARNING: gfortran.dg/record_marker_2.f  -O3 -fomit-frame-pointer  compilation failed to produce executable
FAIL: gfortran.dg/record_marker_2.f  -O3 -fomit-frame-pointer -funroll-loops  (internal compiler error)
FAIL: gfortran.dg/record_marker_2.f  -O3 -fomit-frame-pointer -funroll-loops  (test for excess errors)
WARNING: gfortran.dg/record_marker_2.f  -O3 -fomit-frame-pointer -funroll-loops  compilation failed to produce executable
FAIL: gfortran.dg/record_marker_2.f  -O3 -fomit-frame-pointer -funroll-all-loops -finline-functions  (internal compiler error)
FAIL: gfortran.dg/record_marker_2.f  -O3 -fomit-frame-pointer -funroll-all-loops -finline-functions  (test for excess errors)
WARNING: gfortran.dg/record_marker_2.f  -O3 -fomit-frame-pointer -funroll-all-loops -finline-functions  compilation failed to produce executable
FAIL: gfortran.dg/record_marker_2.f  -O3 -g  (internal compiler error)
FAIL: gfortran.dg/record_marker_2.f  -O3 -g  (test for excess errors)
WARNING: gfortran.dg/record_marker_2.f  -O3 -g  compilation failed to produce executable
FAIL: gfortran.dg/record_marker_2.f  -Os  (internal compiler error)
FAIL: gfortran.dg/record_marker_2.f  -Os  (test for excess errors)
WARNING: gfortran.dg/record_marker_2.f  -Os  compilation failed to produce executable
FAIL: gfortran.dg/graphite/pr42393-1.f90  -O  (internal compiler error)
FAIL: gfortran.dg/graphite/pr42393-1.f90  -O  (test for excess errors)

		=== gfortran Summary for unix/-m64 ===

# of expected passes		36279
# of unexpected failures	30
# of expected failures		50
# of unsupported tests		62

		=== gfortran Summary ===

# of expected passes		72422
# of unexpected failures	36
# of expected failures		100
# of unsupported tests		198
/sw/src/fink.build/gcc46-4.6.0-1000/darwin_objdir/gcc/testsuite/gfortran/../../gfortran  version 4.6.0 20100904 (experimental) (GCC) 

		=== obj-c++ tests ===


Running target unix/-m32
WARNING: obj-c++.dg/lookup-2.mm -fgnu-runtime compilation failed to produce executable
WARNING: obj-c++.dg/try-catch-2.mm -fgnu-runtime compilation failed to produce executable
WARNING: obj-c++.dg/try-catch-9.mm -fgnu-runtime compilation failed to produce executable

		=== obj-c++ Summary for unix/-m32 ===

# of expected passes		1176
# of expected failures		3
# of unsupported tests		15

Running target unix/-m64
WARNING: obj-c++.dg/lookup-2.mm -fgnu-runtime compilation failed to produce executable
WARNING: obj-c++.dg/try-catch-2.mm -fgnu-runtime compilation failed to produce executable
WARNING: obj-c++.dg/try-catch-9.mm -fgnu-runtime compilation failed to produce executable
WARNING: obj-c++.dg/try-catch-2.mm -fnext-runtime compilation failed to produce executable
WARNING: obj-c++.dg/try-catch-9.mm -fnext-runtime compilation failed to produce executable

		=== obj-c++ Summary for unix/-m64 ===

# of expected passes		1084
# of expected failures		61
# of unsupported tests		19

		=== obj-c++ Summary ===

# of expected passes		2260
# of expected failures		64
# of unsupported tests		34
/sw/src/fink.build/gcc46-4.6.0-1000/darwin_objdir/gcc/testsuite/obj-c++/../../g++  version 4.6.0 20100904 (experimental) (GCC) 

		=== objc tests ===


Running target unix/-m32
FAIL: objc.dg/headers.m -fnext-runtime (test for excess errors)
FAIL: objc.dg/no-extra-load.m -fnext-runtime (test for excess errors)
ERROR: objc.dg/no-extra-load.m: error executing dg-final: couldn't open "no-extra-load.s": no such file or directory
UNRESOLVED: objc.dg/no-extra-load.m: error executing dg-final: couldn't open "no-extra-load.s": no such file or directory

		=== objc Summary for unix/-m32 ===

# of expected passes		3997
# of unexpected failures	2
# of expected failures		7
# of unresolved testcases	1
# of unsupported tests		26

Running target unix/-m64
FAIL: objc.dg/headers.m -fnext-runtime (test for excess errors)
FAIL: objc.dg/no-extra-load.m -fnext-runtime (test for excess errors)
ERROR: objc.dg/no-extra-load.m: error executing dg-final: couldn't open "no-extra-load.s": no such file or directory
UNRESOLVED: objc.dg/no-extra-load.m: error executing dg-final: couldn't open "no-extra-load.s": no such file or directory

		=== objc Summary for unix/-m64 ===

# of expected passes		2702
# of unexpected failures	2
# of expected failures		56
# of unresolved testcases	1
# of unsupported tests		31

		=== objc Summary ===

# of expected passes		6699
# of unexpected failures	4
# of expected failures		63
# of unresolved testcases	2
# of unsupported tests		57
/sw/src/fink.build/gcc46-4.6.0-1000/darwin_objdir/gcc/xgcc  version 4.6.0 20100904 (experimental) (GCC) 

		=== libffi tests ===


Running target unix/-m32

		=== libffi Summary for unix/-m32 ===

# of expected passes		1624
# of expected failures		10
# of unsupported tests		15

Running target unix/-m64

		=== libffi Summary for unix/-m64 ===

# of expected passes		1624
# of expected failures		10
# of unsupported tests		15

		=== libffi Summary ===

# of expected passes		3248
# of expected failures		20
# of unsupported tests		30
		=== libgomp tests ===


Running target unix/-m32
FAIL: libgomp.graphite/force-parallel-3.c (internal compiler error)
FAIL: libgomp.graphite/force-parallel-3.c (test for excess errors)
WARNING: libgomp.graphite/force-parallel-3.c compilation failed to produce executable
FAIL: libgomp.graphite/force-parallel-3.c scan-tree-dump-times optimized "loopfn.0" 5: dump file does not exist
FAIL: libgomp.graphite/force-parallel-3.c scan-tree-dump-times optimized "loopfn.1" 5: dump file does not exist
FAIL: libgomp.graphite/force-parallel-9.c (internal compiler error)
FAIL: libgomp.graphite/force-parallel-9.c (test for excess errors)
WARNING: libgomp.graphite/force-parallel-9.c compilation failed to produce executable
FAIL: libgomp.graphite/force-parallel-9.c scan-tree-dump-times optimized "loopfn.0" 5: dump file does not exist
FAIL: libgomp.graphite/force-parallel-9.c scan-tree-dump-times optimized "loopfn.1" 5: dump file does not exist

		=== libgomp Summary for unix/-m32 ===

# of expected passes		2528
# of unexpected failures	8
# of unsupported tests		2

Running target unix/-m64
FAIL: libgomp.fortran/appendix-a/a.16.1.f90  -Os  (internal compiler error)
FAIL: libgomp.fortran/appendix-a/a.16.1.f90  -Os  (test for excess errors)
WARNING: libgomp.fortran/appendix-a/a.16.1.f90  -Os  compilation failed to produce executable
FAIL: libgomp.fortran/omp_atomic2.f90  -Os  (internal compiler error)
FAIL: libgomp.fortran/omp_atomic2.f90  -Os  (test for excess errors)
WARNING: libgomp.fortran/omp_atomic2.f90  -Os  compilation failed to produce executable
FAIL: libgomp.graphite/force-parallel-3.c (internal compiler error)
FAIL: libgomp.graphite/force-parallel-3.c (test for excess errors)
WARNING: libgomp.graphite/force-parallel-3.c compilation failed to produce executable
FAIL: libgomp.graphite/force-parallel-3.c scan-tree-dump-times optimized "loopfn.0" 5: dump file does not exist
FAIL: libgomp.graphite/force-parallel-3.c scan-tree-dump-times optimized "loopfn.1" 5: dump file does not exist
FAIL: libgomp.graphite/force-parallel-9.c (internal compiler error)
FAIL: libgomp.graphite/force-parallel-9.c (test for excess errors)
WARNING: libgomp.graphite/force-parallel-9.c compilation failed to produce executable
FAIL: libgomp.graphite/force-parallel-9.c scan-tree-dump-times optimized "loopfn.0" 5: dump file does not exist
FAIL: libgomp.graphite/force-parallel-9.c scan-tree-dump-times optimized "loopfn.1" 5: dump file does not exist

		=== libgomp Summary for unix/-m64 ===

# of expected passes		2524
# of unexpected failures	12
# of unsupported tests		2

		=== libgomp Summary ===

# of expected passes		5052
# of unexpected failures	20
# of unsupported tests		4
		=== libjava tests ===


Running target unix/-m32
FAIL: PR16923.c compilation

		=== libjava Summary for unix/-m32 ===

# of expected passes		2572
# of unexpected failures	1

Running target unix/-m64

		=== libjava Summary for unix/-m64 ===

# of expected passes		2574

		=== libjava Summary ===

# of expected passes		5146
# of unexpected failures	1
		=== libstdc++ tests ===


Running target unix/-m32

		=== libstdc++ Summary for unix/-m32 ===

# of expected passes		6682
# of expected failures		81
# of unsupported tests		631

Running target unix/-m64
FAIL: 25_algorithms/heap/moveable.cc (test for excess errors)
WARNING: 25_algorithms/heap/moveable.cc compilation failed to produce executable
FAIL: 25_algorithms/heap/moveable2.cc (test for excess errors)
WARNING: 25_algorithms/heap/moveable2.cc compilation failed to produce executable

		=== libstdc++ Summary for unix/-m64 ===

# of expected passes		6676
# of unexpected failures	2
# of expected failures		81
# of unsupported tests		632

		=== libstdc++ Summary ===

# of expected passes		13358
# of unexpected failures	2
# of expected failures		162
# of unsupported tests		1263

Compiler version: 4.6.0 20100904 (experimental) (GCC) 
Platform: x86_64-apple-darwin10.5.0
configure flags: --prefix=/sw --prefix=/sw/lib/gcc4.6 --mandir=/sw/share/man --infodir=/sw/lib/gcc4.6/info --enable-languages=c,c++,fortran,objc,obj-c++,java --with-gmp=/sw --with-libiconv-prefix=/sw --with-ppl=/sw --with-cloog=/sw --with-mpc=/sw --with-system-zlib --x-includes=/usr/X11R6/include --x-libraries=/usr/X11R6/lib --program-suffix=-fsf-4.6 --enable-checking=yes






Index Nav: [Date Index] [Subject Index] [Author Index] [Thread Index]
Message Nav: [Date Prev] [Date Next] [Thread Prev] [Thread Next]