This is the mail archive of the gcc-testresults@gcc.gnu.org mailing list for the GCC project.


Index Nav: [Date Index] [Subject Index] [Author Index] [Thread Index]
Message Nav: [Date Prev] [Date Next] [Thread Prev] [Thread Next]
Other format: [Raw text]

Results for 4.5.0 20090423 (experimental) (GCC) testsuite on i686-apple-darwin9


Part of a series (see PR35165)
baseline darwin9 test
Revision: 146648
Path: /usr/local/gawk-3-1-6/bin:/usr/local/dejagnu-1-4-4/bin:/usr/ bin:/bin:/usr/sbin:/sbin:/usr/local/bin:/usr/X11/bin
BOOTSTRAPped with gcc version 4.0.1 (Apple Inc. build 5484)
uname -v : Darwin Kernel Version 9.6.0: Mon Nov 24 17:37:00 PST 2008; root:xnu-1228.9.59~1/RELEASE_I386
ld: @(#)PROGRAM:ld PROJECT:ld64-85
arch : i386 machine : i486
box description: Dual 4Core Xeon
dejagnu:
Expect version is 5.42.0
Tcl version is 8.4
Framework version is 1.4.4
gmp(4.2.4) / mpfr (2.3.2) built in tree
===========
LAST_UPDATED:
Native configuration is i686-apple-darwin9


=== g++ tests ===


Running target unix/-m32 FAIL: g++.dg/torture/stackalign/eh-alloca-1.C -O3 -g execution test FAIL: g++.dg/torture/stackalign/eh-vararg-1.C -O3 -g execution test FAIL: g++.dg/torture/stackalign/eh-vararg-2.C -O3 -g execution test FAIL: g++.dg/torture/stackalign/throw-1.C -O3 -g execution test FAIL: g++.dg/torture/stackalign/eh-alloca-1.C -O3 -g execution test FAIL: g++.dg/torture/stackalign/eh-vararg-1.C -O3 -g execution test FAIL: g++.dg/torture/stackalign/eh-vararg-2.C -O3 -g execution test FAIL: g++.dg/torture/stackalign/throw-1.C -O3 -g execution test

=== g++ Summary for unix/-m32 ===

# of expected passes		19662
# of unexpected failures	8
# of expected failures		140
# of unsupported tests		152

Running target unix/-m64

=== g++ Summary for unix/-m64 ===

# of expected passes		19358
# of expected failures		140
# of unsupported tests		298

=== g++ Summary ===

# of expected passes 39020
# of unexpected failures 8
# of expected failures 280
# of unsupported tests 450
/Volumes/ScratchCS/gcc-4-5-reg-build/gcc/testsuite/g++/../../g++ version 4.5.0 20090423 (experimental) (GCC)


=== gcc tests ===


Running target unix/-m32
XPASS: gcc.dg/Warray-bounds.c (test for warnings, line 59)
XPASS: gcc.dg/Warray-bounds.c (test for warnings, line 65)
FAIL: gcc.dg/c99-stdint-1.c (test for excess errors)
FAIL: gcc.dg/c99-stdint-2.c (test for excess errors)
FAIL: gcc.dg/c99-stdint-5.c (test for excess errors)
FAIL: gcc.dg/c99-stdint-6.c (test for excess errors)
FAIL: gcc.dg/c99-stdint-7.c (test for excess errors)
FAIL: gcc.dg/c99-stdint-8.c (test for excess errors)
FAIL: gcc.dg/profile-generate-3.c (test for excess errors)
XPASS: gcc.dg/struct/wo_prof_array_through_pointer.c scan-ipa-dump ipa_struct_reorg "Number of structures to transform is 1"
FAIL: gcc.target/i386/excess-precision-1.c execution test
FAIL: gcc.target/i386/excess-precision-2.c execution test
FAIL: gcc.target/i386/excess-precision-3.c execution test


=== gcc Summary for unix/-m32 ===

# of expected passes		55714
# of unexpected failures	10
# of unexpected successes	3
# of expected failures		142
# of unsupported tests		1072

Running target unix/-m64
FAIL: tmpdir-gcc.dg-struct-layout-1/t026 c_compat_x_tst.o compile, (internal compiler error)
FAIL: tmpdir-gcc.dg-struct-layout-1/t026 c_compat_y_tst.o compile, (internal compiler error)
UNRESOLVED: tmpdir-gcc.dg-struct-layout-1/t026 c_compat_x_tst.o- c_compat_y_tst.o link
UNRESOLVED: tmpdir-gcc.dg-struct-layout-1/t026 c_compat_x_tst.o- c_compat_y_tst.o execute
XPASS: gcc.dg/Warray-bounds.c (test for warnings, line 59)
XPASS: gcc.dg/Warray-bounds.c (test for warnings, line 65)
FAIL: gcc.dg/c99-stdint-1.c (test for excess errors)
FAIL: gcc.dg/c99-stdint-2.c (test for excess errors)
FAIL: gcc.dg/c99-stdint-5.c (test for excess errors)
FAIL: gcc.dg/c99-stdint-6.c (test for excess errors)
FAIL: gcc.dg/c99-stdint-7.c (test for excess errors)
FAIL: gcc.dg/c99-stdint-8.c (test for excess errors)
FAIL: gcc.dg/profile-generate-3.c (test for excess errors)
XPASS: gcc.dg/struct/wo_prof_array_through_pointer.c scan-ipa-dump ipa_struct_reorg "Number of structures to transform is 1"


=== gcc Summary for unix/-m64 ===

# of expected passes		55335
# of unexpected failures	9
# of unexpected successes	3
# of expected failures		142
# of unresolved testcases	2
# of unsupported tests		1352

=== gcc Summary ===

# of expected passes 111049
# of unexpected failures 19
# of unexpected successes 6
# of expected failures 284
# of unresolved testcases 2
# of unsupported tests 2424
/Volumes/ScratchCS/gcc-4-5-reg-build/gcc/xgcc version 4.5.0 20090423 (experimental) (GCC)


=== gfortran tests ===


Running target unix/-m32


=== gfortran Summary for unix/-m32 ===

# of expected passes		30081
# of expected failures		19
# of unsupported tests		119

Running target unix/-m64

=== gfortran Summary for unix/-m64 ===

# of expected passes		30194
# of expected failures		19
# of unsupported tests		66

=== gfortran Summary ===

# of expected passes 60275
# of expected failures 38
# of unsupported tests 185
/Volumes/ScratchCS/gcc-4-5-reg-build/gcc/testsuite/gfortran/../../ gfortran version 4.5.0 20090423 (experimental) (GCC)


=== obj-c++ tests ===


Running target unix/-m32
FAIL: obj-c++.dg/basic.mm (test for excess errors)
FAIL: obj-c++.dg/basic.mm execution test
FAIL: obj-c++.dg/bitfield-2.mm (test for excess errors)
FAIL: obj-c++.dg/bitfield-2.mm execution test
XPASS: obj-c++.dg/comp-types-10.mm (test for excess errors)
FAIL: obj-c++.dg/const-str-10.mm (test for excess errors)
FAIL: obj-c++.dg/const-str-11.mm (test for excess errors)
FAIL: obj-c++.dg/const-str-3.mm (test for excess errors)
FAIL: obj-c++.dg/const-str-7.mm (test for excess errors)
FAIL: obj-c++.dg/const-str-8.mm (test for excess errors)
FAIL: obj-c++.dg/const-str-9.mm (test for excess errors)
FAIL: obj-c++.dg/cxx-ivars-1.mm (test for excess errors)
FAIL: obj-c++.dg/cxx-ivars-1.mm execution test
FAIL: obj-c++.dg/cxx-ivars-2.mm (test for excess errors)
FAIL: obj-c++.dg/cxx-ivars-3.mm (test for excess errors)
FAIL: obj-c++.dg/cxx-scope-1.mm (test for excess errors)
FAIL: obj-c++.dg/cxx-scope-1.mm execution test
FAIL: obj-c++.dg/defs.mm (test for excess errors)
FAIL: obj-c++.dg/defs.mm execution test
FAIL: obj-c++.dg/encode-4.mm (test for excess errors)
FAIL: obj-c++.dg/encode-4.mm execution test
FAIL: obj-c++.dg/encode-5.mm (test for excess errors)
WARNING: obj-c++.dg/encode-5.mm compilation failed to produce executable
FAIL: obj-c++.dg/encode-6.mm (test for excess errors)
FAIL: obj-c++.dg/encode-7.mm (test for excess errors)
XPASS: obj-c++.dg/encode-8.mm execution test
FAIL: obj-c++.dg/except-1.mm (test for excess errors)
FAIL: obj-c++.dg/except-1.mm execution test
XPASS: obj-c++.dg/isa-field-1.mm (test for excess errors)
FAIL: obj-c++.dg/lookup-2.mm execution test
FAIL: obj-c++.dg/method-10.mm (test for excess errors)
FAIL: obj-c++.dg/method-10.mm execution test
FAIL: obj-c++.dg/method-12.mm (test for excess errors)
FAIL: obj-c++.dg/method-17.mm (test for excess errors)
FAIL: obj-c++.dg/method-17.mm execution test
FAIL: obj-c++.dg/method-19.mm (test for excess errors)
FAIL: obj-c++.dg/method-19.mm execution test
FAIL: obj-c++.dg/proto-lossage-3.mm (test for excess errors)
WARNING: obj-c++.dg/proto-lossage-3.mm compilation failed to produce executable
FAIL: obj-c++.dg/proto-qual-1.mm (test for excess errors)
WARNING: obj-c++.dg/proto-qual-1.mm compilation failed to produce executable
FAIL: obj-c++.dg/qual-types-1.mm (test for excess errors)
FAIL: obj-c++.dg/qual-types-1.mm execution test
FAIL: obj-c++.dg/stubify-2.mm (test for excess errors)
ERROR: obj-c++.dg/stubify-2.mm: error executing dg-final: couldn't open "stubify-2.mm.08.jump": no such file or directory
UNRESOLVED: obj-c++.dg/stubify-2.mm: error executing dg-final: couldn't open "stubify-2.mm.08.jump": no such file or directory
FAIL: obj-c++.dg/template-1.mm (test for excess errors)
FAIL: obj-c++.dg/template-1.mm execution test
FAIL: obj-c++.dg/template-3.mm (test for excess errors)
FAIL: obj-c++.dg/template-3.mm execution test
FAIL: obj-c++.dg/template-4.mm (test for excess errors)
FAIL: obj-c++.dg/template-4.mm execution test
FAIL: obj-c++.dg/try-catch-2.mm execution test
FAIL: obj-c++.dg/try-catch-9.mm execution test
FAIL: obj-c++.dg/va-meth-1.mm (test for excess errors)
FAIL: obj-c++.dg/va-meth-1.mm execution test


=== obj-c++ Summary for unix/-m32 ===

# of expected passes		412
# of unexpected failures	48
# of unexpected successes	3
# of expected failures		7
# of unresolved testcases	1
# of unsupported tests		1

Running target unix/-m64
FAIL: obj-c++.dg/basic.mm (test for excess errors)
FAIL: obj-c++.dg/basic.mm execution test
FAIL: obj-c++.dg/bitfield-2.mm (test for excess errors)
FAIL: obj-c++.dg/bitfield-2.mm execution test
XPASS: obj-c++.dg/comp-types-10.mm (test for excess errors)
FAIL: obj-c++.dg/const-str-10.mm (test for excess errors)
FAIL: obj-c++.dg/const-str-10.mm scan-assembler .long\ \t__NSConstantStringClassReference\\n\\t.long\\t.*\\n\\t.long\\t5\\n\ \t.data
FAIL: obj-c++.dg/const-str-11.mm (test for excess errors)
FAIL: obj-c++.dg/const-str-11.mm scan-assembler .long\ \t__XStrClassReference\\n\\t.long\\t.*\\n\\t.long\\t5\\n\\t.data
FAIL: obj-c++.dg/const-str-3.mm (test for excess errors)
FAIL: obj-c++.dg/const-str-3.mm execution test
FAIL: obj-c++.dg/const-str-7.mm (test for excess errors)
FAIL: obj-c++.dg/const-str-8.mm (test for excess errors)
FAIL: obj-c++.dg/cxx-ivars-1.mm (test for excess errors)
FAIL: obj-c++.dg/cxx-ivars-1.mm execution test
FAIL: obj-c++.dg/cxx-ivars-2.mm (test for excess errors)
FAIL: obj-c++.dg/cxx-ivars-3.mm (test for excess errors)
FAIL: obj-c++.dg/cxx-ivars-3.mm execution test
FAIL: obj-c++.dg/cxx-scope-1.mm (test for excess errors)
FAIL: obj-c++.dg/cxx-scope-1.mm execution test
FAIL: obj-c++.dg/defs.mm (test for excess errors)
FAIL: obj-c++.dg/defs.mm execution test
FAIL: obj-c++.dg/encode-4.mm (test for excess errors)
FAIL: obj-c++.dg/encode-4.mm execution test
FAIL: obj-c++.dg/encode-5.mm (test for excess errors)
WARNING: obj-c++.dg/encode-5.mm compilation failed to produce executable
FAIL: obj-c++.dg/encode-6.mm (test for excess errors)
FAIL: obj-c++.dg/encode-6.mm execution test
FAIL: obj-c++.dg/encode-7.mm (test for excess errors)
XPASS: obj-c++.dg/encode-8.mm execution test
FAIL: obj-c++.dg/except-1.mm (test for excess errors)
FAIL: obj-c++.dg/except-1.mm execution test
XPASS: obj-c++.dg/isa-field-1.mm (test for excess errors)
FAIL: obj-c++.dg/lookup-2.mm execution test
FAIL: obj-c++.dg/method-10.mm (test for excess errors)
FAIL: obj-c++.dg/method-10.mm execution test
FAIL: obj-c++.dg/method-12.mm (test for excess errors)
FAIL: obj-c++.dg/method-17.mm (test for excess errors)
FAIL: obj-c++.dg/method-17.mm execution test
FAIL: obj-c++.dg/method-19.mm (test for excess errors)
FAIL: obj-c++.dg/method-19.mm execution test
FAIL: obj-c++.dg/proto-lossage-3.mm (test for excess errors)
WARNING: obj-c++.dg/proto-lossage-3.mm compilation failed to produce executable
FAIL: obj-c++.dg/proto-qual-1.mm (test for excess errors)
WARNING: obj-c++.dg/proto-qual-1.mm compilation failed to produce executable
FAIL: obj-c++.dg/qual-types-1.mm (test for excess errors)
FAIL: obj-c++.dg/qual-types-1.mm execution test
FAIL: obj-c++.dg/stubify-2.mm (test for excess errors)
ERROR: obj-c++.dg/stubify-2.mm: error executing dg-final: couldn't open "stubify-2.mm.08.jump": no such file or directory
UNRESOLVED: obj-c++.dg/stubify-2.mm: error executing dg-final: couldn't open "stubify-2.mm.08.jump": no such file or directory
FAIL: obj-c++.dg/template-1.mm (test for excess errors)
FAIL: obj-c++.dg/template-1.mm execution test
FAIL: obj-c++.dg/template-3.mm (test for excess errors)
FAIL: obj-c++.dg/template-3.mm execution test
WARNING: obj-c++.dg/try-catch-2.mm compilation failed to produce executable
WARNING: obj-c++.dg/try-catch-9.mm compilation failed to produce executable
FAIL: obj-c++.dg/va-meth-1.mm (test for excess errors)
FAIL: obj-c++.dg/va-meth-1.mm execution test


=== obj-c++ Summary for unix/-m64 ===

# of expected passes		394
# of unexpected failures	48
# of unexpected successes	3
# of expected failures		18
# of unresolved testcases	1
# of unsupported tests		3

=== obj-c++ Summary ===

# of expected passes 806
# of unexpected failures 96
# of unexpected successes 6
# of expected failures 25
# of unresolved testcases 2
# of unsupported tests 4
/Volumes/ScratchCS/gcc-4-5-reg-build/gcc/testsuite/obj-c++/../../g++ version 4.5.0 20090423 (experimental) (GCC)


=== objc tests ===


Running target unix/-m32
FAIL: objc/execute/bycopy-1.m compilation, -O0 -fnext-runtime
UNRESOLVED: objc/execute/bycopy-1.m execution, -O0 -fnext-runtime
FAIL: objc/execute/bycopy-1.m compilation, -O1 -fnext-runtime
UNRESOLVED: objc/execute/bycopy-1.m execution, -O1 -fnext-runtime
FAIL: objc/execute/bycopy-1.m compilation, -O2 -fnext-runtime
UNRESOLVED: objc/execute/bycopy-1.m execution, -O2 -fnext-runtime
FAIL: objc/execute/bycopy-1.m compilation, -O3 -fomit-frame-pointer - fnext-runtime
UNRESOLVED: objc/execute/bycopy-1.m execution, -O3 -fomit-frame- pointer -fnext-runtime
FAIL: objc/execute/bycopy-1.m compilation, -O3 -g -fnext-runtime
UNRESOLVED: objc/execute/bycopy-1.m execution, -O3 -g -fnext-runtime
FAIL: objc/execute/bycopy-1.m compilation, -Os -fnext-runtime
UNRESOLVED: objc/execute/bycopy-1.m execution, -Os -fnext-runtime
FAIL: objc/execute/bycopy-2.m compilation, -O0 -fnext-runtime
UNRESOLVED: objc/execute/bycopy-2.m execution, -O0 -fnext-runtime
FAIL: objc/execute/bycopy-2.m compilation, -O1 -fnext-runtime
UNRESOLVED: objc/execute/bycopy-2.m execution, -O1 -fnext-runtime
FAIL: objc/execute/bycopy-2.m compilation, -O2 -fnext-runtime
UNRESOLVED: objc/execute/bycopy-2.m execution, -O2 -fnext-runtime
FAIL: objc/execute/bycopy-2.m compilation, -O3 -fomit-frame-pointer - fnext-runtime
UNRESOLVED: objc/execute/bycopy-2.m execution, -O3 -fomit-frame- pointer -fnext-runtime
FAIL: objc/execute/bycopy-2.m compilation, -O3 -g -fnext-runtime
UNRESOLVED: objc/execute/bycopy-2.m execution, -O3 -g -fnext-runtime
FAIL: objc/execute/bycopy-2.m compilation, -Os -fnext-runtime
UNRESOLVED: objc/execute/bycopy-2.m execution, -Os -fnext-runtime
FAIL: objc/execute/bycopy-3.m compilation, -O0 -fnext-runtime
UNRESOLVED: objc/execute/bycopy-3.m execution, -O0 -fnext-runtime
FAIL: objc/execute/bycopy-3.m compilation, -O1 -fnext-runtime
UNRESOLVED: objc/execute/bycopy-3.m execution, -O1 -fnext-runtime
FAIL: objc/execute/bycopy-3.m compilation, -O2 -fnext-runtime
UNRESOLVED: objc/execute/bycopy-3.m execution, -O2 -fnext-runtime
FAIL: objc/execute/bycopy-3.m compilation, -O3 -fomit-frame-pointer - fnext-runtime
UNRESOLVED: objc/execute/bycopy-3.m execution, -O3 -fomit-frame- pointer -fnext-runtime
FAIL: objc/execute/bycopy-3.m compilation, -O3 -g -fnext-runtime
UNRESOLVED: objc/execute/bycopy-3.m execution, -O3 -g -fnext-runtime
FAIL: objc/execute/bycopy-3.m compilation, -Os -fnext-runtime
UNRESOLVED: objc/execute/bycopy-3.m execution, -Os -fnext-runtime
FAIL: objc/execute/formal_protocol-5.m compilation, -O0 -fnext-runtime
UNRESOLVED: objc/execute/formal_protocol-5.m execution, -O0 -fnext- runtime
FAIL: objc/execute/formal_protocol-5.m compilation, -O1 -fnext-runtime
UNRESOLVED: objc/execute/formal_protocol-5.m execution, -O1 -fnext- runtime
FAIL: objc/execute/formal_protocol-5.m compilation, -O2 -fnext-runtime
UNRESOLVED: objc/execute/formal_protocol-5.m execution, -O2 -fnext- runtime
FAIL: objc/execute/formal_protocol-5.m compilation, -O3 -fomit-frame- pointer -fnext-runtime
UNRESOLVED: objc/execute/formal_protocol-5.m execution, -O3 -fomit- frame-pointer -fnext-runtime
FAIL: objc/execute/formal_protocol-5.m compilation, -O3 -g -fnext- runtime
UNRESOLVED: objc/execute/formal_protocol-5.m execution, -O3 -g - fnext-runtime
FAIL: objc/execute/formal_protocol-5.m compilation, -Os -fnext-runtime
UNRESOLVED: objc/execute/formal_protocol-5.m execution, -Os -fnext- runtime
FAIL: objc/execute/formal_protocol-6.m compilation, -O0 -fnext-runtime
UNRESOLVED: objc/execute/formal_protocol-6.m execution, -O0 -fnext- runtime
FAIL: objc/execute/formal_protocol-6.m compilation, -O1 -fnext-runtime
UNRESOLVED: objc/execute/formal_protocol-6.m execution, -O1 -fnext- runtime
FAIL: objc/execute/formal_protocol-6.m compilation, -O2 -fnext-runtime
UNRESOLVED: objc/execute/formal_protocol-6.m execution, -O2 -fnext- runtime
FAIL: objc/execute/formal_protocol-6.m compilation, -O3 -fomit-frame- pointer -fnext-runtime
UNRESOLVED: objc/execute/formal_protocol-6.m execution, -O3 -fomit- frame-pointer -fnext-runtime
FAIL: objc/execute/formal_protocol-6.m compilation, -O3 -g -fnext- runtime
UNRESOLVED: objc/execute/formal_protocol-6.m execution, -O3 -g - fnext-runtime
FAIL: objc/execute/formal_protocol-6.m compilation, -Os -fnext-runtime
UNRESOLVED: objc/execute/formal_protocol-6.m execution, -Os -fnext- runtime
FAIL: objc/execute/formal_protocol-7.m compilation, -O0 -fnext-runtime
UNRESOLVED: objc/execute/formal_protocol-7.m execution, -O0 -fnext- runtime
FAIL: objc/execute/formal_protocol-7.m compilation, -O1 -fnext-runtime
UNRESOLVED: objc/execute/formal_protocol-7.m execution, -O1 -fnext- runtime
FAIL: objc/execute/formal_protocol-7.m compilation, -O2 -fnext-runtime
UNRESOLVED: objc/execute/formal_protocol-7.m execution, -O2 -fnext- runtime
FAIL: objc/execute/formal_protocol-7.m compilation, -O3 -fomit-frame- pointer -fnext-runtime
UNRESOLVED: objc/execute/formal_protocol-7.m execution, -O3 -fomit- frame-pointer -fnext-runtime
FAIL: objc/execute/formal_protocol-7.m compilation, -O3 -g -fnext- runtime
UNRESOLVED: objc/execute/formal_protocol-7.m execution, -O3 -g - fnext-runtime
FAIL: objc/execute/formal_protocol-7.m compilation, -Os -fnext-runtime
UNRESOLVED: objc/execute/formal_protocol-7.m execution, -Os -fnext- runtime
FAIL: objc/execute/np-1.m compilation, -O0 -fnext-runtime
UNRESOLVED: objc/execute/np-1.m execution, -O0 -fnext-runtime
FAIL: objc/execute/np-1.m compilation, -O1 -fnext-runtime
UNRESOLVED: objc/execute/np-1.m execution, -O1 -fnext-runtime
FAIL: objc/execute/np-1.m compilation, -O2 -fnext-runtime
UNRESOLVED: objc/execute/np-1.m execution, -O2 -fnext-runtime
FAIL: objc/execute/np-1.m compilation, -O3 -fomit-frame-pointer - fnext-runtime
UNRESOLVED: objc/execute/np-1.m execution, -O3 -fomit-frame-pointer - fnext-runtime
FAIL: objc/execute/np-1.m compilation, -O3 -g -fnext-runtime
UNRESOLVED: objc/execute/np-1.m execution, -O3 -g -fnext-runtime
FAIL: objc/execute/np-1.m compilation, -Os -fnext-runtime
UNRESOLVED: objc/execute/np-1.m execution, -Os -fnext-runtime
FAIL: objc/execute/np-2.m compilation, -O0 -fnext-runtime
UNRESOLVED: objc/execute/np-2.m execution, -O0 -fnext-runtime
FAIL: objc/execute/np-2.m compilation, -O1 -fnext-runtime
UNRESOLVED: objc/execute/np-2.m execution, -O1 -fnext-runtime
FAIL: objc/execute/np-2.m compilation, -O2 -fnext-runtime
UNRESOLVED: objc/execute/np-2.m execution, -O2 -fnext-runtime
FAIL: objc/execute/np-2.m compilation, -O3 -fomit-frame-pointer - fnext-runtime
UNRESOLVED: objc/execute/np-2.m execution, -O3 -fomit-frame-pointer - fnext-runtime
FAIL: objc/execute/np-2.m compilation, -O3 -g -fnext-runtime
UNRESOLVED: objc/execute/np-2.m execution, -O3 -g -fnext-runtime
FAIL: objc/execute/np-2.m compilation, -Os -fnext-runtime
UNRESOLVED: objc/execute/np-2.m execution, -Os -fnext-runtime
FAIL: objc/execute/protocol-isEqual-1.m compilation, -O0 -fnext-runtime
UNRESOLVED: objc/execute/protocol-isEqual-1.m execution, -O0 -fnext- runtime
FAIL: objc/execute/protocol-isEqual-1.m compilation, -O1 -fnext-runtime
UNRESOLVED: objc/execute/protocol-isEqual-1.m execution, -O1 -fnext- runtime
FAIL: objc/execute/protocol-isEqual-1.m compilation, -O2 -fnext-runtime
UNRESOLVED: objc/execute/protocol-isEqual-1.m execution, -O2 -fnext- runtime
FAIL: objc/execute/protocol-isEqual-1.m compilation, -O3 -fomit- frame-pointer -fnext-runtime
UNRESOLVED: objc/execute/protocol-isEqual-1.m execution, -O3 -fomit- frame-pointer -fnext-runtime
FAIL: objc/execute/protocol-isEqual-1.m compilation, -O3 -g -fnext- runtime
UNRESOLVED: objc/execute/protocol-isEqual-1.m execution, -O3 -g - fnext-runtime
FAIL: objc/execute/protocol-isEqual-1.m compilation, -Os -fnext-runtime
UNRESOLVED: objc/execute/protocol-isEqual-1.m execution, -Os -fnext- runtime
FAIL: objc/execute/protocol-isEqual-2.m compilation, -O0 -fnext-runtime
UNRESOLVED: objc/execute/protocol-isEqual-2.m execution, -O0 -fnext- runtime
FAIL: objc/execute/protocol-isEqual-2.m compilation, -O1 -fnext-runtime
UNRESOLVED: objc/execute/protocol-isEqual-2.m execution, -O1 -fnext- runtime
FAIL: objc/execute/protocol-isEqual-2.m compilation, -O2 -fnext-runtime
UNRESOLVED: objc/execute/protocol-isEqual-2.m execution, -O2 -fnext- runtime
FAIL: objc/execute/protocol-isEqual-2.m compilation, -O3 -fomit- frame-pointer -fnext-runtime
UNRESOLVED: objc/execute/protocol-isEqual-2.m execution, -O3 -fomit- frame-pointer -fnext-runtime
FAIL: objc/execute/protocol-isEqual-2.m compilation, -O3 -g -fnext- runtime
UNRESOLVED: objc/execute/protocol-isEqual-2.m execution, -O3 -g - fnext-runtime
FAIL: objc/execute/protocol-isEqual-2.m compilation, -Os -fnext-runtime
UNRESOLVED: objc/execute/protocol-isEqual-2.m execution, -Os -fnext- runtime
FAIL: objc/execute/protocol-isEqual-3.m compilation, -O0 -fnext-runtime
UNRESOLVED: objc/execute/protocol-isEqual-3.m execution, -O0 -fnext- runtime
FAIL: objc/execute/protocol-isEqual-3.m compilation, -O1 -fnext-runtime
UNRESOLVED: objc/execute/protocol-isEqual-3.m execution, -O1 -fnext- runtime
FAIL: objc/execute/protocol-isEqual-3.m compilation, -O2 -fnext-runtime
UNRESOLVED: objc/execute/protocol-isEqual-3.m execution, -O2 -fnext- runtime
FAIL: objc/execute/protocol-isEqual-3.m compilation, -O3 -fomit- frame-pointer -fnext-runtime
UNRESOLVED: objc/execute/protocol-isEqual-3.m execution, -O3 -fomit- frame-pointer -fnext-runtime
FAIL: objc/execute/protocol-isEqual-3.m compilation, -O3 -g -fnext- runtime
UNRESOLVED: objc/execute/protocol-isEqual-3.m execution, -O3 -g - fnext-runtime
FAIL: objc/execute/protocol-isEqual-3.m compilation, -Os -fnext-runtime
UNRESOLVED: objc/execute/protocol-isEqual-3.m execution, -Os -fnext- runtime
FAIL: objc/execute/protocol-isEqual-4.m compilation, -O0 -fnext-runtime
UNRESOLVED: objc/execute/protocol-isEqual-4.m execution, -O0 -fnext- runtime
FAIL: objc/execute/protocol-isEqual-4.m compilation, -O1 -fnext-runtime
UNRESOLVED: objc/execute/protocol-isEqual-4.m execution, -O1 -fnext- runtime
FAIL: objc/execute/protocol-isEqual-4.m compilation, -O2 -fnext-runtime
UNRESOLVED: objc/execute/protocol-isEqual-4.m execution, -O2 -fnext- runtime
FAIL: objc/execute/protocol-isEqual-4.m compilation, -O3 -fomit- frame-pointer -fnext-runtime
UNRESOLVED: objc/execute/protocol-isEqual-4.m execution, -O3 -fomit- frame-pointer -fnext-runtime
FAIL: objc/execute/protocol-isEqual-4.m compilation, -O3 -g -fnext- runtime
UNRESOLVED: objc/execute/protocol-isEqual-4.m execution, -O3 -g - fnext-runtime
FAIL: objc/execute/protocol-isEqual-4.m compilation, -Os -fnext-runtime
UNRESOLVED: objc/execute/protocol-isEqual-4.m execution, -Os -fnext- runtime
FAIL: objc.dg/category-1.m (test for excess errors)
FAIL: objc.dg/const-str-10.m (test for excess errors)
FAIL: objc.dg/const-str-11.m (test for excess errors)
FAIL: objc.dg/const-str-3.m (test for excess errors)
FAIL: objc.dg/const-str-7.m (test for excess errors)
FAIL: objc.dg/const-str-8.m (test for excess errors)
FAIL: objc.dg/const-str-9.m (test for excess errors)
FAIL: objc.dg/encode-2.m (test for excess errors)
FAIL: objc.dg/encode-3.m (test for excess errors)
WARNING: objc.dg/encode-3.m compilation failed to produce executable
FAIL: objc.dg/encode-4.m (test for excess errors)
FAIL: objc.dg/encode-5.m (test for excess errors)
FAIL: objc.dg/headers.m (test for excess errors)
FAIL: objc.dg/method-6.m (test for excess errors)
FAIL: objc.dg/no-extra-load.m (test for excess errors)
ERROR: objc.dg/no-extra-load.m: error executing dg-final: couldn't open "no-extra-load.s": no such file or directory
UNRESOLVED: objc.dg/no-extra-load.m: error executing dg-final: couldn't open "no-extra-load.s": no such file or directory
FAIL: objc.dg/proto-lossage-3.m (test for excess errors)
WARNING: objc.dg/proto-lossage-3.m compilation failed to produce executable
FAIL: objc.dg/proto-qual-1.m (test for excess errors)
WARNING: objc.dg/proto-qual-1.m compilation failed to produce executable
FAIL: objc.dg/stret-2.m scan-assembler objc_msgSend_stret
FAIL: objc.dg/stret-2.m scan-assembler-not objc_msgSend[^_S]
FAIL: objc.dg/stret-2.m scan-assembler-not objc_msgSendSuper[^_]
FAIL: objc.dg/stubify-1.m (test for excess errors)
ERROR: objc.dg/stubify-1.m: error executing dg-final: couldn't open "stubify-1.s": no such file or directory
UNRESOLVED: objc.dg/stubify-1.m: error executing dg-final: couldn't open "stubify-1.s": no such file or directory
FAIL: objc.dg/stubify-2.m (test for excess errors)
FAIL: objc.dg/stubify-2.m scan-rtl-dump-not jump "symbol_ref.*"objc_msgSend"": dump file does not exist
FAIL: objc.dg/symtab-1.m scan-assembler L_OBJC_SYMBOLS.*:\\n\\t.long\ \t0\\n\\t.long\\t0\\n\\t.short\\t2\\n\\t.short\\t0\\n\\t.long\ \tL_OBJC_CLASS_Derived.*\\n\\t.long\\tL_OBJC_CLASS_Base.*\\n
FAIL: objc.dg/type-size-2.m (test for excess errors)


=== objc Summary for unix/-m32 ===

# of expected passes		2983
# of unexpected failures	96
# of expected failures		7
# of unresolved testcases	74
# of unsupported tests		2

Running target unix/-m64
FAIL: objc/execute/exceptions/catchall-1.m compilation, -O0 -fnext- runtime
UNRESOLVED: objc/execute/exceptions/catchall-1.m execution, -O0 - fnext-runtime
FAIL: objc/execute/exceptions/catchall-1.m compilation, -O1 -fnext- runtime
UNRESOLVED: objc/execute/exceptions/catchall-1.m execution, -O1 - fnext-runtime
FAIL: objc/execute/exceptions/catchall-1.m compilation, -O2 -fnext- runtime
UNRESOLVED: objc/execute/exceptions/catchall-1.m execution, -O2 - fnext-runtime
FAIL: objc/execute/exceptions/catchall-1.m compilation, -O3 -fomit- frame-pointer -fnext-runtime
UNRESOLVED: objc/execute/exceptions/catchall-1.m execution, -O3 - fomit-frame-pointer -fnext-runtime
FAIL: objc/execute/exceptions/catchall-1.m compilation, -O3 -g - fnext-runtime
UNRESOLVED: objc/execute/exceptions/catchall-1.m execution, -O3 -g - fnext-runtime
FAIL: objc/execute/exceptions/catchall-1.m compilation, -Os -fnext- runtime
UNRESOLVED: objc/execute/exceptions/catchall-1.m execution, -Os - fnext-runtime
FAIL: objc/execute/exceptions/finally-1.m compilation, -O0 -fnext- runtime
UNRESOLVED: objc/execute/exceptions/finally-1.m execution, -O0 - fnext-runtime
FAIL: objc/execute/exceptions/finally-1.m compilation, -O1 -fnext- runtime
UNRESOLVED: objc/execute/exceptions/finally-1.m execution, -O1 - fnext-runtime
FAIL: objc/execute/exceptions/finally-1.m compilation, -O2 -fnext- runtime
UNRESOLVED: objc/execute/exceptions/finally-1.m execution, -O2 - fnext-runtime
FAIL: objc/execute/exceptions/finally-1.m compilation, -O3 -fomit- frame-pointer -fnext-runtime
UNRESOLVED: objc/execute/exceptions/finally-1.m execution, -O3 - fomit-frame-pointer -fnext-runtime
FAIL: objc/execute/exceptions/finally-1.m compilation, -O3 -g -fnext- runtime
UNRESOLVED: objc/execute/exceptions/finally-1.m execution, -O3 -g - fnext-runtime
FAIL: objc/execute/exceptions/finally-1.m compilation, -Os -fnext- runtime
UNRESOLVED: objc/execute/exceptions/finally-1.m execution, -Os - fnext-runtime
FAIL: objc/execute/exceptions/foward-1.m compilation, -O0 -fnext- runtime
UNRESOLVED: objc/execute/exceptions/foward-1.m execution, -O0 -fnext- runtime
FAIL: objc/execute/exceptions/foward-1.m compilation, -O1 -fnext- runtime
UNRESOLVED: objc/execute/exceptions/foward-1.m execution, -O1 -fnext- runtime
FAIL: objc/execute/exceptions/foward-1.m compilation, -O2 -fnext- runtime
UNRESOLVED: objc/execute/exceptions/foward-1.m execution, -O2 -fnext- runtime
FAIL: objc/execute/exceptions/foward-1.m compilation, -O3 -fomit- frame-pointer -fnext-runtime
UNRESOLVED: objc/execute/exceptions/foward-1.m execution, -O3 -fomit- frame-pointer -fnext-runtime
FAIL: objc/execute/exceptions/foward-1.m compilation, -O3 -fomit- frame-pointer -funroll-loops -fnext-runtime
UNRESOLVED: objc/execute/exceptions/foward-1.m execution, -O3 -fomit- frame-pointer -funroll-loops -fnext-runtime
FAIL: objc/execute/exceptions/foward-1.m compilation, -O3 -fomit- frame-pointer -funroll-all-loops -finline-functions -fnext-runtime
UNRESOLVED: objc/execute/exceptions/foward-1.m execution, -O3 -fomit- frame-pointer -funroll-all-loops -finline-functions -fnext-runtime
FAIL: objc/execute/exceptions/foward-1.m compilation, -O3 -g -fnext- runtime
UNRESOLVED: objc/execute/exceptions/foward-1.m execution, -O3 -g - fnext-runtime
FAIL: objc/execute/exceptions/foward-1.m compilation, -Os -fnext- runtime
UNRESOLVED: objc/execute/exceptions/foward-1.m execution, -Os -fnext- runtime
FAIL: objc/execute/exceptions/local-variables-1.m compilation, -O0 - fnext-runtime
UNRESOLVED: objc/execute/exceptions/local-variables-1.m execution, - O0 -fnext-runtime
FAIL: objc/execute/exceptions/local-variables-1.m compilation, -O1 - fnext-runtime
UNRESOLVED: objc/execute/exceptions/local-variables-1.m execution, - O1 -fnext-runtime
FAIL: objc/execute/exceptions/local-variables-1.m compilation, -O2 - fnext-runtime
UNRESOLVED: objc/execute/exceptions/local-variables-1.m execution, - O2 -fnext-runtime
FAIL: objc/execute/exceptions/local-variables-1.m compilation, -O3 - fomit-frame-pointer -fnext-runtime
UNRESOLVED: objc/execute/exceptions/local-variables-1.m execution, - O3 -fomit-frame-pointer -fnext-runtime
FAIL: objc/execute/exceptions/local-variables-1.m compilation, -O3 - g -fnext-runtime
UNRESOLVED: objc/execute/exceptions/local-variables-1.m execution, - O3 -g -fnext-runtime
FAIL: objc/execute/exceptions/local-variables-1.m compilation, -Os - fnext-runtime
UNRESOLVED: objc/execute/exceptions/local-variables-1.m execution, - Os -fnext-runtime
FAIL: objc/execute/exceptions/pr31281.m compilation, -O0 -fnext-runtime
UNRESOLVED: objc/execute/exceptions/pr31281.m execution, -O0 -fnext- runtime
FAIL: objc/execute/exceptions/pr31281.m compilation, -O1 -fnext-runtime
UNRESOLVED: objc/execute/exceptions/pr31281.m execution, -O1 -fnext- runtime
FAIL: objc/execute/exceptions/pr31281.m compilation, -O2 -fnext-runtime
UNRESOLVED: objc/execute/exceptions/pr31281.m execution, -O2 -fnext- runtime
FAIL: objc/execute/exceptions/pr31281.m compilation, -O3 -fomit- frame-pointer -fnext-runtime
UNRESOLVED: objc/execute/exceptions/pr31281.m execution, -O3 -fomit- frame-pointer -fnext-runtime
FAIL: objc/execute/exceptions/pr31281.m compilation, -O3 -fomit- frame-pointer -funroll-loops -fnext-runtime
UNRESOLVED: objc/execute/exceptions/pr31281.m execution, -O3 -fomit- frame-pointer -funroll-loops -fnext-runtime
FAIL: objc/execute/exceptions/pr31281.m compilation, -O3 -fomit- frame-pointer -funroll-all-loops -finline-functions -fnext-runtime
UNRESOLVED: objc/execute/exceptions/pr31281.m execution, -O3 -fomit- frame-pointer -funroll-all-loops -finline-functions -fnext-runtime
FAIL: objc/execute/exceptions/pr31281.m compilation, -O3 -g -fnext- runtime
UNRESOLVED: objc/execute/exceptions/pr31281.m execution, -O3 -g - fnext-runtime
FAIL: objc/execute/exceptions/pr31281.m compilation, -Os -fnext-runtime
UNRESOLVED: objc/execute/exceptions/pr31281.m execution, -Os -fnext- runtime
FAIL: objc/execute/exceptions/trivial.m compilation, -O0 -fnext-runtime
UNRESOLVED: objc/execute/exceptions/trivial.m execution, -O0 -fnext- runtime
FAIL: objc/execute/exceptions/trivial.m compilation, -O1 -fnext-runtime
UNRESOLVED: objc/execute/exceptions/trivial.m execution, -O1 -fnext- runtime
FAIL: objc/execute/exceptions/trivial.m compilation, -O2 -fnext-runtime
UNRESOLVED: objc/execute/exceptions/trivial.m execution, -O2 -fnext- runtime
FAIL: objc/execute/exceptions/trivial.m compilation, -O3 -fomit- frame-pointer -fnext-runtime
UNRESOLVED: objc/execute/exceptions/trivial.m execution, -O3 -fomit- frame-pointer -fnext-runtime
FAIL: objc/execute/exceptions/trivial.m compilation, -O3 -g -fnext- runtime
UNRESOLVED: objc/execute/exceptions/trivial.m execution, -O3 -g - fnext-runtime
FAIL: objc/execute/exceptions/trivial.m compilation, -Os -fnext-runtime
UNRESOLVED: objc/execute/exceptions/trivial.m execution, -Os -fnext- runtime
FAIL: objc/execute/IMP.m compilation, -O0 -fnext-runtime
UNRESOLVED: objc/execute/IMP.m execution, -O0 -fnext-runtime
FAIL: objc/execute/IMP.m compilation, -O1 -fnext-runtime
UNRESOLVED: objc/execute/IMP.m execution, -O1 -fnext-runtime
FAIL: objc/execute/IMP.m compilation, -O2 -fnext-runtime
UNRESOLVED: objc/execute/IMP.m execution, -O2 -fnext-runtime
FAIL: objc/execute/IMP.m compilation, -O3 -fomit-frame-pointer - fnext-runtime
UNRESOLVED: objc/execute/IMP.m execution, -O3 -fomit-frame-pointer - fnext-runtime
FAIL: objc/execute/IMP.m compilation, -O3 -g -fnext-runtime
UNRESOLVED: objc/execute/IMP.m execution, -O3 -g -fnext-runtime
FAIL: objc/execute/IMP.m compilation, -Os -fnext-runtime
UNRESOLVED: objc/execute/IMP.m execution, -Os -fnext-runtime
FAIL: objc/execute/_cmd.m compilation, -O0 -fnext-runtime
UNRESOLVED: objc/execute/_cmd.m execution, -O0 -fnext-runtime
FAIL: objc/execute/_cmd.m compilation, -O1 -fnext-runtime
UNRESOLVED: objc/execute/_cmd.m execution, -O1 -fnext-runtime
FAIL: objc/execute/_cmd.m compilation, -O2 -fnext-runtime
UNRESOLVED: objc/execute/_cmd.m execution, -O2 -fnext-runtime
FAIL: objc/execute/_cmd.m compilation, -O3 -fomit-frame-pointer - fnext-runtime
UNRESOLVED: objc/execute/_cmd.m execution, -O3 -fomit-frame-pointer - fnext-runtime
FAIL: objc/execute/_cmd.m compilation, -O3 -g -fnext-runtime
UNRESOLVED: objc/execute/_cmd.m execution, -O3 -g -fnext-runtime
FAIL: objc/execute/_cmd.m compilation, -Os -fnext-runtime
UNRESOLVED: objc/execute/_cmd.m execution, -Os -fnext-runtime
FAIL: objc/execute/accessing_ivars.m compilation, -O0 -fnext-runtime
UNRESOLVED: objc/execute/accessing_ivars.m execution, -O0 -fnext- runtime
FAIL: objc/execute/accessing_ivars.m compilation, -O1 -fnext-runtime
UNRESOLVED: objc/execute/accessing_ivars.m execution, -O1 -fnext- runtime
FAIL: objc/execute/accessing_ivars.m compilation, -O2 -fnext-runtime
UNRESOLVED: objc/execute/accessing_ivars.m execution, -O2 -fnext- runtime
FAIL: objc/execute/accessing_ivars.m compilation, -O3 -fomit-frame- pointer -fnext-runtime
UNRESOLVED: objc/execute/accessing_ivars.m execution, -O3 -fomit- frame-pointer -fnext-runtime
FAIL: objc/execute/accessing_ivars.m compilation, -O3 -g -fnext-runtime
UNRESOLVED: objc/execute/accessing_ivars.m execution, -O3 -g -fnext- runtime
FAIL: objc/execute/accessing_ivars.m compilation, -Os -fnext-runtime
UNRESOLVED: objc/execute/accessing_ivars.m execution, -Os -fnext- runtime
FAIL: objc/execute/bf-1.m compilation, -O0 -fnext-runtime
UNRESOLVED: objc/execute/bf-1.m execution, -O0 -fnext-runtime
FAIL: objc/execute/bf-1.m compilation, -O1 -fnext-runtime
UNRESOLVED: objc/execute/bf-1.m execution, -O1 -fnext-runtime
FAIL: objc/execute/bf-1.m compilation, -O2 -fnext-runtime
UNRESOLVED: objc/execute/bf-1.m execution, -O2 -fnext-runtime
FAIL: objc/execute/bf-1.m compilation, -O3 -fomit-frame-pointer - fnext-runtime
UNRESOLVED: objc/execute/bf-1.m execution, -O3 -fomit-frame-pointer - fnext-runtime
FAIL: objc/execute/bf-1.m compilation, -O3 -g -fnext-runtime
UNRESOLVED: objc/execute/bf-1.m execution, -O3 -g -fnext-runtime
FAIL: objc/execute/bf-1.m compilation, -Os -fnext-runtime
UNRESOLVED: objc/execute/bf-1.m execution, -Os -fnext-runtime
FAIL: objc/execute/bf-10.m compilation, -O0 -fnext-runtime
UNRESOLVED: objc/execute/bf-10.m execution, -O0 -fnext-runtime
FAIL: objc/execute/bf-10.m compilation, -O1 -fnext-runtime
UNRESOLVED: objc/execute/bf-10.m execution, -O1 -fnext-runtime
FAIL: objc/execute/bf-10.m compilation, -O2 -fnext-runtime
UNRESOLVED: objc/execute/bf-10.m execution, -O2 -fnext-runtime
FAIL: objc/execute/bf-10.m compilation, -O3 -fomit-frame-pointer - fnext-runtime
UNRESOLVED: objc/execute/bf-10.m execution, -O3 -fomit-frame-pointer -fnext-runtime
FAIL: objc/execute/bf-10.m compilation, -O3 -g -fnext-runtime
UNRESOLVED: objc/execute/bf-10.m execution, -O3 -g -fnext-runtime
FAIL: objc/execute/bf-10.m compilation, -Os -fnext-runtime
UNRESOLVED: objc/execute/bf-10.m execution, -Os -fnext-runtime
FAIL: objc/execute/bf-11.m compilation, -O0 -fnext-runtime
UNRESOLVED: objc/execute/bf-11.m execution, -O0 -fnext-runtime
FAIL: objc/execute/bf-11.m compilation, -O1 -fnext-runtime
UNRESOLVED: objc/execute/bf-11.m execution, -O1 -fnext-runtime
FAIL: objc/execute/bf-11.m compilation, -O2 -fnext-runtime
UNRESOLVED: objc/execute/bf-11.m execution, -O2 -fnext-runtime
FAIL: objc/execute/bf-11.m compilation, -O3 -fomit-frame-pointer - fnext-runtime
UNRESOLVED: objc/execute/bf-11.m execution, -O3 -fomit-frame-pointer -fnext-runtime
FAIL: objc/execute/bf-11.m compilation, -O3 -g -fnext-runtime
UNRESOLVED: objc/execute/bf-11.m execution, -O3 -g -fnext-runtime
FAIL: objc/execute/bf-11.m compilation, -Os -fnext-runtime
UNRESOLVED: objc/execute/bf-11.m execution, -Os -fnext-runtime
FAIL: objc/execute/bf-12.m compilation, -O0 -fnext-runtime
UNRESOLVED: objc/execute/bf-12.m execution, -O0 -fnext-runtime
FAIL: objc/execute/bf-12.m compilation, -O1 -fnext-runtime
UNRESOLVED: objc/execute/bf-12.m execution, -O1 -fnext-runtime
FAIL: objc/execute/bf-12.m compilation, -O2 -fnext-runtime
UNRESOLVED: objc/execute/bf-12.m execution, -O2 -fnext-runtime
FAIL: objc/execute/bf-12.m compilation, -O3 -fomit-frame-pointer - fnext-runtime
UNRESOLVED: objc/execute/bf-12.m execution, -O3 -fomit-frame-pointer -fnext-runtime
FAIL: objc/execute/bf-12.m compilation, -O3 -g -fnext-runtime
UNRESOLVED: objc/execute/bf-12.m execution, -O3 -g -fnext-runtime
FAIL: objc/execute/bf-12.m compilation, -Os -fnext-runtime
UNRESOLVED: objc/execute/bf-12.m execution, -Os -fnext-runtime
FAIL: objc/execute/bf-13.m compilation, -O0 -fnext-runtime
UNRESOLVED: objc/execute/bf-13.m execution, -O0 -fnext-runtime
FAIL: objc/execute/bf-13.m compilation, -O1 -fnext-runtime
UNRESOLVED: objc/execute/bf-13.m execution, -O1 -fnext-runtime
FAIL: objc/execute/bf-13.m compilation, -O2 -fnext-runtime
UNRESOLVED: objc/execute/bf-13.m execution, -O2 -fnext-runtime
FAIL: objc/execute/bf-13.m compilation, -O3 -fomit-frame-pointer - fnext-runtime
UNRESOLVED: objc/execute/bf-13.m execution, -O3 -fomit-frame-pointer -fnext-runtime
FAIL: objc/execute/bf-13.m compilation, -O3 -g -fnext-runtime
UNRESOLVED: objc/execute/bf-13.m execution, -O3 -g -fnext-runtime
FAIL: objc/execute/bf-13.m compilation, -Os -fnext-runtime
UNRESOLVED: objc/execute/bf-13.m execution, -Os -fnext-runtime
FAIL: objc/execute/bf-14.m compilation, -O0 -fnext-runtime
UNRESOLVED: objc/execute/bf-14.m execution, -O0 -fnext-runtime
FAIL: objc/execute/bf-14.m compilation, -O1 -fnext-runtime
UNRESOLVED: objc/execute/bf-14.m execution, -O1 -fnext-runtime
FAIL: objc/execute/bf-14.m compilation, -O2 -fnext-runtime
UNRESOLVED: objc/execute/bf-14.m execution, -O2 -fnext-runtime
FAIL: objc/execute/bf-14.m compilation, -O3 -fomit-frame-pointer - fnext-runtime
UNRESOLVED: objc/execute/bf-14.m execution, -O3 -fomit-frame-pointer -fnext-runtime
FAIL: objc/execute/bf-14.m compilation, -O3 -g -fnext-runtime
UNRESOLVED: objc/execute/bf-14.m execution, -O3 -g -fnext-runtime
FAIL: objc/execute/bf-14.m compilation, -Os -fnext-runtime
UNRESOLVED: objc/execute/bf-14.m execution, -Os -fnext-runtime
FAIL: objc/execute/bf-15.m compilation, -O0 -fnext-runtime
UNRESOLVED: objc/execute/bf-15.m execution, -O0 -fnext-runtime
FAIL: objc/execute/bf-15.m compilation, -O1 -fnext-runtime
UNRESOLVED: objc/execute/bf-15.m execution, -O1 -fnext-runtime
FAIL: objc/execute/bf-15.m compilation, -O2 -fnext-runtime
UNRESOLVED: objc/execute/bf-15.m execution, -O2 -fnext-runtime
FAIL: objc/execute/bf-15.m compilation, -O3 -fomit-frame-pointer - fnext-runtime
UNRESOLVED: objc/execute/bf-15.m execution, -O3 -fomit-frame-pointer -fnext-runtime
FAIL: objc/execute/bf-15.m compilation, -O3 -g -fnext-runtime
UNRESOLVED: objc/execute/bf-15.m execution, -O3 -g -fnext-runtime
FAIL: objc/execute/bf-15.m compilation, -Os -fnext-runtime
UNRESOLVED: objc/execute/bf-15.m execution, -Os -fnext-runtime
FAIL: objc/execute/bf-16.m compilation, -O0 -fnext-runtime
UNRESOLVED: objc/execute/bf-16.m execution, -O0 -fnext-runtime
FAIL: objc/execute/bf-16.m compilation, -O1 -fnext-runtime
UNRESOLVED: objc/execute/bf-16.m execution, -O1 -fnext-runtime
FAIL: objc/execute/bf-16.m compilation, -O2 -fnext-runtime
UNRESOLVED: objc/execute/bf-16.m execution, -O2 -fnext-runtime
FAIL: objc/execute/bf-16.m compilation, -O3 -fomit-frame-pointer - fnext-runtime
UNRESOLVED: objc/execute/bf-16.m execution, -O3 -fomit-frame-pointer -fnext-runtime
FAIL: objc/execute/bf-16.m compilation, -O3 -g -fnext-runtime
UNRESOLVED: objc/execute/bf-16.m execution, -O3 -g -fnext-runtime
FAIL: objc/execute/bf-16.m compilation, -Os -fnext-runtime
UNRESOLVED: objc/execute/bf-16.m execution, -Os -fnext-runtime
FAIL: objc/execute/bf-17.m compilation, -O0 -fnext-runtime
UNRESOLVED: objc/execute/bf-17.m execution, -O0 -fnext-runtime
FAIL: objc/execute/bf-17.m compilation, -O1 -fnext-runtime
UNRESOLVED: objc/execute/bf-17.m execution, -O1 -fnext-runtime
FAIL: objc/execute/bf-17.m compilation, -O2 -fnext-runtime
UNRESOLVED: objc/execute/bf-17.m execution, -O2 -fnext-runtime
FAIL: objc/execute/bf-17.m compilation, -O3 -fomit-frame-pointer - fnext-runtime
UNRESOLVED: objc/execute/bf-17.m execution, -O3 -fomit-frame-pointer -fnext-runtime
FAIL: objc/execute/bf-17.m compilation, -O3 -g -fnext-runtime
UNRESOLVED: objc/execute/bf-17.m execution, -O3 -g -fnext-runtime
FAIL: objc/execute/bf-17.m compilation, -Os -fnext-runtime
UNRESOLVED: objc/execute/bf-17.m execution, -Os -fnext-runtime
FAIL: objc/execute/bf-18.m compilation, -O0 -fnext-runtime
UNRESOLVED: objc/execute/bf-18.m execution, -O0 -fnext-runtime
FAIL: objc/execute/bf-18.m compilation, -O1 -fnext-runtime
UNRESOLVED: objc/execute/bf-18.m execution, -O1 -fnext-runtime
FAIL: objc/execute/bf-18.m compilation, -O2 -fnext-runtime
UNRESOLVED: objc/execute/bf-18.m execution, -O2 -fnext-runtime
FAIL: objc/execute/bf-18.m compilation, -O3 -fomit-frame-pointer - fnext-runtime
UNRESOLVED: objc/execute/bf-18.m execution, -O3 -fomit-frame-pointer -fnext-runtime
FAIL: objc/execute/bf-18.m compilation, -O3 -g -fnext-runtime
UNRESOLVED: objc/execute/bf-18.m execution, -O3 -g -fnext-runtime
FAIL: objc/execute/bf-18.m compilation, -Os -fnext-runtime
UNRESOLVED: objc/execute/bf-18.m execution, -Os -fnext-runtime
FAIL: objc/execute/bf-19.m compilation, -O0 -fnext-runtime
UNRESOLVED: objc/execute/bf-19.m execution, -O0 -fnext-runtime
FAIL: objc/execute/bf-19.m compilation, -O1 -fnext-runtime
UNRESOLVED: objc/execute/bf-19.m execution, -O1 -fnext-runtime
FAIL: objc/execute/bf-19.m compilation, -O2 -fnext-runtime
UNRESOLVED: objc/execute/bf-19.m execution, -O2 -fnext-runtime
FAIL: objc/execute/bf-19.m compilation, -O3 -fomit-frame-pointer - fnext-runtime
UNRESOLVED: objc/execute/bf-19.m execution, -O3 -fomit-frame-pointer -fnext-runtime
FAIL: objc/execute/bf-19.m compilation, -O3 -g -fnext-runtime
UNRESOLVED: objc/execute/bf-19.m execution, -O3 -g -fnext-runtime
FAIL: objc/execute/bf-19.m compilation, -Os -fnext-runtime
UNRESOLVED: objc/execute/bf-19.m execution, -Os -fnext-runtime
FAIL: objc/execute/bf-2.m compilation, -O0 -fnext-runtime
UNRESOLVED: objc/execute/bf-2.m execution, -O0 -fnext-runtime
FAIL: objc/execute/bf-2.m compilation, -O1 -fnext-runtime
UNRESOLVED: objc/execute/bf-2.m execution, -O1 -fnext-runtime
FAIL: objc/execute/bf-2.m compilation, -O2 -fnext-runtime
UNRESOLVED: objc/execute/bf-2.m execution, -O2 -fnext-runtime
FAIL: objc/execute/bf-2.m compilation, -O3 -fomit-frame-pointer - fnext-runtime
UNRESOLVED: objc/execute/bf-2.m execution, -O3 -fomit-frame-pointer - fnext-runtime
FAIL: objc/execute/bf-2.m compilation, -O3 -g -fnext-runtime
UNRESOLVED: objc/execute/bf-2.m execution, -O3 -g -fnext-runtime
FAIL: objc/execute/bf-2.m compilation, -Os -fnext-runtime
UNRESOLVED: objc/execute/bf-2.m execution, -Os -fnext-runtime
FAIL: objc/execute/bf-20.m compilation, -O0 -fnext-runtime
UNRESOLVED: objc/execute/bf-20.m execution, -O0 -fnext-runtime
FAIL: objc/execute/bf-20.m compilation, -O1 -fnext-runtime
UNRESOLVED: objc/execute/bf-20.m execution, -O1 -fnext-runtime
FAIL: objc/execute/bf-20.m compilation, -O2 -fnext-runtime
UNRESOLVED: objc/execute/bf-20.m execution, -O2 -fnext-runtime
FAIL: objc/execute/bf-20.m compilation, -O3 -fomit-frame-pointer - fnext-runtime
UNRESOLVED: objc/execute/bf-20.m execution, -O3 -fomit-frame-pointer -fnext-runtime
FAIL: objc/execute/bf-20.m compilation, -O3 -g -fnext-runtime
UNRESOLVED: objc/execute/bf-20.m execution, -O3 -g -fnext-runtime
FAIL: objc/execute/bf-20.m compilation, -Os -fnext-runtime
UNRESOLVED: objc/execute/bf-20.m execution, -Os -fnext-runtime
FAIL: objc/execute/bf-21.m compilation, -O0 -fnext-runtime
UNRESOLVED: objc/execute/bf-21.m execution, -O0 -fnext-runtime
FAIL: objc/execute/bf-21.m compilation, -O1 -fnext-runtime
UNRESOLVED: objc/execute/bf-21.m execution, -O1 -fnext-runtime
FAIL: objc/execute/bf-21.m compilation, -O2 -fnext-runtime
UNRESOLVED: objc/execute/bf-21.m execution, -O2 -fnext-runtime
FAIL: objc/execute/bf-21.m compilation, -O3 -fomit-frame-pointer - fnext-runtime
UNRESOLVED: objc/execute/bf-21.m execution, -O3 -fomit-frame-pointer -fnext-runtime
FAIL: objc/execute/bf-21.m compilation, -O3 -g -fnext-runtime
UNRESOLVED: objc/execute/bf-21.m execution, -O3 -g -fnext-runtime
FAIL: objc/execute/bf-21.m compilation, -Os -fnext-runtime
UNRESOLVED: objc/execute/bf-21.m execution, -Os -fnext-runtime
FAIL: objc/execute/bf-3.m compilation, -O0 -fnext-runtime
UNRESOLVED: objc/execute/bf-3.m execution, -O0 -fnext-runtime
FAIL: objc/execute/bf-3.m compilation, -O1 -fnext-runtime
UNRESOLVED: objc/execute/bf-3.m execution, -O1 -fnext-runtime
FAIL: objc/execute/bf-3.m compilation, -O2 -fnext-runtime
UNRESOLVED: objc/execute/bf-3.m execution, -O2 -fnext-runtime
FAIL: objc/execute/bf-3.m compilation, -O3 -fomit-frame-pointer - fnext-runtime
UNRESOLVED: objc/execute/bf-3.m execution, -O3 -fomit-frame-pointer - fnext-runtime
FAIL: objc/execute/bf-3.m compilation, -O3 -g -fnext-runtime
UNRESOLVED: objc/execute/bf-3.m execution, -O3 -g -fnext-runtime
FAIL: objc/execute/bf-3.m compilation, -Os -fnext-runtime
UNRESOLVED: objc/execute/bf-3.m execution, -Os -fnext-runtime
FAIL: objc/execute/bf-4.m compilation, -O0 -fnext-runtime
UNRESOLVED: objc/execute/bf-4.m execution, -O0 -fnext-runtime
FAIL: objc/execute/bf-4.m compilation, -O1 -fnext-runtime
UNRESOLVED: objc/execute/bf-4.m execution, -O1 -fnext-runtime
FAIL: objc/execute/bf-4.m compilation, -O2 -fnext-runtime
UNRESOLVED: objc/execute/bf-4.m execution, -O2 -fnext-runtime
FAIL: objc/execute/bf-4.m compilation, -O3 -fomit-frame-pointer - fnext-runtime
UNRESOLVED: objc/execute/bf-4.m execution, -O3 -fomit-frame-pointer - fnext-runtime
FAIL: objc/execute/bf-4.m compilation, -O3 -g -fnext-runtime
UNRESOLVED: objc/execute/bf-4.m execution, -O3 -g -fnext-runtime
FAIL: objc/execute/bf-4.m compilation, -Os -fnext-runtime
UNRESOLVED: objc/execute/bf-4.m execution, -Os -fnext-runtime
FAIL: objc/execute/bf-5.m compilation, -O0 -fnext-runtime
UNRESOLVED: objc/execute/bf-5.m execution, -O0 -fnext-runtime
FAIL: objc/execute/bf-5.m compilation, -O1 -fnext-runtime
UNRESOLVED: objc/execute/bf-5.m execution, -O1 -fnext-runtime
FAIL: objc/execute/bf-5.m compilation, -O2 -fnext-runtime
UNRESOLVED: objc/execute/bf-5.m execution, -O2 -fnext-runtime
FAIL: objc/execute/bf-5.m compilation, -O3 -fomit-frame-pointer - fnext-runtime
UNRESOLVED: objc/execute/bf-5.m execution, -O3 -fomit-frame-pointer - fnext-runtime
FAIL: objc/execute/bf-5.m compilation, -O3 -g -fnext-runtime
UNRESOLVED: objc/execute/bf-5.m execution, -O3 -g -fnext-runtime
FAIL: objc/execute/bf-5.m compilation, -Os -fnext-runtime
UNRESOLVED: objc/execute/bf-5.m execution, -Os -fnext-runtime
FAIL: objc/execute/bf-6.m compilation, -O0 -fnext-runtime
UNRESOLVED: objc/execute/bf-6.m execution, -O0 -fnext-runtime
FAIL: objc/execute/bf-6.m compilation, -O1 -fnext-runtime
UNRESOLVED: objc/execute/bf-6.m execution, -O1 -fnext-runtime
FAIL: objc/execute/bf-6.m compilation, -O2 -fnext-runtime
UNRESOLVED: objc/execute/bf-6.m execution, -O2 -fnext-runtime
FAIL: objc/execute/bf-6.m compilation, -O3 -fomit-frame-pointer - fnext-runtime
UNRESOLVED: objc/execute/bf-6.m execution, -O3 -fomit-frame-pointer - fnext-runtime
FAIL: objc/execute/bf-6.m compilation, -O3 -g -fnext-runtime
UNRESOLVED: objc/execute/bf-6.m execution, -O3 -g -fnext-runtime
FAIL: objc/execute/bf-6.m compilation, -Os -fnext-runtime
UNRESOLVED: objc/execute/bf-6.m execution, -Os -fnext-runtime
FAIL: objc/execute/bf-7.m compilation, -O0 -fnext-runtime
UNRESOLVED: objc/execute/bf-7.m execution, -O0 -fnext-runtime
FAIL: objc/execute/bf-7.m compilation, -O1 -fnext-runtime
UNRESOLVED: objc/execute/bf-7.m execution, -O1 -fnext-runtime
FAIL: objc/execute/bf-7.m compilation, -O2 -fnext-runtime
UNRESOLVED: objc/execute/bf-7.m execution, -O2 -fnext-runtime
FAIL: objc/execute/bf-7.m compilation, -O3 -fomit-frame-pointer - fnext-runtime
UNRESOLVED: objc/execute/bf-7.m execution, -O3 -fomit-frame-pointer - fnext-runtime
FAIL: objc/execute/bf-7.m compilation, -O3 -g -fnext-runtime
UNRESOLVED: objc/execute/bf-7.m execution, -O3 -g -fnext-runtime
FAIL: objc/execute/bf-7.m compilation, -Os -fnext-runtime
UNRESOLVED: objc/execute/bf-7.m execution, -Os -fnext-runtime
FAIL: objc/execute/bf-8.m compilation, -O0 -fnext-runtime
UNRESOLVED: objc/execute/bf-8.m execution, -O0 -fnext-runtime
FAIL: objc/execute/bf-8.m compilation, -O1 -fnext-runtime
UNRESOLVED: objc/execute/bf-8.m execution, -O1 -fnext-runtime
FAIL: objc/execute/bf-8.m compilation, -O2 -fnext-runtime
UNRESOLVED: objc/execute/bf-8.m execution, -O2 -fnext-runtime
FAIL: objc/execute/bf-8.m compilation, -O3 -fomit-frame-pointer - fnext-runtime
UNRESOLVED: objc/execute/bf-8.m execution, -O3 -fomit-frame-pointer - fnext-runtime
FAIL: objc/execute/bf-8.m compilation, -O3 -g -fnext-runtime
UNRESOLVED: objc/execute/bf-8.m execution, -O3 -g -fnext-runtime
FAIL: objc/execute/bf-8.m compilation, -Os -fnext-runtime
UNRESOLVED: objc/execute/bf-8.m execution, -Os -fnext-runtime
FAIL: objc/execute/bf-9.m compilation, -O0 -fnext-runtime
UNRESOLVED: objc/execute/bf-9.m execution, -O0 -fnext-runtime
FAIL: objc/execute/bf-9.m compilation, -O1 -fnext-runtime
UNRESOLVED: objc/execute/bf-9.m execution, -O1 -fnext-runtime
FAIL: objc/execute/bf-9.m compilation, -O2 -fnext-runtime
UNRESOLVED: objc/execute/bf-9.m execution, -O2 -fnext-runtime
FAIL: objc/execute/bf-9.m compilation, -O3 -fomit-frame-pointer - fnext-runtime
UNRESOLVED: objc/execute/bf-9.m execution, -O3 -fomit-frame-pointer - fnext-runtime
FAIL: objc/execute/bf-9.m compilation, -O3 -g -fnext-runtime
UNRESOLVED: objc/execute/bf-9.m execution, -O3 -g -fnext-runtime
FAIL: objc/execute/bf-9.m compilation, -Os -fnext-runtime
UNRESOLVED: objc/execute/bf-9.m execution, -Os -fnext-runtime
FAIL: objc/execute/bycopy-1.m compilation, -O0 -fnext-runtime
UNRESOLVED: objc/execute/bycopy-1.m execution, -O0 -fnext-runtime
FAIL: objc/execute/bycopy-1.m compilation, -O1 -fnext-runtime
UNRESOLVED: objc/execute/bycopy-1.m execution, -O1 -fnext-runtime
FAIL: objc/execute/bycopy-1.m compilation, -O2 -fnext-runtime
UNRESOLVED: objc/execute/bycopy-1.m execution, -O2 -fnext-runtime
FAIL: objc/execute/bycopy-1.m compilation, -O3 -fomit-frame-pointer - fnext-runtime
UNRESOLVED: objc/execute/bycopy-1.m execution, -O3 -fomit-frame- pointer -fnext-runtime
FAIL: objc/execute/bycopy-1.m compilation, -O3 -g -fnext-runtime
UNRESOLVED: objc/execute/bycopy-1.m execution, -O3 -g -fnext-runtime
FAIL: objc/execute/bycopy-1.m compilation, -Os -fnext-runtime
UNRESOLVED: objc/execute/bycopy-1.m execution, -Os -fnext-runtime
FAIL: objc/execute/bycopy-2.m compilation, -O0 -fnext-runtime
UNRESOLVED: objc/execute/bycopy-2.m execution, -O0 -fnext-runtime
FAIL: objc/execute/bycopy-2.m compilation, -O1 -fnext-runtime
UNRESOLVED: objc/execute/bycopy-2.m execution, -O1 -fnext-runtime
FAIL: objc/execute/bycopy-2.m compilation, -O2 -fnext-runtime
UNRESOLVED: objc/execute/bycopy-2.m execution, -O2 -fnext-runtime
FAIL: objc/execute/bycopy-2.m compilation, -O3 -fomit-frame-pointer - fnext-runtime
UNRESOLVED: objc/execute/bycopy-2.m execution, -O3 -fomit-frame- pointer -fnext-runtime
FAIL: objc/execute/bycopy-2.m compilation, -O3 -g -fnext-runtime
UNRESOLVED: objc/execute/bycopy-2.m execution, -O3 -g -fnext-runtime
FAIL: objc/execute/bycopy-2.m compilation, -Os -fnext-runtime
UNRESOLVED: objc/execute/bycopy-2.m execution, -Os -fnext-runtime
FAIL: objc/execute/bycopy-3.m compilation, -O0 -fnext-runtime
UNRESOLVED: objc/execute/bycopy-3.m execution, -O0 -fnext-runtime
FAIL: objc/execute/bycopy-3.m compilation, -O1 -fnext-runtime
UNRESOLVED: objc/execute/bycopy-3.m execution, -O1 -fnext-runtime
FAIL: objc/execute/bycopy-3.m compilation, -O2 -fnext-runtime
UNRESOLVED: objc/execute/bycopy-3.m execution, -O2 -fnext-runtime
FAIL: objc/execute/bycopy-3.m compilation, -O3 -fomit-frame-pointer - fnext-runtime
UNRESOLVED: objc/execute/bycopy-3.m execution, -O3 -fomit-frame- pointer -fnext-runtime
FAIL: objc/execute/bycopy-3.m compilation, -O3 -g -fnext-runtime
UNRESOLVED: objc/execute/bycopy-3.m execution, -O3 -g -fnext-runtime
FAIL: objc/execute/bycopy-3.m compilation, -Os -fnext-runtime
UNRESOLVED: objc/execute/bycopy-3.m execution, -Os -fnext-runtime
FAIL: objc/execute/cascading-1.m compilation, -O0 -fnext-runtime
UNRESOLVED: objc/execute/cascading-1.m execution, -O0 -fnext-runtime
FAIL: objc/execute/cascading-1.m compilation, -O1 -fnext-runtime
UNRESOLVED: objc/execute/cascading-1.m execution, -O1 -fnext-runtime
FAIL: objc/execute/cascading-1.m compilation, -O2 -fnext-runtime
UNRESOLVED: objc/execute/cascading-1.m execution, -O2 -fnext-runtime
FAIL: objc/execute/cascading-1.m compilation, -O3 -fomit-frame- pointer -fnext-runtime
UNRESOLVED: objc/execute/cascading-1.m execution, -O3 -fomit-frame- pointer -fnext-runtime
FAIL: objc/execute/cascading-1.m compilation, -O3 -g -fnext-runtime
UNRESOLVED: objc/execute/cascading-1.m execution, -O3 -g -fnext-runtime
FAIL: objc/execute/cascading-1.m compilation, -Os -fnext-runtime
UNRESOLVED: objc/execute/cascading-1.m execution, -Os -fnext-runtime
FAIL: objc/execute/class-1.m compilation, -O0 -fnext-runtime
UNRESOLVED: objc/execute/class-1.m execution, -O0 -fnext-runtime
FAIL: objc/execute/class-1.m compilation, -O1 -fnext-runtime
UNRESOLVED: objc/execute/class-1.m execution, -O1 -fnext-runtime
FAIL: objc/execute/class-1.m compilation, -O2 -fnext-runtime
UNRESOLVED: objc/execute/class-1.m execution, -O2 -fnext-runtime
FAIL: objc/execute/class-1.m compilation, -O3 -fomit-frame-pointer - fnext-runtime
UNRESOLVED: objc/execute/class-1.m execution, -O3 -fomit-frame- pointer -fnext-runtime
FAIL: objc/execute/class-1.m compilation, -O3 -g -fnext-runtime
UNRESOLVED: objc/execute/class-1.m execution, -O3 -g -fnext-runtime
FAIL: objc/execute/class-1.m compilation, -Os -fnext-runtime
UNRESOLVED: objc/execute/class-1.m execution, -Os -fnext-runtime
FAIL: objc/execute/class-10.m compilation, -O0 -fnext-runtime
UNRESOLVED: objc/execute/class-10.m execution, -O0 -fnext-runtime
FAIL: objc/execute/class-10.m compilation, -O1 -fnext-runtime
UNRESOLVED: objc/execute/class-10.m execution, -O1 -fnext-runtime
FAIL: objc/execute/class-10.m compilation, -O2 -fnext-runtime
UNRESOLVED: objc/execute/class-10.m execution, -O2 -fnext-runtime
FAIL: objc/execute/class-10.m compilation, -O3 -fomit-frame-pointer - fnext-runtime
UNRESOLVED: objc/execute/class-10.m execution, -O3 -fomit-frame- pointer -fnext-runtime
FAIL: objc/execute/class-10.m compilation, -O3 -g -fnext-runtime
UNRESOLVED: objc/execute/class-10.m execution, -O3 -g -fnext-runtime
FAIL: objc/execute/class-10.m compilation, -Os -fnext-runtime
UNRESOLVED: objc/execute/class-10.m execution, -Os -fnext-runtime
FAIL: objc/execute/class-11.m compilation, -O0 -fnext-runtime
UNRESOLVED: objc/execute/class-11.m execution, -O0 -fnext-runtime
FAIL: objc/execute/class-11.m compilation, -O1 -fnext-runtime
UNRESOLVED: objc/execute/class-11.m execution, -O1 -fnext-runtime
FAIL: objc/execute/class-11.m compilation, -O2 -fnext-runtime
UNRESOLVED: objc/execute/class-11.m execution, -O2 -fnext-runtime
FAIL: objc/execute/class-11.m compilation, -O3 -fomit-frame-pointer - fnext-runtime
UNRESOLVED: objc/execute/class-11.m execution, -O3 -fomit-frame- pointer -fnext-runtime
FAIL: objc/execute/class-11.m compilation, -O3 -g -fnext-runtime
UNRESOLVED: objc/execute/class-11.m execution, -O3 -g -fnext-runtime
FAIL: objc/execute/class-11.m compilation, -Os -fnext-runtime
UNRESOLVED: objc/execute/class-11.m execution, -Os -fnext-runtime
FAIL: objc/execute/class-12.m compilation, -O0 -fnext-runtime
UNRESOLVED: objc/execute/class-12.m execution, -O0 -fnext-runtime
FAIL: objc/execute/class-12.m compilation, -O1 -fnext-runtime
UNRESOLVED: objc/execute/class-12.m execution, -O1 -fnext-runtime
FAIL: objc/execute/class-12.m compilation, -O2 -fnext-runtime
UNRESOLVED: objc/execute/class-12.m execution, -O2 -fnext-runtime
FAIL: objc/execute/class-12.m compilation, -O3 -fomit-frame-pointer - fnext-runtime
UNRESOLVED: objc/execute/class-12.m execution, -O3 -fomit-frame- pointer -fnext-runtime
FAIL: objc/execute/class-12.m compilation, -O3 -g -fnext-runtime
UNRESOLVED: objc/execute/class-12.m execution, -O3 -g -fnext-runtime
FAIL: objc/execute/class-12.m compilation, -Os -fnext-runtime
UNRESOLVED: objc/execute/class-12.m execution, -Os -fnext-runtime
FAIL: objc/execute/class-13.m compilation, -O0 -fnext-runtime
UNRESOLVED: objc/execute/class-13.m execution, -O0 -fnext-runtime
FAIL: objc/execute/class-13.m compilation, -O1 -fnext-runtime
UNRESOLVED: objc/execute/class-13.m execution, -O1 -fnext-runtime
FAIL: objc/execute/class-13.m compilation, -O2 -fnext-runtime
UNRESOLVED: objc/execute/class-13.m execution, -O2 -fnext-runtime
FAIL: objc/execute/class-13.m compilation, -O3 -fomit-frame-pointer - fnext-runtime
UNRESOLVED: objc/execute/class-13.m execution, -O3 -fomit-frame- pointer -fnext-runtime
FAIL: objc/execute/class-13.m compilation, -O3 -g -fnext-runtime
UNRESOLVED: objc/execute/class-13.m execution, -O3 -g -fnext-runtime
FAIL: objc/execute/class-13.m compilation, -Os -fnext-runtime
UNRESOLVED: objc/execute/class-13.m execution, -Os -fnext-runtime
FAIL: objc/execute/class-14.m compilation, -O0 -fnext-runtime
UNRESOLVED: objc/execute/class-14.m execution, -O0 -fnext-runtime
FAIL: objc/execute/class-14.m compilation, -O1 -fnext-runtime
UNRESOLVED: objc/execute/class-14.m execution, -O1 -fnext-runtime
FAIL: objc/execute/class-14.m compilation, -O2 -fnext-runtime
UNRESOLVED: objc/execute/class-14.m execution, -O2 -fnext-runtime
FAIL: objc/execute/class-14.m compilation, -O3 -fomit-frame-pointer - fnext-runtime
UNRESOLVED: objc/execute/class-14.m execution, -O3 -fomit-frame- pointer -fnext-runtime
FAIL: objc/execute/class-14.m compilation, -O3 -g -fnext-runtime
UNRESOLVED: objc/execute/class-14.m execution, -O3 -g -fnext-runtime
FAIL: objc/execute/class-14.m compilation, -Os -fnext-runtime
UNRESOLVED: objc/execute/class-14.m execution, -Os -fnext-runtime
FAIL: objc/execute/class-2.m compilation, -O0 -fnext-runtime
UNRESOLVED: objc/execute/class-2.m execution, -O0 -fnext-runtime
FAIL: objc/execute/class-2.m compilation, -O1 -fnext-runtime
UNRESOLVED: objc/execute/class-2.m execution, -O1 -fnext-runtime
FAIL: objc/execute/class-2.m compilation, -O2 -fnext-runtime
UNRESOLVED: objc/execute/class-2.m execution, -O2 -fnext-runtime
FAIL: objc/execute/class-2.m compilation, -O3 -fomit-frame-pointer - fnext-runtime
UNRESOLVED: objc/execute/class-2.m execution, -O3 -fomit-frame- pointer -fnext-runtime
FAIL: objc/execute/class-2.m compilation, -O3 -g -fnext-runtime
UNRESOLVED: objc/execute/class-2.m execution, -O3 -g -fnext-runtime
FAIL: objc/execute/class-2.m compilation, -Os -fnext-runtime
UNRESOLVED: objc/execute/class-2.m execution, -Os -fnext-runtime
FAIL: objc/execute/class-3.m compilation, -O0 -fnext-runtime
UNRESOLVED: objc/execute/class-3.m execution, -O0 -fnext-runtime
FAIL: objc/execute/class-3.m compilation, -O1 -fnext-runtime
UNRESOLVED: objc/execute/class-3.m execution, -O1 -fnext-runtime
FAIL: objc/execute/class-3.m compilation, -O2 -fnext-runtime
UNRESOLVED: objc/execute/class-3.m execution, -O2 -fnext-runtime
FAIL: objc/execute/class-3.m compilation, -O3 -fomit-frame-pointer - fnext-runtime
UNRESOLVED: objc/execute/class-3.m execution, -O3 -fomit-frame- pointer -fnext-runtime
FAIL: objc/execute/class-3.m compilation, -O3 -g -fnext-runtime
UNRESOLVED: objc/execute/class-3.m execution, -O3 -g -fnext-runtime
FAIL: objc/execute/class-3.m compilation, -Os -fnext-runtime
UNRESOLVED: objc/execute/class-3.m execution, -Os -fnext-runtime
FAIL: objc/execute/class-4.m compilation, -O0 -fnext-runtime
UNRESOLVED: objc/execute/class-4.m execution, -O0 -fnext-runtime
FAIL: objc/execute/class-4.m compilation, -O1 -fnext-runtime
UNRESOLVED: objc/execute/class-4.m execution, -O1 -fnext-runtime
FAIL: objc/execute/class-4.m compilation, -O2 -fnext-runtime
UNRESOLVED: objc/execute/class-4.m execution, -O2 -fnext-runtime
FAIL: objc/execute/class-4.m compilation, -O3 -fomit-frame-pointer - fnext-runtime
UNRESOLVED: objc/execute/class-4.m execution, -O3 -fomit-frame- pointer -fnext-runtime
FAIL: objc/execute/class-4.m compilation, -O3 -g -fnext-runtime
UNRESOLVED: objc/execute/class-4.m execution, -O3 -g -fnext-runtime
FAIL: objc/execute/class-4.m compilation, -Os -fnext-runtime
UNRESOLVED: objc/execute/class-4.m execution, -Os -fnext-runtime
FAIL: objc/execute/class-5.m compilation, -O0 -fnext-runtime
UNRESOLVED: objc/execute/class-5.m execution, -O0 -fnext-runtime
FAIL: objc/execute/class-5.m compilation, -O1 -fnext-runtime
UNRESOLVED: objc/execute/class-5.m execution, -O1 -fnext-runtime
FAIL: objc/execute/class-5.m compilation, -O2 -fnext-runtime
UNRESOLVED: objc/execute/class-5.m execution, -O2 -fnext-runtime
FAIL: objc/execute/class-5.m compilation, -O3 -fomit-frame-pointer - fnext-runtime
UNRESOLVED: objc/execute/class-5.m execution, -O3 -fomit-frame- pointer -fnext-runtime
FAIL: objc/execute/class-5.m compilation, -O3 -g -fnext-runtime
UNRESOLVED: objc/execute/class-5.m execution, -O3 -g -fnext-runtime
FAIL: objc/execute/class-5.m compilation, -Os -fnext-runtime
UNRESOLVED: objc/execute/class-5.m execution, -Os -fnext-runtime
FAIL: objc/execute/class-6.m compilation, -O0 -fnext-runtime
UNRESOLVED: objc/execute/class-6.m execution, -O0 -fnext-runtime
FAIL: objc/execute/class-6.m compilation, -O1 -fnext-runtime
UNRESOLVED: objc/execute/class-6.m execution, -O1 -fnext-runtime
FAIL: objc/execute/class-6.m compilation, -O2 -fnext-runtime
UNRESOLVED: objc/execute/class-6.m execution, -O2 -fnext-runtime
FAIL: objc/execute/class-6.m compilation, -O3 -fomit-frame-pointer - fnext-runtime
UNRESOLVED: objc/execute/class-6.m execution, -O3 -fomit-frame- pointer -fnext-runtime
FAIL: objc/execute/class-6.m compilation, -O3 -g -fnext-runtime
UNRESOLVED: objc/execute/class-6.m execution, -O3 -g -fnext-runtime
FAIL: objc/execute/class-6.m compilation, -Os -fnext-runtime
UNRESOLVED: objc/execute/class-6.m execution, -Os -fnext-runtime
FAIL: objc/execute/class-7.m compilation, -O0 -fnext-runtime
UNRESOLVED: objc/execute/class-7.m execution, -O0 -fnext-runtime
FAIL: objc/execute/class-7.m compilation, -O1 -fnext-runtime
UNRESOLVED: objc/execute/class-7.m execution, -O1 -fnext-runtime
FAIL: objc/execute/class-7.m compilation, -O2 -fnext-runtime
UNRESOLVED: objc/execute/class-7.m execution, -O2 -fnext-runtime
FAIL: objc/execute/class-7.m compilation, -O3 -fomit-frame-pointer - fnext-runtime
UNRESOLVED: objc/execute/class-7.m execution, -O3 -fomit-frame- pointer -fnext-runtime
FAIL: objc/execute/class-7.m compilation, -O3 -g -fnext-runtime
UNRESOLVED: objc/execute/class-7.m execution, -O3 -g -fnext-runtime
FAIL: objc/execute/class-7.m compilation, -Os -fnext-runtime
UNRESOLVED: objc/execute/class-7.m execution, -Os -fnext-runtime
FAIL: objc/execute/class-8.m compilation, -O0 -fnext-runtime
UNRESOLVED: objc/execute/class-8.m execution, -O0 -fnext-runtime
FAIL: objc/execute/class-8.m compilation, -O1 -fnext-runtime
UNRESOLVED: objc/execute/class-8.m execution, -O1 -fnext-runtime
FAIL: objc/execute/class-8.m compilation, -O2 -fnext-runtime
UNRESOLVED: objc/execute/class-8.m execution, -O2 -fnext-runtime
FAIL: objc/execute/class-8.m compilation, -O3 -fomit-frame-pointer - fnext-runtime
UNRESOLVED: objc/execute/class-8.m execution, -O3 -fomit-frame- pointer -fnext-runtime
FAIL: objc/execute/class-8.m compilation, -O3 -g -fnext-runtime
UNRESOLVED: objc/execute/class-8.m execution, -O3 -g -fnext-runtime
FAIL: objc/execute/class-8.m compilation, -Os -fnext-runtime
UNRESOLVED: objc/execute/class-8.m execution, -Os -fnext-runtime
FAIL: objc/execute/class-9.m compilation, -O0 -fnext-runtime
UNRESOLVED: objc/execute/class-9.m execution, -O0 -fnext-runtime
FAIL: objc/execute/class-9.m compilation, -O1 -fnext-runtime
UNRESOLVED: objc/execute/class-9.m execution, -O1 -fnext-runtime
FAIL: objc/execute/class-9.m compilation, -O2 -fnext-runtime
UNRESOLVED: objc/execute/class-9.m execution, -O2 -fnext-runtime
FAIL: objc/execute/class-9.m compilation, -O3 -fomit-frame-pointer - fnext-runtime
UNRESOLVED: objc/execute/class-9.m execution, -O3 -fomit-frame- pointer -fnext-runtime
FAIL: objc/execute/class-9.m compilation, -O3 -g -fnext-runtime
UNRESOLVED: objc/execute/class-9.m execution, -O3 -g -fnext-runtime
FAIL: objc/execute/class-9.m compilation, -Os -fnext-runtime
UNRESOLVED: objc/execute/class-9.m execution, -Os -fnext-runtime
FAIL: objc/execute/class_self-1.m execution, -O0 -fnext-runtime
FAIL: objc/execute/class_self-1.m execution, -O1 -fnext-runtime
FAIL: objc/execute/class_self-1.m execution, -O2 -fnext-runtime
FAIL: objc/execute/class_self-1.m execution, -O3 -fomit-frame- pointer -fnext-runtime
FAIL: objc/execute/class_self-1.m execution, -O3 -g -fnext-runtime
FAIL: objc/execute/class_self-1.m execution, -Os -fnext-runtime
FAIL: objc/execute/class_self-2.m execution, -O0 -fnext-runtime
FAIL: objc/execute/class_self-2.m execution, -O1 -fnext-runtime
FAIL: objc/execute/class_self-2.m execution, -O2 -fnext-runtime
FAIL: objc/execute/class_self-2.m execution, -O3 -fomit-frame- pointer -fnext-runtime
FAIL: objc/execute/class_self-2.m execution, -O3 -g -fnext-runtime
FAIL: objc/execute/class_self-2.m execution, -Os -fnext-runtime
FAIL: objc/execute/compatibility_alias.m compilation, -O0 -fnext- runtime
UNRESOLVED: objc/execute/compatibility_alias.m execution, -O0 -fnext- runtime
FAIL: objc/execute/compatibility_alias.m compilation, -O1 -fnext- runtime
UNRESOLVED: objc/execute/compatibility_alias.m execution, -O1 -fnext- runtime
FAIL: objc/execute/compatibility_alias.m compilation, -O2 -fnext- runtime
UNRESOLVED: objc/execute/compatibility_alias.m execution, -O2 -fnext- runtime
FAIL: objc/execute/compatibility_alias.m compilation, -O3 -fomit- frame-pointer -fnext-runtime
UNRESOLVED: objc/execute/compatibility_alias.m execution, -O3 -fomit- frame-pointer -fnext-runtime
FAIL: objc/execute/compatibility_alias.m compilation, -O3 -g -fnext- runtime
UNRESOLVED: objc/execute/compatibility_alias.m execution, -O3 -g - fnext-runtime
FAIL: objc/execute/compatibility_alias.m compilation, -Os -fnext- runtime
UNRESOLVED: objc/execute/compatibility_alias.m execution, -Os -fnext- runtime
FAIL: objc/execute/enumeration-1.m compilation, -O0 -fnext-runtime
UNRESOLVED: objc/execute/enumeration-1.m execution, -O0 -fnext-runtime
FAIL: objc/execute/enumeration-1.m compilation, -O1 -fnext-runtime
UNRESOLVED: objc/execute/enumeration-1.m execution, -O1 -fnext-runtime
FAIL: objc/execute/enumeration-1.m compilation, -O2 -fnext-runtime
UNRESOLVED: objc/execute/enumeration-1.m execution, -O2 -fnext-runtime
FAIL: objc/execute/enumeration-1.m compilation, -O3 -fomit-frame- pointer -fnext-runtime
UNRESOLVED: objc/execute/enumeration-1.m execution, -O3 -fomit-frame- pointer -fnext-runtime
FAIL: objc/execute/enumeration-1.m compilation, -O3 -g -fnext-runtime
UNRESOLVED: objc/execute/enumeration-1.m execution, -O3 -g -fnext- runtime
FAIL: objc/execute/enumeration-1.m compilation, -Os -fnext-runtime
UNRESOLVED: objc/execute/enumeration-1.m execution, -Os -fnext-runtime
FAIL: objc/execute/enumeration-2.m compilation, -O0 -fnext-runtime
UNRESOLVED: objc/execute/enumeration-2.m execution, -O0 -fnext-runtime
FAIL: objc/execute/enumeration-2.m compilation, -O1 -fnext-runtime
UNRESOLVED: objc/execute/enumeration-2.m execution, -O1 -fnext-runtime
FAIL: objc/execute/enumeration-2.m compilation, -O2 -fnext-runtime
UNRESOLVED: objc/execute/enumeration-2.m execution, -O2 -fnext-runtime
FAIL: objc/execute/enumeration-2.m compilation, -O3 -fomit-frame- pointer -fnext-runtime
UNRESOLVED: objc/execute/enumeration-2.m execution, -O3 -fomit-frame- pointer -fnext-runtime
FAIL: objc/execute/enumeration-2.m compilation, -O3 -g -fnext-runtime
UNRESOLVED: objc/execute/enumeration-2.m execution, -O3 -g -fnext- runtime
FAIL: objc/execute/enumeration-2.m compilation, -Os -fnext-runtime
UNRESOLVED: objc/execute/enumeration-2.m execution, -Os -fnext-runtime
FAIL: objc/execute/formal_protocol-1.m compilation, -O0 -fnext-runtime
UNRESOLVED: objc/execute/formal_protocol-1.m execution, -O0 -fnext- runtime
FAIL: objc/execute/formal_protocol-1.m compilation, -O1 -fnext-runtime
UNRESOLVED: objc/execute/formal_protocol-1.m execution, -O1 -fnext- runtime
FAIL: objc/execute/formal_protocol-1.m compilation, -O2 -fnext-runtime
UNRESOLVED: objc/execute/formal_protocol-1.m execution, -O2 -fnext- runtime
FAIL: objc/execute/formal_protocol-1.m compilation, -O3 -fomit-frame- pointer -fnext-runtime
UNRESOLVED: objc/execute/formal_protocol-1.m execution, -O3 -fomit- frame-pointer -fnext-runtime
FAIL: objc/execute/formal_protocol-1.m compilation, -O3 -g -fnext- runtime
UNRESOLVED: objc/execute/formal_protocol-1.m execution, -O3 -g - fnext-runtime
FAIL: objc/execute/formal_protocol-1.m compilation, -Os -fnext-runtime
UNRESOLVED: objc/execute/formal_protocol-1.m execution, -Os -fnext- runtime
FAIL: objc/execute/formal_protocol-2.m compilation, -O0 -fnext-runtime
UNRESOLVED: objc/execute/formal_protocol-2.m execution, -O0 -fnext- runtime
FAIL: objc/execute/formal_protocol-2.m compilation, -O1 -fnext-runtime
UNRESOLVED: objc/execute/formal_protocol-2.m execution, -O1 -fnext- runtime
FAIL: objc/execute/formal_protocol-2.m compilation, -O2 -fnext-runtime
UNRESOLVED: objc/execute/formal_protocol-2.m execution, -O2 -fnext- runtime
FAIL: objc/execute/formal_protocol-2.m compilation, -O3 -fomit-frame- pointer -fnext-runtime
UNRESOLVED: objc/execute/formal_protocol-2.m execution, -O3 -fomit- frame-pointer -fnext-runtime
FAIL: objc/execute/formal_protocol-2.m compilation, -O3 -g -fnext- runtime
UNRESOLVED: objc/execute/formal_protocol-2.m execution, -O3 -g - fnext-runtime
FAIL: objc/execute/formal_protocol-2.m compilation, -Os -fnext-runtime
UNRESOLVED: objc/execute/formal_protocol-2.m execution, -Os -fnext- runtime
FAIL: objc/execute/formal_protocol-3.m compilation, -O0 -fnext-runtime
UNRESOLVED: objc/execute/formal_protocol-3.m execution, -O0 -fnext- runtime
FAIL: objc/execute/formal_protocol-3.m compilation, -O1 -fnext-runtime
UNRESOLVED: objc/execute/formal_protocol-3.m execution, -O1 -fnext- runtime
FAIL: objc/execute/formal_protocol-3.m compilation, -O2 -fnext-runtime
UNRESOLVED: objc/execute/formal_protocol-3.m execution, -O2 -fnext- runtime
FAIL: objc/execute/formal_protocol-3.m compilation, -O3 -fomit-frame- pointer -fnext-runtime
UNRESOLVED: objc/execute/formal_protocol-3.m execution, -O3 -fomit- frame-pointer -fnext-runtime
FAIL: objc/execute/formal_protocol-3.m compilation, -O3 -g -fnext- runtime
UNRESOLVED: objc/execute/formal_protocol-3.m execution, -O3 -g - fnext-runtime
FAIL: objc/execute/formal_protocol-3.m compilation, -Os -fnext-runtime
UNRESOLVED: objc/execute/formal_protocol-3.m execution, -Os -fnext- runtime
FAIL: objc/execute/formal_protocol-4.m compilation, -O0 -fnext-runtime
UNRESOLVED: objc/execute/formal_protocol-4.m execution, -O0 -fnext- runtime
FAIL: objc/execute/formal_protocol-4.m compilation, -O1 -fnext-runtime
UNRESOLVED: objc/execute/formal_protocol-4.m execution, -O1 -fnext- runtime
FAIL: objc/execute/formal_protocol-4.m compilation, -O2 -fnext-runtime
UNRESOLVED: objc/execute/formal_protocol-4.m execution, -O2 -fnext- runtime
FAIL: objc/execute/formal_protocol-4.m compilation, -O3 -fomit-frame- pointer -fnext-runtime
UNRESOLVED: objc/execute/formal_protocol-4.m execution, -O3 -fomit- frame-pointer -fnext-runtime
FAIL: objc/execute/formal_protocol-4.m compilation, -O3 -g -fnext- runtime
UNRESOLVED: objc/execute/formal_protocol-4.m execution, -O3 -g - fnext-runtime
FAIL: objc/execute/formal_protocol-4.m compilation, -Os -fnext-runtime
UNRESOLVED: objc/execute/formal_protocol-4.m execution, -Os -fnext- runtime
FAIL: objc/execute/formal_protocol-5.m compilation, -O0 -fnext-runtime
UNRESOLVED: objc/execute/formal_protocol-5.m execution, -O0 -fnext- runtime
FAIL: objc/execute/formal_protocol-5.m compilation, -O1 -fnext-runtime
UNRESOLVED: objc/execute/formal_protocol-5.m execution, -O1 -fnext- runtime
FAIL: objc/execute/formal_protocol-5.m compilation, -O2 -fnext-runtime
UNRESOLVED: objc/execute/formal_protocol-5.m execution, -O2 -fnext- runtime
FAIL: objc/execute/formal_protocol-5.m compilation, -O3 -fomit-frame- pointer -fnext-runtime
UNRESOLVED: objc/execute/formal_protocol-5.m execution, -O3 -fomit- frame-pointer -fnext-runtime
FAIL: objc/execute/formal_protocol-5.m compilation, -O3 -g -fnext- runtime
UNRESOLVED: objc/execute/formal_protocol-5.m execution, -O3 -g - fnext-runtime
FAIL: objc/execute/formal_protocol-5.m compilation, -Os -fnext-runtime
UNRESOLVED: objc/execute/formal_protocol-5.m execution, -Os -fnext- runtime
FAIL: objc/execute/formal_protocol-6.m compilation, -O0 -fnext-runtime
UNRESOLVED: objc/execute/formal_protocol-6.m execution, -O0 -fnext- runtime
FAIL: objc/execute/formal_protocol-6.m compilation, -O1 -fnext-runtime
UNRESOLVED: objc/execute/formal_protocol-6.m execution, -O1 -fnext- runtime
FAIL: objc/execute/formal_protocol-6.m compilation, -O2 -fnext-runtime
UNRESOLVED: objc/execute/formal_protocol-6.m execution, -O2 -fnext- runtime
FAIL: objc/execute/formal_protocol-6.m compilation, -O3 -fomit-frame- pointer -fnext-runtime
UNRESOLVED: objc/execute/formal_protocol-6.m execution, -O3 -fomit- frame-pointer -fnext-runtime
FAIL: objc/execute/formal_protocol-6.m compilation, -O3 -g -fnext- runtime
UNRESOLVED: objc/execute/formal_protocol-6.m execution, -O3 -g - fnext-runtime
FAIL: objc/execute/formal_protocol-6.m compilation, -Os -fnext-runtime
UNRESOLVED: objc/execute/formal_protocol-6.m execution, -Os -fnext- runtime
FAIL: objc/execute/formal_protocol-7.m compilation, -O0 -fnext-runtime
UNRESOLVED: objc/execute/formal_protocol-7.m execution, -O0 -fnext- runtime
FAIL: objc/execute/formal_protocol-7.m compilation, -O1 -fnext-runtime
UNRESOLVED: objc/execute/formal_protocol-7.m execution, -O1 -fnext- runtime
FAIL: objc/execute/formal_protocol-7.m compilation, -O2 -fnext-runtime
UNRESOLVED: objc/execute/formal_protocol-7.m execution, -O2 -fnext- runtime
FAIL: objc/execute/formal_protocol-7.m compilation, -O3 -fomit-frame- pointer -fnext-runtime
UNRESOLVED: objc/execute/formal_protocol-7.m execution, -O3 -fomit- frame-pointer -fnext-runtime
FAIL: objc/execute/formal_protocol-7.m compilation, -O3 -g -fnext- runtime
UNRESOLVED: objc/execute/formal_protocol-7.m execution, -O3 -g - fnext-runtime
FAIL: objc/execute/formal_protocol-7.m compilation, -Os -fnext-runtime
UNRESOLVED: objc/execute/formal_protocol-7.m execution, -Os -fnext- runtime
FAIL: objc/execute/forward-1.m execution, -O0 -fgnu-runtime
FAIL: objc/execute/forward-1.m execution, -O1 -fgnu-runtime
FAIL: objc/execute/forward-1.m execution, -O2 -fgnu-runtime
FAIL: objc/execute/forward-1.m execution, -O3 -fomit-frame-pointer - fgnu-runtime
FAIL: objc/execute/forward-1.m execution, -O3 -fomit-frame-pointer - funroll-loops -fgnu-runtime
FAIL: objc/execute/forward-1.m execution, -O3 -fomit-frame-pointer - funroll-all-loops -finline-functions -fgnu-runtime
FAIL: objc/execute/forward-1.m execution, -O3 -g -fgnu-runtime
FAIL: objc/execute/forward-1.m execution, -Os -fgnu-runtime
FAIL: objc/execute/function-message-1.m compilation, -O0 -fnext-runtime
UNRESOLVED: objc/execute/function-message-1.m execution, -O0 -fnext- runtime
FAIL: objc/execute/function-message-1.m compilation, -O1 -fnext-runtime
UNRESOLVED: objc/execute/function-message-1.m execution, -O1 -fnext- runtime
FAIL: objc/execute/function-message-1.m compilation, -O2 -fnext-runtime
UNRESOLVED: objc/execute/function-message-1.m execution, -O2 -fnext- runtime
FAIL: objc/execute/function-message-1.m compilation, -O3 -fomit- frame-pointer -fnext-runtime
UNRESOLVED: objc/execute/function-message-1.m execution, -O3 -fomit- frame-pointer -fnext-runtime
FAIL: objc/execute/function-message-1.m compilation, -O3 -g -fnext- runtime
UNRESOLVED: objc/execute/function-message-1.m execution, -O3 -g - fnext-runtime
FAIL: objc/execute/function-message-1.m compilation, -Os -fnext-runtime
UNRESOLVED: objc/execute/function-message-1.m execution, -Os -fnext- runtime
FAIL: objc/execute/initialize.m execution, -O0 -fnext-runtime
FAIL: objc/execute/initialize.m execution, -O1 -fnext-runtime
FAIL: objc/execute/initialize.m execution, -O2 -fnext-runtime
FAIL: objc/execute/initialize.m execution, -O3 -fomit-frame-pointer - fnext-runtime
FAIL: objc/execute/initialize.m execution, -O3 -g -fnext-runtime
FAIL: objc/execute/initialize.m execution, -Os -fnext-runtime
FAIL: objc/execute/load-2.m execution, -O0 -fnext-runtime
FAIL: objc/execute/load-2.m execution, -O1 -fnext-runtime
FAIL: objc/execute/load-2.m execution, -O2 -fnext-runtime
FAIL: objc/execute/load-2.m execution, -O3 -fomit-frame-pointer - fnext-runtime
FAIL: objc/execute/load-2.m execution, -O3 -g -fnext-runtime
FAIL: objc/execute/load-2.m execution, -Os -fnext-runtime
FAIL: objc/execute/load-3.m compilation, -O0 -fnext-runtime
UNRESOLVED: objc/execute/load-3.m execution, -O0 -fnext-runtime
FAIL: objc/execute/load-3.m compilation, -O1 -fnext-runtime
UNRESOLVED: objc/execute/load-3.m execution, -O1 -fnext-runtime
FAIL: objc/execute/load-3.m compilation, -O2 -fnext-runtime
UNRESOLVED: objc/execute/load-3.m execution, -O2 -fnext-runtime
FAIL: objc/execute/load-3.m compilation, -O3 -fomit-frame-pointer - fnext-runtime
UNRESOLVED: objc/execute/load-3.m execution, -O3 -fomit-frame- pointer -fnext-runtime
FAIL: objc/execute/load-3.m compilation, -O3 -fomit-frame-pointer - funroll-loops -fnext-runtime
UNRESOLVED: objc/execute/load-3.m execution, -O3 -fomit-frame- pointer -funroll-loops -fnext-runtime
FAIL: objc/execute/load-3.m compilation, -O3 -fomit-frame-pointer - funroll-all-loops -finline-functions -fnext-runtime
UNRESOLVED: objc/execute/load-3.m execution, -O3 -fomit-frame- pointer -funroll-all-loops -finline-functions -fnext-runtime
FAIL: objc/execute/load-3.m compilation, -O3 -g -fnext-runtime
UNRESOLVED: objc/execute/load-3.m execution, -O3 -g -fnext-runtime
FAIL: objc/execute/load-3.m compilation, -Os -fnext-runtime
UNRESOLVED: objc/execute/load-3.m execution, -Os -fnext-runtime
FAIL: objc/execute/load.m execution, -O0 -fnext-runtime
FAIL: objc/execute/load.m execution, -O1 -fnext-runtime
FAIL: objc/execute/load.m execution, -O2 -fnext-runtime
FAIL: objc/execute/load.m execution, -O3 -fomit-frame-pointer -fnext- runtime
FAIL: objc/execute/load.m execution, -O3 -g -fnext-runtime
FAIL: objc/execute/load.m execution, -Os -fnext-runtime
FAIL: objc/execute/many_args_method.m execution, -O0 -fnext-runtime
FAIL: objc/execute/many_args_method.m execution, -O1 -fnext-runtime
FAIL: objc/execute/many_args_method.m execution, -O2 -fnext-runtime
FAIL: objc/execute/many_args_method.m execution, -O3 -fomit-frame- pointer -fnext-runtime
FAIL: objc/execute/many_args_method.m execution, -O3 -g -fnext-runtime
FAIL: objc/execute/many_args_method.m execution, -Os -fnext-runtime
FAIL: objc/execute/nested-3.m execution, -O0 -fnext-runtime
FAIL: objc/execute/nested-3.m execution, -O1 -fnext-runtime
FAIL: objc/execute/nested-3.m execution, -O2 -fnext-runtime
FAIL: objc/execute/nested-3.m execution, -O3 -fomit-frame-pointer - fnext-runtime
FAIL: objc/execute/nested-3.m execution, -O3 -g -fnext-runtime
FAIL: objc/execute/nested-3.m execution, -Os -fnext-runtime
FAIL: objc/execute/nested-func-1.m compilation, -O0 -fnext-runtime
UNRESOLVED: objc/execute/nested-func-1.m execution, -O0 -fnext-runtime
FAIL: objc/execute/nested-func-1.m compilation, -O1 -fnext-runtime
UNRESOLVED: objc/execute/nested-func-1.m execution, -O1 -fnext-runtime
FAIL: objc/execute/nested-func-1.m compilation, -O2 -fnext-runtime
UNRESOLVED: objc/execute/nested-func-1.m execution, -O2 -fnext-runtime
FAIL: objc/execute/nested-func-1.m compilation, -O3 -fomit-frame- pointer -fnext-runtime
UNRESOLVED: objc/execute/nested-func-1.m execution, -O3 -fomit-frame- pointer -fnext-runtime
FAIL: objc/execute/nested-func-1.m compilation, -O3 -g -fnext-runtime
UNRESOLVED: objc/execute/nested-func-1.m execution, -O3 -g -fnext- runtime
FAIL: objc/execute/nested-func-1.m compilation, -Os -fnext-runtime
UNRESOLVED: objc/execute/nested-func-1.m execution, -Os -fnext-runtime
FAIL: objc/execute/no_clash.m compilation, -O0 -fnext-runtime
UNRESOLVED: objc/execute/no_clash.m execution, -O0 -fnext-runtime
FAIL: objc/execute/no_clash.m compilation, -O1 -fnext-runtime
UNRESOLVED: objc/execute/no_clash.m execution, -O1 -fnext-runtime
FAIL: objc/execute/no_clash.m compilation, -O2 -fnext-runtime
UNRESOLVED: objc/execute/no_clash.m execution, -O2 -fnext-runtime
FAIL: objc/execute/no_clash.m compilation, -O3 -fomit-frame-pointer - fnext-runtime
UNRESOLVED: objc/execute/no_clash.m execution, -O3 -fomit-frame- pointer -fnext-runtime
FAIL: objc/execute/no_clash.m compilation, -O3 -g -fnext-runtime
UNRESOLVED: objc/execute/no_clash.m execution, -O3 -g -fnext-runtime
FAIL: objc/execute/no_clash.m compilation, -Os -fnext-runtime
UNRESOLVED: objc/execute/no_clash.m execution, -Os -fnext-runtime
FAIL: objc/execute/np-1.m compilation, -O0 -fnext-runtime
UNRESOLVED: objc/execute/np-1.m execution, -O0 -fnext-runtime
FAIL: objc/execute/np-1.m compilation, -O1 -fnext-runtime
UNRESOLVED: objc/execute/np-1.m execution, -O1 -fnext-runtime
FAIL: objc/execute/np-1.m compilation, -O2 -fnext-runtime
UNRESOLVED: objc/execute/np-1.m execution, -O2 -fnext-runtime
FAIL: objc/execute/np-1.m compilation, -O3 -fomit-frame-pointer - fnext-runtime
UNRESOLVED: objc/execute/np-1.m execution, -O3 -fomit-frame-pointer - fnext-runtime
FAIL: objc/execute/np-1.m compilation, -O3 -g -fnext-runtime
UNRESOLVED: objc/execute/np-1.m execution, -O3 -g -fnext-runtime
FAIL: objc/execute/np-1.m compilation, -Os -fnext-runtime
UNRESOLVED: objc/execute/np-1.m execution, -Os -fnext-runtime
FAIL: objc/execute/np-2.m compilation, -O0 -fnext-runtime
UNRESOLVED: objc/execute/np-2.m execution, -O0 -fnext-runtime
FAIL: objc/execute/np-2.m compilation, -O1 -fnext-runtime
UNRESOLVED: objc/execute/np-2.m execution, -O1 -fnext-runtime
FAIL: objc/execute/np-2.m compilation, -O2 -fnext-runtime
UNRESOLVED: objc/execute/np-2.m execution, -O2 -fnext-runtime
FAIL: objc/execute/np-2.m compilation, -O3 -fomit-frame-pointer - fnext-runtime
UNRESOLVED: objc/execute/np-2.m execution, -O3 -fomit-frame-pointer - fnext-runtime
FAIL: objc/execute/np-2.m compilation, -O3 -g -fnext-runtime
UNRESOLVED: objc/execute/np-2.m execution, -O3 -g -fnext-runtime
FAIL: objc/execute/np-2.m compilation, -Os -fnext-runtime
UNRESOLVED: objc/execute/np-2.m execution, -Os -fnext-runtime
FAIL: objc/execute/object_is_class.m compilation, -O0 -fnext-runtime
UNRESOLVED: objc/execute/object_is_class.m execution, -O0 -fnext- runtime
FAIL: objc/execute/object_is_class.m compilation, -O1 -fnext-runtime
UNRESOLVED: objc/execute/object_is_class.m execution, -O1 -fnext- runtime
FAIL: objc/execute/object_is_class.m compilation, -O2 -fnext-runtime
UNRESOLVED: objc/execute/object_is_class.m execution, -O2 -fnext- runtime
FAIL: objc/execute/object_is_class.m compilation, -O3 -fomit-frame- pointer -fnext-runtime
UNRESOLVED: objc/execute/object_is_class.m execution, -O3 -fomit- frame-pointer -fnext-runtime
FAIL: objc/execute/object_is_class.m compilation, -O3 -g -fnext-runtime
UNRESOLVED: objc/execute/object_is_class.m execution, -O3 -g -fnext- runtime
FAIL: objc/execute/object_is_class.m compilation, -Os -fnext-runtime
UNRESOLVED: objc/execute/object_is_class.m execution, -Os -fnext- runtime
FAIL: objc/execute/object_is_meta_class.m compilation, -O0 -fnext- runtime
UNRESOLVED: objc/execute/object_is_meta_class.m execution, -O0 - fnext-runtime
FAIL: objc/execute/object_is_meta_class.m compilation, -O1 -fnext- runtime
UNRESOLVED: objc/execute/object_is_meta_class.m execution, -O1 - fnext-runtime
FAIL: objc/execute/object_is_meta_class.m compilation, -O2 -fnext- runtime
UNRESOLVED: objc/execute/object_is_meta_class.m execution, -O2 - fnext-runtime
FAIL: objc/execute/object_is_meta_class.m compilation, -O3 -fomit- frame-pointer -fnext-runtime
UNRESOLVED: objc/execute/object_is_meta_class.m execution, -O3 - fomit-frame-pointer -fnext-runtime
FAIL: objc/execute/object_is_meta_class.m compilation, -O3 -g -fnext- runtime
UNRESOLVED: objc/execute/object_is_meta_class.m execution, -O3 -g - fnext-runtime
FAIL: objc/execute/object_is_meta_class.m compilation, -Os -fnext- runtime
UNRESOLVED: objc/execute/object_is_meta_class.m execution, -Os - fnext-runtime
FAIL: objc/execute/private.m compilation, -O0 -fnext-runtime
UNRESOLVED: objc/execute/private.m execution, -O0 -fnext-runtime
FAIL: objc/execute/private.m compilation, -O1 -fnext-runtime
UNRESOLVED: objc/execute/private.m execution, -O1 -fnext-runtime
FAIL: objc/execute/private.m compilation, -O2 -fnext-runtime
UNRESOLVED: objc/execute/private.m execution, -O2 -fnext-runtime
FAIL: objc/execute/private.m compilation, -O3 -fomit-frame-pointer - fnext-runtime
UNRESOLVED: objc/execute/private.m execution, -O3 -fomit-frame- pointer -fnext-runtime
FAIL: objc/execute/private.m compilation, -O3 -g -fnext-runtime
UNRESOLVED: objc/execute/private.m execution, -O3 -g -fnext-runtime
FAIL: objc/execute/private.m compilation, -Os -fnext-runtime
UNRESOLVED: objc/execute/private.m execution, -Os -fnext-runtime
FAIL: objc/execute/protocol-isEqual-1.m compilation, -O0 -fnext-runtime
UNRESOLVED: objc/execute/protocol-isEqual-1.m execution, -O0 -fnext- runtime
FAIL: objc/execute/protocol-isEqual-1.m compilation, -O1 -fnext-runtime
UNRESOLVED: objc/execute/protocol-isEqual-1.m execution, -O1 -fnext- runtime
FAIL: objc/execute/protocol-isEqual-1.m compilation, -O2 -fnext-runtime
UNRESOLVED: objc/execute/protocol-isEqual-1.m execution, -O2 -fnext- runtime
FAIL: objc/execute/protocol-isEqual-1.m compilation, -O3 -fomit- frame-pointer -fnext-runtime
UNRESOLVED: objc/execute/protocol-isEqual-1.m execution, -O3 -fomit- frame-pointer -fnext-runtime
FAIL: objc/execute/protocol-isEqual-1.m compilation, -O3 -g -fnext- runtime
UNRESOLVED: objc/execute/protocol-isEqual-1.m execution, -O3 -g - fnext-runtime
FAIL: objc/execute/protocol-isEqual-1.m compilation, -Os -fnext-runtime
UNRESOLVED: objc/execute/protocol-isEqual-1.m execution, -Os -fnext- runtime
FAIL: objc/execute/protocol-isEqual-2.m compilation, -O0 -fnext-runtime
UNRESOLVED: objc/execute/protocol-isEqual-2.m execution, -O0 -fnext- runtime
FAIL: objc/execute/protocol-isEqual-2.m compilation, -O1 -fnext-runtime
UNRESOLVED: objc/execute/protocol-isEqual-2.m execution, -O1 -fnext- runtime
FAIL: objc/execute/protocol-isEqual-2.m compilation, -O2 -fnext-runtime
UNRESOLVED: objc/execute/protocol-isEqual-2.m execution, -O2 -fnext- runtime
FAIL: objc/execute/protocol-isEqual-2.m compilation, -O3 -fomit- frame-pointer -fnext-runtime
UNRESOLVED: objc/execute/protocol-isEqual-2.m execution, -O3 -fomit- frame-pointer -fnext-runtime
FAIL: objc/execute/protocol-isEqual-2.m compilation, -O3 -g -fnext- runtime
UNRESOLVED: objc/execute/protocol-isEqual-2.m execution, -O3 -g - fnext-runtime
FAIL: objc/execute/protocol-isEqual-2.m compilation, -Os -fnext-runtime
UNRESOLVED: objc/execute/protocol-isEqual-2.m execution, -Os -fnext- runtime
FAIL: objc/execute/protocol-isEqual-3.m compilation, -O0 -fnext-runtime
UNRESOLVED: objc/execute/protocol-isEqual-3.m execution, -O0 -fnext- runtime
FAIL: objc/execute/protocol-isEqual-3.m compilation, -O1 -fnext-runtime
UNRESOLVED: objc/execute/protocol-isEqual-3.m execution, -O1 -fnext- runtime
FAIL: objc/execute/protocol-isEqual-3.m compilation, -O2 -fnext-runtime
UNRESOLVED: objc/execute/protocol-isEqual-3.m execution, -O2 -fnext- runtime
FAIL: objc/execute/protocol-isEqual-3.m compilation, -O3 -fomit- frame-pointer -fnext-runtime
UNRESOLVED: objc/execute/protocol-isEqual-3.m execution, -O3 -fomit- frame-pointer -fnext-runtime
FAIL: objc/execute/protocol-isEqual-3.m compilation, -O3 -g -fnext- runtime
UNRESOLVED: objc/execute/protocol-isEqual-3.m execution, -O3 -g - fnext-runtime
FAIL: objc/execute/protocol-isEqual-3.m compilation, -Os -fnext-runtime
UNRESOLVED: objc/execute/protocol-isEqual-3.m execution, -Os -fnext- runtime
FAIL: objc/execute/protocol-isEqual-4.m compilation, -O0 -fnext-runtime
UNRESOLVED: objc/execute/protocol-isEqual-4.m execution, -O0 -fnext- runtime
FAIL: objc/execute/protocol-isEqual-4.m compilation, -O1 -fnext-runtime
UNRESOLVED: objc/execute/protocol-isEqual-4.m execution, -O1 -fnext- runtime
FAIL: objc/execute/protocol-isEqual-4.m compilation, -O2 -fnext-runtime
UNRESOLVED: objc/execute/protocol-isEqual-4.m execution, -O2 -fnext- runtime
FAIL: objc/execute/protocol-isEqual-4.m compilation, -O3 -fomit- frame-pointer -fnext-runtime
UNRESOLVED: objc/execute/protocol-isEqual-4.m execution, -O3 -fomit- frame-pointer -fnext-runtime
FAIL: objc/execute/protocol-isEqual-4.m compilation, -O3 -g -fnext- runtime
UNRESOLVED: objc/execute/protocol-isEqual-4.m execution, -O3 -g - fnext-runtime
FAIL: objc/execute/protocol-isEqual-4.m compilation, -Os -fnext-runtime
UNRESOLVED: objc/execute/protocol-isEqual-4.m execution, -Os -fnext- runtime
FAIL: objc/execute/redefining_self.m execution, -O0 -fnext-runtime
FAIL: objc/execute/redefining_self.m execution, -O1 -fnext-runtime
FAIL: objc/execute/redefining_self.m execution, -O2 -fnext-runtime
FAIL: objc/execute/redefining_self.m execution, -O3 -fomit-frame- pointer -fnext-runtime
FAIL: objc/execute/redefining_self.m execution, -O3 -g -fnext-runtime
FAIL: objc/execute/redefining_self.m execution, -Os -fnext-runtime
FAIL: objc/execute/root_methods.m compilation, -O0 -fnext-runtime
UNRESOLVED: objc/execute/root_methods.m execution, -O0 -fnext-runtime
FAIL: objc/execute/root_methods.m compilation, -O1 -fnext-runtime
UNRESOLVED: objc/execute/root_methods.m execution, -O1 -fnext-runtime
FAIL: objc/execute/root_methods.m compilation, -O2 -fnext-runtime
UNRESOLVED: objc/execute/root_methods.m execution, -O2 -fnext-runtime
FAIL: objc/execute/root_methods.m compilation, -O3 -fomit-frame- pointer -fnext-runtime
UNRESOLVED: objc/execute/root_methods.m execution, -O3 -fomit-frame- pointer -fnext-runtime
FAIL: objc/execute/root_methods.m compilation, -O3 -g -fnext-runtime
UNRESOLVED: objc/execute/root_methods.m execution, -O3 -g -fnext- runtime
FAIL: objc/execute/root_methods.m compilation, -Os -fnext-runtime
UNRESOLVED: objc/execute/root_methods.m execution, -Os -fnext-runtime
FAIL: objc/execute/static-1.m execution, -O0 -fnext-runtime
FAIL: objc/execute/static-1.m execution, -O1 -fnext-runtime
FAIL: objc/execute/static-1.m execution, -O2 -fnext-runtime
FAIL: objc/execute/static-1.m execution, -O3 -fomit-frame-pointer - fnext-runtime
FAIL: objc/execute/static-1.m execution, -O3 -g -fnext-runtime
FAIL: objc/execute/static-1.m execution, -Os -fnext-runtime
FAIL: objc/execute/static-2.m execution, -O0 -fnext-runtime
FAIL: objc/execute/static-2.m execution, -O1 -fnext-runtime
FAIL: objc/execute/static-2.m execution, -O2 -fnext-runtime
FAIL: objc/execute/static-2.m execution, -O3 -fomit-frame-pointer - fnext-runtime
FAIL: objc/execute/static-2.m execution, -O3 -g -fnext-runtime
FAIL: objc/execute/static-2.m execution, -Os -fnext-runtime
FAIL: objc/execute/string1.m compilation, -O0 -fnext-runtime
UNRESOLVED: objc/execute/string1.m execution, -O0 -fnext-runtime
FAIL: objc/execute/string1.m compilation, -O1 -fnext-runtime
UNRESOLVED: objc/execute/string1.m execution, -O1 -fnext-runtime
FAIL: objc/execute/string1.m compilation, -O2 -fnext-runtime
UNRESOLVED: objc/execute/string1.m execution, -O2 -fnext-runtime
FAIL: objc/execute/string1.m compilation, -O3 -fomit-frame-pointer - fnext-runtime
UNRESOLVED: objc/execute/string1.m execution, -O3 -fomit-frame- pointer -fnext-runtime
FAIL: objc/execute/string1.m compilation, -O3 -g -fnext-runtime
UNRESOLVED: objc/execute/string1.m execution, -O3 -g -fnext-runtime
FAIL: objc/execute/string1.m compilation, -Os -fnext-runtime
UNRESOLVED: objc/execute/string1.m execution, -Os -fnext-runtime
FAIL: objc/execute/string2.m compilation, -O0 -fnext-runtime
UNRESOLVED: objc/execute/string2.m execution, -O0 -fnext-runtime
FAIL: objc/execute/string2.m compilation, -O1 -fnext-runtime
UNRESOLVED: objc/execute/string2.m execution, -O1 -fnext-runtime
FAIL: objc/execute/string2.m compilation, -O2 -fnext-runtime
UNRESOLVED: objc/execute/string2.m execution, -O2 -fnext-runtime
FAIL: objc/execute/string2.m compilation, -O3 -fomit-frame-pointer - fnext-runtime
UNRESOLVED: objc/execute/string2.m execution, -O3 -fomit-frame- pointer -fnext-runtime
FAIL: objc/execute/string2.m compilation, -O3 -g -fnext-runtime
UNRESOLVED: objc/execute/string2.m execution, -O3 -g -fnext-runtime
FAIL: objc/execute/string2.m compilation, -Os -fnext-runtime
UNRESOLVED: objc/execute/string2.m execution, -Os -fnext-runtime
FAIL: objc/execute/string3.m compilation, -O0 -fnext-runtime
UNRESOLVED: objc/execute/string3.m execution, -O0 -fnext-runtime
FAIL: objc/execute/string3.m compilation, -O1 -fnext-runtime
UNRESOLVED: objc/execute/string3.m execution, -O1 -fnext-runtime
FAIL: objc/execute/string3.m compilation, -O2 -fnext-runtime
UNRESOLVED: objc/execute/string3.m execution, -O2 -fnext-runtime
FAIL: objc/execute/string3.m compilation, -O3 -fomit-frame-pointer - fnext-runtime
UNRESOLVED: objc/execute/string3.m execution, -O3 -fomit-frame- pointer -fnext-runtime
FAIL: objc/execute/string3.m compilation, -O3 -g -fnext-runtime
UNRESOLVED: objc/execute/string3.m execution, -O3 -g -fnext-runtime
FAIL: objc/execute/string3.m compilation, -Os -fnext-runtime
UNRESOLVED: objc/execute/string3.m execution, -Os -fnext-runtime
FAIL: objc/execute/string4.m compilation, -O0 -fnext-runtime
UNRESOLVED: objc/execute/string4.m execution, -O0 -fnext-runtime
FAIL: objc/execute/string4.m compilation, -O1 -fnext-runtime
UNRESOLVED: objc/execute/string4.m execution, -O1 -fnext-runtime
FAIL: objc/execute/string4.m compilation, -O2 -fnext-runtime
UNRESOLVED: objc/execute/string4.m execution, -O2 -fnext-runtime
FAIL: objc/execute/string4.m compilation, -O3 -fomit-frame-pointer - fnext-runtime
UNRESOLVED: objc/execute/string4.m execution, -O3 -fomit-frame- pointer -fnext-runtime
FAIL: objc/execute/string4.m compilation, -O3 -g -fnext-runtime
UNRESOLVED: objc/execute/string4.m execution, -O3 -g -fnext-runtime
FAIL: objc/execute/string4.m compilation, -Os -fnext-runtime
UNRESOLVED: objc/execute/string4.m execution, -Os -fnext-runtime
FAIL: objc/execute/trivial.m compilation, -O0 -fnext-runtime
UNRESOLVED: objc/execute/trivial.m execution, -O0 -fnext-runtime
FAIL: objc/execute/trivial.m compilation, -O1 -fnext-runtime
UNRESOLVED: objc/execute/trivial.m execution, -O1 -fnext-runtime
FAIL: objc/execute/trivial.m compilation, -O2 -fnext-runtime
UNRESOLVED: objc/execute/trivial.m execution, -O2 -fnext-runtime
FAIL: objc/execute/trivial.m compilation, -O3 -fomit-frame-pointer - fnext-runtime
UNRESOLVED: objc/execute/trivial.m execution, -O3 -fomit-frame- pointer -fnext-runtime
FAIL: objc/execute/trivial.m compilation, -O3 -g -fnext-runtime
UNRESOLVED: objc/execute/trivial.m execution, -O3 -g -fnext-runtime
FAIL: objc/execute/trivial.m compilation, -Os -fnext-runtime
UNRESOLVED: objc/execute/trivial.m execution, -Os -fnext-runtime
FAIL: objc/execute/va_method.m execution, -O0 -fnext-runtime
FAIL: objc/execute/va_method.m execution, -O1 -fnext-runtime
FAIL: objc/execute/va_method.m execution, -O2 -fnext-runtime
FAIL: objc/execute/va_method.m execution, -O3 -fomit-frame-pointer - fnext-runtime
FAIL: objc/execute/va_method.m execution, -O3 -fomit-frame-pointer - funroll-loops -fnext-runtime
FAIL: objc/execute/va_method.m execution, -O3 -fomit-frame-pointer - funroll-all-loops -finline-functions -fnext-runtime
FAIL: objc/execute/va_method.m execution, -O3 -g -fnext-runtime
FAIL: objc/execute/va_method.m execution, -Os -fnext-runtime
FAIL: objc.dg/bitfield-1.m (test for excess errors)
WARNING: objc.dg/bitfield-1.m compilation failed to produce executable
FAIL: objc.dg/bitfield-3.m (test for excess errors)
FAIL: objc.dg/bitfield-5.m (test for excess errors)
FAIL: objc.dg/call-super-1.m (test for excess errors)
WARNING: objc.dg/call-super-1.m compilation failed to produce executable
FAIL: objc.dg/call-super-3.m (test for excess errors)
WARNING: objc.dg/call-super-3.m compilation failed to produce executable
FAIL: objc.dg/category-1.m (test for excess errors)
WARNING: objc.dg/category-1.m compilation failed to produce executable
FAIL: objc.dg/const-str-10.m (test for excess errors)
FAIL: objc.dg/const-str-10.m scan-assembler .long\ \t__NSConstantStringClassReference\\n\\t.long\\t.*\\n\\t.long\\t5\\n\ \t.data
FAIL: objc.dg/const-str-11.m (test for excess errors)
FAIL: objc.dg/const-str-11.m scan-assembler .long\ \t__XStrClassReference\\n\\t.long\\t.*\\n\\t.long\\t5\\n\\t.data
FAIL: objc.dg/const-str-3.m (test for excess errors)
WARNING: objc.dg/const-str-3.m compilation failed to produce executable
FAIL: objc.dg/const-str-7.m (test for excess errors)
WARNING: objc.dg/const-str-7.m compilation failed to produce executable
FAIL: objc.dg/const-str-8.m (test for excess errors)
WARNING: objc.dg/const-str-8.m compilation failed to produce executable
FAIL: objc.dg/const-str-9.m (test for excess errors)
FAIL: objc.dg/const-str-9.m scan-assembler .long\ \t__NSConstantStringClassReference\\n\\t.long\\t.*\\n\\t.long\\t5\\n\ \t.data
FAIL: objc.dg/defs.m (test for excess errors)
WARNING: objc.dg/defs.m compilation failed to produce executable
FAIL: objc.dg/desig-init-1.m (test for excess errors)
WARNING: objc.dg/desig-init-1.m compilation failed to produce executable
FAIL: objc.dg/encode-2.m (test for excess errors)
WARNING: objc.dg/encode-2.m compilation failed to produce executable
FAIL: objc.dg/encode-3.m (test for excess errors)
WARNING: objc.dg/encode-3.m compilation failed to produce executable
FAIL: objc.dg/encode-4.m (test for excess errors)
WARNING: objc.dg/encode-4.m compilation failed to produce executable
FAIL: objc.dg/encode-5.m (test for excess errors)
FAIL: objc.dg/fix-and-continue-1.m (test for excess errors)
WARNING: objc.dg/fix-and-continue-1.m compilation failed to produce executable
FAIL: objc.dg/func-ptr-1.m (test for excess errors)
WARNING: objc.dg/func-ptr-1.m compilation failed to produce executable
FAIL: objc.dg/func-ptr-2.m (test for excess errors)
WARNING: objc.dg/func-ptr-2.m compilation failed to produce executable
FAIL: objc.dg/headers.m (test for excess errors)
FAIL: objc.dg/layout-1.m (test for excess errors)
FAIL: objc.dg/lookup-1.m (test for excess errors)
WARNING: objc.dg/lookup-1.m compilation failed to produce executable
FAIL: objc.dg/method-10.m (test for excess errors)
WARNING: objc.dg/method-10.m compilation failed to produce executable
FAIL: objc.dg/method-13.m execution test
FAIL: objc.dg/method-3.m (test for excess errors)
WARNING: objc.dg/method-3.m compilation failed to produce executable
FAIL: objc.dg/method-6.m (test for excess errors)
FAIL: objc.dg/next-runtime-1.m scan-assembler L_OBJC_MODULES:\\n[ \\t] *.long\\t6\\n
FAIL: objc.dg/no-extra-load.m (test for excess errors)
ERROR: objc.dg/no-extra-load.m: error executing dg-final: couldn't open "no-extra-load.s": no such file or directory
UNRESOLVED: objc.dg/no-extra-load.m: error executing dg-final: couldn't open "no-extra-load.s": no such file or directory
FAIL: objc.dg/proto-lossage-3.m (test for excess errors)
WARNING: objc.dg/proto-lossage-3.m compilation failed to produce executable
FAIL: objc.dg/proto-qual-1.m (test for excess errors)
WARNING: objc.dg/proto-qual-1.m compilation failed to produce executable
FAIL: objc.dg/sizeof-1.m (test for excess errors)
WARNING: objc.dg/sizeof-1.m compilation failed to produce executable
FAIL: objc.dg/stret-1.m (test for excess errors)
WARNING: objc.dg/stret-1.m compilation failed to produce executable
FAIL: objc.dg/stret-2.m scan-assembler objc_msgSend_stret
FAIL: objc.dg/stret-2.m scan-assembler-not objc_msgSend[^_S]
FAIL: objc.dg/stret-2.m scan-assembler-not objc_msgSendSuper[^_]
FAIL: objc.dg/stubify-1.m (test for excess errors)
ERROR: objc.dg/stubify-1.m: error executing dg-final: couldn't open "stubify-1.s": no such file or directory
UNRESOLVED: objc.dg/stubify-1.m: error executing dg-final: couldn't open "stubify-1.s": no such file or directory
FAIL: objc.dg/stubify-2.m (test for excess errors)
FAIL: objc.dg/stubify-2.m scan-rtl-dump-not jump "symbol_ref.*"objc_msgSend"": dump file does not exist
FAIL: objc.dg/super-class-3.m (test for excess errors)
WARNING: objc.dg/super-class-3.m compilation failed to produce executable
FAIL: objc.dg/symtab-1.m scan-assembler L_OBJC_SYMBOLS.*:\\n\\t.long\ \t0\\n\\t.long\\t0\\n\\t.short\\t2\\n\\t.short\\t0\\n\\t.long\ \tL_OBJC_CLASS_Derived.*\\n\\t.long\\tL_OBJC_CLASS_Base.*\\n
FAIL: objc.dg/type-size-2.m (test for excess errors)
FAIL: objc.dg/type-size-2.m execution test
FAIL: objc.dg/va-meth-1.m (test for excess errors)
WARNING: objc.dg/va-meth-1.m compilation failed to produce executable
FAIL: objc.dg/zero-link-3.m (test for excess errors)
WARNING: objc.dg/zero-link-3.m compilation failed to produce executable
FAIL: objc.dg/special/unclaimed-category-1.m unclaimed-category-1a.o (test for excess errors)
FAIL: objc.dg/special/unclaimed-category-1.m unclaimed-category-1a.o execution test


=== objc Summary for unix/-m64 ===

# of expected passes		2066
# of unexpected failures	595
# of expected failures		7
# of unresolved testcases	470
# of unsupported tests		2

=== objc Summary ===

# of expected passes 5049
# of unexpected failures 691
# of expected failures 14
# of unresolved testcases 544
# of unsupported tests 4
/Volumes/ScratchCS/gcc-4-5-reg-build/gcc/xgcc version 4.5.0 20090423 (experimental) (GCC)


=== libffi tests ===


Running target unix/-m32


=== libffi Summary for unix/-m32 ===

# of expected passes		1389
# of unsupported tests		10

Running target unix/-m64

=== libffi Summary for unix/-m64 ===

# of expected passes		1389
# of unsupported tests		10

=== libffi Summary ===

# of expected passes		2778
# of unsupported tests		20
		=== libgomp tests ===


Running target unix/-m32


=== libgomp Summary for unix/-m32 ===

# of expected passes		2152
# of unsupported tests		128

Running target unix/-m64

=== libgomp Summary for unix/-m64 ===

# of expected passes		2152
# of unsupported tests		128

=== libgomp Summary ===

# of expected passes		4304
# of unsupported tests		256
		=== libjava tests ===


Running target unix/-m32


=== libjava Summary for unix/-m32 ===

# of expected passes 2574

Running target unix/-m64
FAIL: PR16923 run
FAIL: events output

=== libjava Summary for unix/-m64 ===

# of expected passes		2572
# of unexpected failures	2
# of untested testcases		1

=== libjava Summary ===

# of expected passes		5146
# of unexpected failures	2
# of untested testcases		1
		=== libstdc++ tests ===


Running target unix/-m32


=== libstdc++ Summary for unix/-m32 ===

# of expected passes		5845
# of expected failures		78
# of unsupported tests		456

Running target unix/-m64

=== libstdc++ Summary for unix/-m64 ===

# of expected passes		5849
# of expected failures		78
# of unsupported tests		454

=== libstdc++ Summary ===

# of expected passes		11694
# of expected failures		156
# of unsupported tests		910

Compiler version: 4.5.0 20090423 (experimental) (GCC)
Platform: i686-apple-darwin9
configure flags: --prefix=/Volumes/ScratchCS/gcc-4-5-install -- target=i686-apple-darwin9 --host=i686-apple-darwin9 --build=i686- apple-darwin9 --enable-languages=c,objc,c++,obj-c++,fortran,java -- with-libiconv-prefix=/usr --with-system-zlib --enable-version- specific-runtime-libs --program-suffix=-4.5.0 --enable-checking=yes



Index Nav: [Date Index] [Subject Index] [Author Index] [Thread Index]
Message Nav: [Date Prev] [Date Next] [Thread Prev] [Thread Next]