This is the mail archive of the gcc-testresults@gcc.gnu.org mailing list for the GCC project.


Index Nav: [Date Index] [Subject Index] [Author Index] [Thread Index]
Message Nav: [Date Prev] [Date Next] [Thread Prev] [Thread Next]
Other format: [Raw text]

Results for 4.4.0 20080609 (experimental) (GCC) testsuite on i386-unknown-freebsd6.2


LAST_UPDATED: 
Native configuration is i386-unknown-freebsd6.2

		=== g++ tests ===


Running target unix
FAIL: g++.dg/cdce3.C (test for excess errors)
WARNING: g++.dg/cdce3.C compilation failed to produce executable
FAIL: g++.dg/cdce3.C scan-tree-dump cdce "cdce3.C:68: note: function call is shrink-wrapped into error conditions.": dump file does not exist
FAIL: g++.dg/cdce3.C scan-tree-dump cdce "cdce3.C:69: note: function call is shrink-wrapped into error conditions.": dump file does not exist
FAIL: g++.dg/cdce3.C scan-tree-dump cdce "cdce3.C:70: note: function call is shrink-wrapped into error conditions.": dump file does not exist
FAIL: g++.dg/cdce3.C scan-tree-dump cdce "cdce3.C:71: note: function call is shrink-wrapped into error conditions.": dump file does not exist
FAIL: g++.dg/cdce3.C scan-tree-dump cdce "cdce3.C:72: note: function call is shrink-wrapped into error conditions.": dump file does not exist
FAIL: g++.dg/cdce3.C scan-tree-dump cdce "cdce3.C:73: note: function call is shrink-wrapped into error conditions.": dump file does not exist
FAIL: g++.dg/cdce3.C scan-tree-dump cdce "cdce3.C:74: note: function call is shrink-wrapped into error conditions.": dump file does not exist
FAIL: g++.dg/cdce3.C scan-tree-dump cdce "cdce3.C:75: note: function call is shrink-wrapped into error conditions.": dump file does not exist
FAIL: g++.dg/cdce3.C scan-tree-dump cdce "cdce3.C:76: note: function call is shrink-wrapped into error conditions.": dump file does not exist
FAIL: g++.dg/cdce3.C scan-tree-dump cdce "cdce3.C:77: note: function call is shrink-wrapped into error conditions.": dump file does not exist
FAIL: g++.dg/cdce3.C scan-tree-dump cdce "cdce3.C:78: note: function call is shrink-wrapped into error conditions.": dump file does not exist
FAIL: g++.dg/cdce3.C scan-tree-dump cdce "cdce3.C:79: note: function call is shrink-wrapped into error conditions.": dump file does not exist
FAIL: g++.dg/cdce3.C scan-tree-dump cdce "cdce3.C:80: note: function call is shrink-wrapped into error conditions.": dump file does not exist
FAIL: g++.dg/cdce3.C scan-tree-dump cdce "cdce3.C:81: note: function call is shrink-wrapped into error conditions.": dump file does not exist
FAIL: g++.dg/cdce3.C scan-tree-dump cdce "cdce3.C:82: note: function call is shrink-wrapped into error conditions.": dump file does not exist
FAIL: g++.dg/cdce3.C scan-tree-dump cdce "cdce3.C:83: note: function call is shrink-wrapped into error conditions.": dump file does not exist
FAIL: g++.dg/cpp/_Pragma1.C (test for excess errors)
FAIL: g++.dg/tree-ssa/pr19637.C scan-tree-dump-times dom1 "return 1;" 3
FAIL: g++.dg/warn/Wconversion-real.C  (test for warnings, line 25)
FAIL: g++.dg/warn/Wconversion-real.C  (test for warnings, line 26)
FAIL: g++.old-deja/g++.law/profile1.C (test for excess errors)

		=== g++ Summary ===

# of expected passes		17700
# of unexpected failures	22
# of expected failures		84
# of unsupported tests		113
/usr/nabil-files/pfeifer/OBJ-0609-2328/gcc/testsuite/g++/../../g++  version 4.4.0 20080609 (experimental) (GCC) 

		=== gcc tests ===


Running target unix
FAIL: gcc.c-torture/execute/conversion.c execution,  -O0 
FAIL: gcc.c-torture/execute/conversion.c execution,  -O1 
FAIL: gcc.c-torture/execute/ieee/copysign1.c execution,  -O0 
FAIL: gcc.c-torture/execute/ieee/copysign1.c execution,  -O3 -fomit-frame-pointer 
FAIL: gcc.c-torture/execute/ieee/copysign1.c execution,  -O3 -fomit-frame-pointer -funroll-loops 
FAIL: gcc.c-torture/execute/ieee/copysign1.c execution,  -O3 -fomit-frame-pointer -funroll-all-loops -finline-functions 
FAIL: gcc.c-torture/execute/ieee/copysign1.c execution,  -O3 -g 
FAIL: gcc.c-torture/execute/ieee/copysign2.c execution,  -O0 
FAIL: gcc.c-torture/execute/ieee/copysign2.c execution,  -O1 
FAIL: gcc.c-torture/execute/ieee/copysign2.c execution,  -O2 
FAIL: gcc.c-torture/execute/ieee/copysign2.c execution,  -O3 -fomit-frame-pointer 
FAIL: gcc.c-torture/execute/ieee/copysign2.c execution,  -O3 -fomit-frame-pointer -funroll-loops 
FAIL: gcc.c-torture/execute/ieee/copysign2.c execution,  -O3 -fomit-frame-pointer -funroll-all-loops -finline-functions 
FAIL: gcc.c-torture/execute/ieee/copysign2.c execution,  -O3 -g 
FAIL: gcc.c-torture/execute/ieee/copysign2.c execution,  -Os 
FAIL: gcc.dg/cpp/_Pragma6.c (test for excess errors)
FAIL: gcc.dg/20021014-1.c consider using \`-pg' instead of \`-p' with gprof(1) (test for errors, line )
FAIL: gcc.dg/20021014-1.c (test for excess errors)
FAIL: gcc.dg/Wconversion-real.c  (test for warnings, line 24)
FAIL: gcc.dg/Wconversion-real.c  (test for warnings, line 25)
FAIL: gcc.dg/builtins-20.c (test for excess errors)
FAIL: gcc.dg/builtins-57.c (test for excess errors)
FAIL: gcc.dg/builtins-58.c scan-assembler-not pow
FAIL: gcc.dg/builtins-59.c scan-tree-dump gimple "__builtin_cexpi"
FAIL: gcc.dg/builtins-59.c scan-tree-dump-not gimple "sincos"
FAIL: gcc.dg/builtins-61.c scan-tree-dump optimized "cexpi"
FAIL: gcc.dg/builtins-61.c scan-tree-dump optimized "sin"
FAIL: gcc.dg/builtins-61.c scan-tree-dump optimized "cos"
FAIL: gcc.dg/builtins-61.c scan-tree-dump optimized "return 0.0"
FAIL: gcc.dg/builtins-62.c scan-tree-dump-times optimized "cexpi" 3
FAIL: gcc.dg/c99-tgmath-2.c (test for excess errors)
ERROR: gcc.dg/c99-tgmath-2.c: error executing dg-final: couldn't open "c99-tgmath-2.s": no such file or directory
UNRESOLVED: gcc.dg/c99-tgmath-2.c: error executing dg-final: couldn't open "c99-tgmath-2.s": no such file or directory
FAIL: gcc.dg/c99-tgmath-3.c (test for excess errors)
ERROR: gcc.dg/c99-tgmath-3.c: error executing dg-final: couldn't open "c99-tgmath-3.s": no such file or directory
UNRESOLVED: gcc.dg/c99-tgmath-3.c: error executing dg-final: couldn't open "c99-tgmath-3.s": no such file or directory
FAIL: gcc.dg/c99-tgmath-4.c (test for excess errors)
ERROR: gcc.dg/c99-tgmath-4.c: error executing dg-final: couldn't open "c99-tgmath-4.s": no such file or directory
UNRESOLVED: gcc.dg/c99-tgmath-4.c: error executing dg-final: couldn't open "c99-tgmath-4.s": no such file or directory
FAIL: gcc.dg/wint_t-1.c (test for excess errors)
FAIL: largefile.c -O0 -g -I. (test for excess errors)
FAIL: gcc.dg/pch/largefile.c -O0 -g assembly comparison
WARNING: program timed out.
FAIL: largefile.c  -O0  -I. (test for excess errors)
FAIL: gcc.dg/pch/largefile.c  -O0  assembly comparison
WARNING: program timed out.
FAIL: largefile.c  -O1  -I. (test for excess errors)
FAIL: gcc.dg/pch/largefile.c  -O1  assembly comparison
WARNING: program timed out.
FAIL: largefile.c  -O2  -I. (test for excess errors)
FAIL: gcc.dg/pch/largefile.c  -O2  assembly comparison
WARNING: program timed out.
FAIL: largefile.c  -O3 -fomit-frame-pointer  -I. (test for excess errors)
FAIL: gcc.dg/pch/largefile.c  -O3 -fomit-frame-pointer  assembly comparison
FAIL: largefile.c  -O3 -g  -I. (test for excess errors)
FAIL: gcc.dg/pch/largefile.c  -O3 -g  assembly comparison
WARNING: program timed out.
FAIL: largefile.c  -Os  -I. (test for excess errors)
FAIL: gcc.dg/pch/largefile.c  -Os  assembly comparison
FAIL: gcc.dg/torture/builtin-convert-1.c  -O1  (test for excess errors)
FAIL: gcc.dg/torture/builtin-convert-1.c  -O2  (test for excess errors)
FAIL: gcc.dg/torture/builtin-convert-1.c  -O3 -fomit-frame-pointer  (test for excess errors)
FAIL: gcc.dg/torture/builtin-convert-1.c  -O3 -g  (test for excess errors)
FAIL: gcc.dg/torture/builtin-convert-1.c  -Os  (test for excess errors)
FAIL: gcc.dg/torture/builtin-convert-2.c  -O1  (test for excess errors)
FAIL: gcc.dg/torture/builtin-convert-2.c  -O2  (test for excess errors)
FAIL: gcc.dg/torture/builtin-convert-2.c  -O3 -fomit-frame-pointer  (test for excess errors)
FAIL: gcc.dg/torture/builtin-convert-2.c  -O3 -g  (test for excess errors)
FAIL: gcc.dg/torture/builtin-convert-2.c  -Os  (test for excess errors)
FAIL: gcc.dg/torture/builtin-convert-3.c  -O1  (test for excess errors)
FAIL: gcc.dg/torture/builtin-convert-3.c  -O2  (test for excess errors)
FAIL: gcc.dg/torture/builtin-convert-3.c  -O3 -fomit-frame-pointer  (test for excess errors)
FAIL: gcc.dg/torture/builtin-convert-3.c  -O3 -g  (test for excess errors)
FAIL: gcc.dg/torture/builtin-convert-3.c  -Os  (test for excess errors)
FAIL: gcc.dg/torture/builtin-power-1.c  -O0  (test for excess errors)
FAIL: gcc.dg/torture/builtin-power-1.c  -O1  (test for excess errors)
FAIL: gcc.dg/torture/builtin-power-1.c  -O2  (test for excess errors)
FAIL: gcc.dg/torture/builtin-power-1.c  -O3 -fomit-frame-pointer  (test for excess errors)
FAIL: gcc.dg/torture/builtin-power-1.c  -O3 -g  (test for excess errors)
FAIL: gcc.dg/torture/builtin-power-1.c  -Os  (test for excess errors)
FAIL: gcc.dg/torture/fp-int-convert-float.c  -O0  execution test
FAIL: gcc.dg/torture/fp-int-convert-float.c  -O1  execution test
FAIL: gcc.dg/torture/fp-int-convert-float.c  -O2  execution test
FAIL: gcc.dg/torture/fp-int-convert-float.c  -O3 -fomit-frame-pointer  execution test
FAIL: gcc.dg/torture/fp-int-convert-float.c  -O3 -g  execution test
FAIL: gcc.dg/torture/fp-int-convert-float.c  -Os  execution test
FAIL: gcc.dg/torture/fp-int-convert-float80.c  -O0  execution test
FAIL: gcc.dg/torture/fp-int-convert-float80.c  -O1  execution test
FAIL: gcc.dg/torture/fp-int-convert-float80.c  -O2  execution test
FAIL: gcc.dg/torture/fp-int-convert-float80.c  -O3 -fomit-frame-pointer  execution test
FAIL: gcc.dg/torture/fp-int-convert-float80.c  -O3 -g  execution test
FAIL: gcc.dg/torture/fp-int-convert-float80.c  -Os  execution test
FAIL: gcc.dg/torture/fp-int-convert-long-double.c  -O0  execution test
FAIL: gcc.dg/torture/fp-int-convert-long-double.c  -O1  execution test
FAIL: gcc.dg/torture/fp-int-convert-long-double.c  -O2  execution test
FAIL: gcc.dg/torture/fp-int-convert-long-double.c  -O3 -fomit-frame-pointer  execution test
FAIL: gcc.dg/torture/fp-int-convert-long-double.c  -O3 -g  execution test
FAIL: gcc.dg/torture/fp-int-convert-long-double.c  -Os  execution test
XPASS: gcc.dg/tree-ssa/20040204-1.c scan-tree-dump-times optimized "link_error" 0
XPASS: gcc.dg/tree-ssa/loadpre1.c scan-tree-dump-times pre "Eliminated: 1" 1
FAIL: gcc.dg/tree-ssa/ltrans-1.c scan-tree-dump-times ltrans "converted loop nest to perfect loop nest" 1
FAIL: gcc.dg/tree-ssa/ltrans-1.c scan-tree-dump-times ltrans "transformed loop" 1
FAIL: gcc.dg/tree-ssa/ltrans-4.c scan-tree-dump-times ltrans "transformed loop" 1
FAIL: gcc.dg/tree-ssa/ltrans-5.c scan-tree-dump-times ltrans "transformed loop" 1
FAIL: gcc.dg/tree-ssa/ltrans-6.c scan-tree-dump-times ltrans "transformed loop" 1
FAIL: gcc.dg/tree-ssa/ltrans-8.c scan-tree-dump-times ltrans "transformed loop" 1

		=== gcc Summary ===

# of expected passes		48939
# of unexpected failures	93
# of unexpected successes	2
# of expected failures		172
# of unresolved testcases	3
# of unsupported tests		578
/usr/nabil-files/pfeifer/OBJ-0609-2328/gcc/xgcc  version 4.4.0 20080609 (experimental) (GCC) 

		=== gfortran tests ===


Running target unix
FAIL: gfortran.dg/array_constructor_24.f  -O3 -fomit-frame-pointer  execution test
FAIL: gfortran.dg/array_constructor_24.f  -O3 -fomit-frame-pointer -funroll-loops  execution test
FAIL: gfortran.dg/array_constructor_24.f  -O3 -fomit-frame-pointer -funroll-all-loops -finline-functions  execution test
FAIL: gfortran.dg/array_constructor_24.f  -O3 -g  execution test
FAIL: gfortran.dg/ltrans-7.f90  -O  scan-tree-dump-times ltrans "transformed loop" 1
FAIL: gfortran.dg/nint_2.f90  -O0  execution test

		=== gfortran Summary ===

# of expected passes		25948
# of unexpected failures	6
# of expected failures		16
# of unsupported tests		234
/usr/nabil-files/pfeifer/OBJ-0609-2328/gcc/testsuite/gfortran/../../gfortran  version 4.4.0 20080609 (experimental) (GCC) 

		=== objc tests ===


Running target unix

		=== objc Summary ===

# of expected passes		1814
# of expected failures		7
# of unsupported tests		24
/usr/nabil-files/pfeifer/OBJ-0609-2328/gcc/xgcc  version 4.4.0 20080609 (experimental) (GCC) 

		=== libgomp tests ===


Running target unix
FAIL: libgomp.c/appendix-a/a.15.1.c (test for excess errors)
WARNING: libgomp.c/appendix-a/a.15.1.c compilation failed to produce executable
FAIL: libgomp.c/appendix-a/a.16.1.c (test for excess errors)
WARNING: libgomp.c/appendix-a/a.16.1.c compilation failed to produce executable
FAIL: libgomp.c/appendix-a/a.18.1.c (test for excess errors)
WARNING: libgomp.c/appendix-a/a.18.1.c compilation failed to produce executable
FAIL: libgomp.c/appendix-a/a.19.1.c (test for excess errors)
WARNING: libgomp.c/appendix-a/a.19.1.c compilation failed to produce executable
FAIL: libgomp.c/appendix-a/a.2.1.c (test for excess errors)
WARNING: libgomp.c/appendix-a/a.2.1.c compilation failed to produce executable
FAIL: libgomp.c/appendix-a/a.21.1.c (test for excess errors)
WARNING: libgomp.c/appendix-a/a.21.1.c compilation failed to produce executable
FAIL: libgomp.c/appendix-a/a.26.1.c (test for excess errors)
WARNING: libgomp.c/appendix-a/a.26.1.c compilation failed to produce executable
FAIL: libgomp.c/appendix-a/a.29.1.c (test for excess errors)
WARNING: libgomp.c/appendix-a/a.29.1.c compilation failed to produce executable
FAIL: libgomp.c/appendix-a/a.3.1.c (test for excess errors)
WARNING: libgomp.c/appendix-a/a.3.1.c compilation failed to produce executable
FAIL: libgomp.c/appendix-a/a.36.1.c (test for excess errors)
WARNING: libgomp.c/appendix-a/a.36.1.c compilation failed to produce executable
FAIL: libgomp.c/appendix-a/a.39.1.c (test for excess errors)
WARNING: libgomp.c/appendix-a/a.39.1.c compilation failed to produce executable
FAIL: libgomp.c/appendix-a/a.4.1.c (test for excess errors)
WARNING: libgomp.c/appendix-a/a.4.1.c compilation failed to produce executable
FAIL: libgomp.c/appendix-a/a.5.1.c (test for excess errors)
WARNING: libgomp.c/appendix-a/a.5.1.c compilation failed to produce executable
FAIL: libgomp.c/atomic-1.c (test for excess errors)
WARNING: libgomp.c/atomic-1.c compilation failed to produce executable
FAIL: libgomp.c/atomic-10.c (test for excess errors)
WARNING: libgomp.c/atomic-10.c compilation failed to produce executable
FAIL: libgomp.c/atomic-2.c (test for excess errors)
WARNING: libgomp.c/atomic-2.c compilation failed to produce executable
FAIL: libgomp.c/atomic-3.c (test for excess errors)
WARNING: libgomp.c/atomic-3.c compilation failed to produce executable
FAIL: libgomp.c/atomic-4.c (test for excess errors)
WARNING: libgomp.c/atomic-4.c compilation failed to produce executable
FAIL: libgomp.c/atomic-5.c (test for excess errors)
WARNING: libgomp.c/atomic-5.c compilation failed to produce executable
FAIL: libgomp.c/atomic-6.c (test for excess errors)
WARNING: libgomp.c/atomic-6.c compilation failed to produce executable
FAIL: libgomp.c/autopar-1.c (test for excess errors)
WARNING: libgomp.c/autopar-1.c compilation failed to produce executable
FAIL: libgomp.c/barrier-1.c (test for excess errors)
WARNING: libgomp.c/barrier-1.c compilation failed to produce executable
FAIL: libgomp.c/collapse-1.c (test for excess errors)
WARNING: libgomp.c/collapse-1.c compilation failed to produce executable
FAIL: libgomp.c/collapse-2.c (test for excess errors)
WARNING: libgomp.c/collapse-2.c compilation failed to produce executable
FAIL: libgomp.c/collapse-3.c (test for excess errors)
WARNING: libgomp.c/collapse-3.c compilation failed to produce executable
FAIL: libgomp.c/critical-1.c (test for excess errors)
WARNING: libgomp.c/critical-1.c compilation failed to produce executable
FAIL: libgomp.c/critical-2.c (test for excess errors)
WARNING: libgomp.c/critical-2.c compilation failed to produce executable
FAIL: libgomp.c/icv-1.c (test for excess errors)
WARNING: libgomp.c/icv-1.c compilation failed to produce executable
FAIL: libgomp.c/lib-1.c (test for excess errors)
WARNING: libgomp.c/lib-1.c compilation failed to produce executable
FAIL: libgomp.c/lib-2.c (test for excess errors)
WARNING: libgomp.c/lib-2.c compilation failed to produce executable
FAIL: libgomp.c/lock-1.c (test for excess errors)
WARNING: libgomp.c/lock-1.c compilation failed to produce executable
FAIL: libgomp.c/lock-2.c (test for excess errors)
WARNING: libgomp.c/lock-2.c compilation failed to produce executable
FAIL: libgomp.c/loop-1.c (test for excess errors)
WARNING: libgomp.c/loop-1.c compilation failed to produce executable
FAIL: libgomp.c/loop-2.c (test for excess errors)
WARNING: libgomp.c/loop-2.c compilation failed to produce executable
FAIL: libgomp.c/loop-3.c (test for excess errors)
WARNING: libgomp.c/loop-3.c compilation failed to produce executable
FAIL: libgomp.c/loop-4.c (test for excess errors)
WARNING: libgomp.c/loop-4.c compilation failed to produce executable
FAIL: libgomp.c/loop-5.c (test for excess errors)
WARNING: libgomp.c/loop-5.c compilation failed to produce executable
FAIL: libgomp.c/loop-6.c (test for excess errors)
WARNING: libgomp.c/loop-6.c compilation failed to produce executable
FAIL: libgomp.c/loop-7.c (test for excess errors)
WARNING: libgomp.c/loop-7.c compilation failed to produce executable
FAIL: libgomp.c/loop-8.c (test for excess errors)
WARNING: libgomp.c/loop-8.c compilation failed to produce executable
FAIL: libgomp.c/loop-9.c (test for excess errors)
WARNING: libgomp.c/loop-9.c compilation failed to produce executable
FAIL: libgomp.c/nested-1.c (test for excess errors)
WARNING: libgomp.c/nested-1.c compilation failed to produce executable
FAIL: libgomp.c/nested-2.c (test for excess errors)
WARNING: libgomp.c/nested-2.c compilation failed to produce executable
FAIL: libgomp.c/nested-3.c (test for excess errors)
WARNING: libgomp.c/nested-3.c compilation failed to produce executable
FAIL: libgomp.c/nestedfn-1.c (test for excess errors)
WARNING: libgomp.c/nestedfn-1.c compilation failed to produce executable
FAIL: libgomp.c/nestedfn-2.c (test for excess errors)
WARNING: libgomp.c/nestedfn-2.c compilation failed to produce executable
FAIL: libgomp.c/nestedfn-3.c (test for excess errors)
WARNING: libgomp.c/nestedfn-3.c compilation failed to produce executable
FAIL: libgomp.c/nestedfn-4.c (test for excess errors)
WARNING: libgomp.c/nestedfn-4.c compilation failed to produce executable
FAIL: libgomp.c/nestedfn-5.c (test for excess errors)
WARNING: libgomp.c/nestedfn-5.c compilation failed to produce executable
FAIL: libgomp.c/nestedfn-6.c (test for excess errors)
WARNING: libgomp.c/nestedfn-6.c compilation failed to produce executable
FAIL: libgomp.c/omp-loop01.c (test for excess errors)
WARNING: libgomp.c/omp-loop01.c compilation failed to produce executable
FAIL: libgomp.c/omp-loop02.c (test for excess errors)
WARNING: libgomp.c/omp-loop02.c compilation failed to produce executable
FAIL: libgomp.c/omp-loop03.c (test for excess errors)
WARNING: libgomp.c/omp-loop03.c compilation failed to produce executable
FAIL: libgomp.c/omp-nested-1.c (test for excess errors)
WARNING: libgomp.c/omp-nested-1.c compilation failed to produce executable
FAIL: libgomp.c/omp-parallel-for.c (test for excess errors)
WARNING: libgomp.c/omp-parallel-for.c compilation failed to produce executable
FAIL: libgomp.c/omp-parallel-if.c (test for excess errors)
WARNING: libgomp.c/omp-parallel-if.c compilation failed to produce executable
FAIL: libgomp.c/omp-single-1.c (test for excess errors)
WARNING: libgomp.c/omp-single-1.c compilation failed to produce executable
FAIL: libgomp.c/omp-single-2.c (test for excess errors)
WARNING: libgomp.c/omp-single-2.c compilation failed to produce executable
FAIL: libgomp.c/omp-single-3.c (test for excess errors)
WARNING: libgomp.c/omp-single-3.c compilation failed to produce executable
FAIL: libgomp.c/omp_hello.c (test for excess errors)
WARNING: libgomp.c/omp_hello.c compilation failed to produce executable
FAIL: libgomp.c/omp_matvec.c (test for excess errors)
WARNING: libgomp.c/omp_matvec.c compilation failed to produce executable
FAIL: libgomp.c/omp_orphan.c (test for excess errors)
WARNING: libgomp.c/omp_orphan.c compilation failed to produce executable
FAIL: libgomp.c/omp_reduction.c (test for excess errors)
WARNING: libgomp.c/omp_reduction.c compilation failed to produce executable
FAIL: libgomp.c/omp_workshare1.c (test for excess errors)
WARNING: libgomp.c/omp_workshare1.c compilation failed to produce executable
FAIL: libgomp.c/omp_workshare2.c (test for excess errors)
WARNING: libgomp.c/omp_workshare2.c compilation failed to produce executable
FAIL: libgomp.c/omp_workshare4.c (test for excess errors)
WARNING: libgomp.c/omp_workshare4.c compilation failed to produce executable
FAIL: libgomp.c/ordered-1.c (test for excess errors)
WARNING: libgomp.c/ordered-1.c compilation failed to produce executable
FAIL: libgomp.c/ordered-2.c (test for excess errors)
WARNING: libgomp.c/ordered-2.c compilation failed to produce executable
FAIL: libgomp.c/ordered-3.c (test for excess errors)
WARNING: libgomp.c/ordered-3.c compilation failed to produce executable
FAIL: libgomp.c/parallel-1.c (test for excess errors)
WARNING: libgomp.c/parallel-1.c compilation failed to produce executable
FAIL: libgomp.c/pr26943-1.c (test for excess errors)
WARNING: libgomp.c/pr26943-1.c compilation failed to produce executable
FAIL: libgomp.c/pr26943-2.c (test for excess errors)
WARNING: libgomp.c/pr26943-2.c compilation failed to produce executable
FAIL: libgomp.c/pr26943-3.c (test for excess errors)
WARNING: libgomp.c/pr26943-3.c compilation failed to produce executable
FAIL: libgomp.c/pr26943-4.c (test for excess errors)
WARNING: libgomp.c/pr26943-4.c compilation failed to produce executable
FAIL: libgomp.c/pr29947-1.c (test for excess errors)
WARNING: libgomp.c/pr29947-1.c compilation failed to produce executable
FAIL: libgomp.c/pr29947-2.c (test for excess errors)
WARNING: libgomp.c/pr29947-2.c compilation failed to produce executable
FAIL: libgomp.c/pr30494.c (test for excess errors)
WARNING: libgomp.c/pr30494.c compilation failed to produce executable
FAIL: libgomp.c/pr32362-1.c (test for excess errors)
WARNING: libgomp.c/pr32362-1.c compilation failed to produce executable
FAIL: libgomp.c/pr32362-2.c (test for excess errors)
WARNING: libgomp.c/pr32362-2.c compilation failed to produce executable
FAIL: libgomp.c/pr32362-3.c (test for excess errors)
WARNING: libgomp.c/pr32362-3.c compilation failed to produce executable
FAIL: libgomp.c/pr32468.c (test for excess errors)
WARNING: libgomp.c/pr32468.c compilation failed to produce executable
FAIL: libgomp.c/pr33880.c (test for excess errors)
WARNING: libgomp.c/pr33880.c compilation failed to produce executable
FAIL: libgomp.c/pr34513.c (test for excess errors)
WARNING: libgomp.c/pr34513.c compilation failed to produce executable
FAIL: libgomp.c/pr35130.c (test for excess errors)
WARNING: libgomp.c/pr35130.c compilation failed to produce executable
FAIL: libgomp.c/pr35196.c (test for excess errors)
WARNING: libgomp.c/pr35196.c compilation failed to produce executable
FAIL: libgomp.c/pr35549.c (test for excess errors)
WARNING: libgomp.c/pr35549.c compilation failed to produce executable
FAIL: libgomp.c/pr35625.c (test for excess errors)
WARNING: libgomp.c/pr35625.c compilation failed to produce executable
FAIL: libgomp.c/private-1.c (test for excess errors)
WARNING: libgomp.c/private-1.c compilation failed to produce executable
FAIL: libgomp.c/reduction-1.c (test for excess errors)
WARNING: libgomp.c/reduction-1.c compilation failed to produce executable
FAIL: libgomp.c/reduction-2.c (test for excess errors)
WARNING: libgomp.c/reduction-2.c compilation failed to produce executable
FAIL: libgomp.c/reduction-3.c (test for excess errors)
WARNING: libgomp.c/reduction-3.c compilation failed to produce executable
FAIL: libgomp.c/reduction-4.c (test for excess errors)
WARNING: libgomp.c/reduction-4.c compilation failed to produce executable
FAIL: libgomp.c/sections-1.c (test for excess errors)
WARNING: libgomp.c/sections-1.c compilation failed to produce executable
FAIL: libgomp.c/shared-1.c (test for excess errors)
WARNING: libgomp.c/shared-1.c compilation failed to produce executable
FAIL: libgomp.c/shared-2.c (test for excess errors)
WARNING: libgomp.c/shared-2.c compilation failed to produce executable
FAIL: libgomp.c/shared-3.c (test for excess errors)
WARNING: libgomp.c/shared-3.c compilation failed to produce executable
FAIL: libgomp.c/single-1.c (test for excess errors)
WARNING: libgomp.c/single-1.c compilation failed to produce executable
FAIL: libgomp.c/single-2.c (test for excess errors)
WARNING: libgomp.c/single-2.c compilation failed to produce executable
FAIL: libgomp.c/sort-1.c (test for excess errors)
WARNING: libgomp.c/sort-1.c compilation failed to produce executable
FAIL: libgomp.c/task-1.c (test for excess errors)
WARNING: libgomp.c/task-1.c compilation failed to produce executable
FAIL: libgomp.c/task-2.c (test for excess errors)
WARNING: libgomp.c/task-2.c compilation failed to produce executable
FAIL: libgomp.c/task-3.c (test for excess errors)
WARNING: libgomp.c/task-3.c compilation failed to produce executable
FAIL: libgomp.c/task-4.c (test for excess errors)
WARNING: libgomp.c/task-4.c compilation failed to produce executable
FAIL: libgomp.c/vla-1.c (test for excess errors)
WARNING: libgomp.c/vla-1.c compilation failed to produce executable
FAIL: libgomp.c++/atomic-1.C  -O0  (test for excess errors)
WARNING: libgomp.c++/atomic-1.C  -O0  compilation failed to produce executable
FAIL: libgomp.c++/atomic-1.C  -O1  (test for excess errors)
WARNING: libgomp.c++/atomic-1.C  -O1  compilation failed to produce executable
FAIL: libgomp.c++/atomic-1.C  -O2  (test for excess errors)
WARNING: libgomp.c++/atomic-1.C  -O2  compilation failed to produce executable
FAIL: libgomp.c++/atomic-1.C  -O3 -fomit-frame-pointer  (test for excess errors)
WARNING: libgomp.c++/atomic-1.C  -O3 -fomit-frame-pointer  compilation failed to produce executable
FAIL: libgomp.c++/atomic-1.C  -O3 -fomit-frame-pointer -funroll-loops  (test for excess errors)
WARNING: libgomp.c++/atomic-1.C  -O3 -fomit-frame-pointer -funroll-loops  compilation failed to produce executable
FAIL: libgomp.c++/atomic-1.C  -O3 -fomit-frame-pointer -funroll-all-loops -finline-functions  (test for excess errors)
WARNING: libgomp.c++/atomic-1.C  -O3 -fomit-frame-pointer -funroll-all-loops -finline-functions  compilation failed to produce executable
FAIL: libgomp.c++/atomic-1.C  -O3 -g  (test for excess errors)
WARNING: libgomp.c++/atomic-1.C  -O3 -g  compilation failed to produce executable
FAIL: libgomp.c++/atomic-1.C  -Os  (test for excess errors)
WARNING: libgomp.c++/atomic-1.C  -Os  compilation failed to produce executable
FAIL: libgomp.c++/collapse-1.C  -O0  (test for excess errors)
WARNING: libgomp.c++/collapse-1.C  -O0  compilation failed to produce executable
FAIL: libgomp.c++/collapse-1.C  -O1  (test for excess errors)
WARNING: libgomp.c++/collapse-1.C  -O1  compilation failed to produce executable
FAIL: libgomp.c++/collapse-1.C  -O2  (test for excess errors)
WARNING: libgomp.c++/collapse-1.C  -O2  compilation failed to produce executable
FAIL: libgomp.c++/collapse-1.C  -O3 -fomit-frame-pointer  (test for excess errors)
WARNING: libgomp.c++/collapse-1.C  -O3 -fomit-frame-pointer  compilation failed to produce executable
FAIL: libgomp.c++/collapse-1.C  -O3 -fomit-frame-pointer -funroll-loops  (test for excess errors)
WARNING: libgomp.c++/collapse-1.C  -O3 -fomit-frame-pointer -funroll-loops  compilation failed to produce executable
FAIL: libgomp.c++/collapse-1.C  -O3 -fomit-frame-pointer -funroll-all-loops -finline-functions  (test for excess errors)
WARNING: libgomp.c++/collapse-1.C  -O3 -fomit-frame-pointer -funroll-all-loops -finline-functions  compilation failed to produce executable
FAIL: libgomp.c++/collapse-1.C  -O3 -g  (test for excess errors)
WARNING: libgomp.c++/collapse-1.C  -O3 -g  compilation failed to produce executable
FAIL: libgomp.c++/collapse-1.C  -Os  (test for excess errors)
WARNING: libgomp.c++/collapse-1.C  -Os  compilation failed to produce executable
FAIL: libgomp.c++/collapse-2.C  -O0  (test for excess errors)
WARNING: libgomp.c++/collapse-2.C  -O0  compilation failed to produce executable
FAIL: libgomp.c++/collapse-2.C  -O1  (test for excess errors)
WARNING: libgomp.c++/collapse-2.C  -O1  compilation failed to produce executable
FAIL: libgomp.c++/collapse-2.C  -O2  (test for excess errors)
WARNING: libgomp.c++/collapse-2.C  -O2  compilation failed to produce executable
FAIL: libgomp.c++/collapse-2.C  -O3 -fomit-frame-pointer  (test for excess errors)
WARNING: libgomp.c++/collapse-2.C  -O3 -fomit-frame-pointer  compilation failed to produce executable
FAIL: libgomp.c++/collapse-2.C  -O3 -fomit-frame-pointer -funroll-loops  (test for excess errors)
WARNING: libgomp.c++/collapse-2.C  -O3 -fomit-frame-pointer -funroll-loops  compilation failed to produce executable
FAIL: libgomp.c++/collapse-2.C  -O3 -fomit-frame-pointer -funroll-all-loops -finline-functions  (test for excess errors)
WARNING: libgomp.c++/collapse-2.C  -O3 -fomit-frame-pointer -funroll-all-loops -finline-functions  compilation failed to produce executable
FAIL: libgomp.c++/collapse-2.C  -O3 -g  (test for excess errors)
WARNING: libgomp.c++/collapse-2.C  -O3 -g  compilation failed to produce executable
FAIL: libgomp.c++/collapse-2.C  -Os  (test for excess errors)
WARNING: libgomp.c++/collapse-2.C  -Os  compilation failed to produce executable
FAIL: libgomp.c++/ctor-1.C  -O0  (test for excess errors)
WARNING: libgomp.c++/ctor-1.C  -O0  compilation failed to produce executable
FAIL: libgomp.c++/ctor-1.C  -O1  (test for excess errors)
WARNING: libgomp.c++/ctor-1.C  -O1  compilation failed to produce executable
FAIL: libgomp.c++/ctor-1.C  -O2  (test for excess errors)
WARNING: libgomp.c++/ctor-1.C  -O2  compilation failed to produce executable
FAIL: libgomp.c++/ctor-1.C  -O3 -fomit-frame-pointer  (test for excess errors)
WARNING: libgomp.c++/ctor-1.C  -O3 -fomit-frame-pointer  compilation failed to produce executable
FAIL: libgomp.c++/ctor-1.C  -O3 -fomit-frame-pointer -funroll-loops  (test for excess errors)
WARNING: libgomp.c++/ctor-1.C  -O3 -fomit-frame-pointer -funroll-loops  compilation failed to produce executable
FAIL: libgomp.c++/ctor-1.C  -O3 -fomit-frame-pointer -funroll-all-loops -finline-functions  (test for excess errors)
WARNING: libgomp.c++/ctor-1.C  -O3 -fomit-frame-pointer -funroll-all-loops -finline-functions  compilation failed to produce executable
FAIL: libgomp.c++/ctor-1.C  -O3 -g  (test for excess errors)
WARNING: libgomp.c++/ctor-1.C  -O3 -g  compilation failed to produce executable
FAIL: libgomp.c++/ctor-1.C  -Os  (test for excess errors)
WARNING: libgomp.c++/ctor-1.C  -Os  compilation failed to produce executable
FAIL: libgomp.c++/ctor-11.C  -O0  (test for excess errors)
WARNING: libgomp.c++/ctor-11.C  -O0  compilation failed to produce executable
FAIL: libgomp.c++/ctor-11.C  -O1  (test for excess errors)
WARNING: libgomp.c++/ctor-11.C  -O1  compilation failed to produce executable
FAIL: libgomp.c++/ctor-11.C  -O2  (test for excess errors)
WARNING: libgomp.c++/ctor-11.C  -O2  compilation failed to produce executable
FAIL: libgomp.c++/ctor-11.C  -O3 -fomit-frame-pointer  (test for excess errors)
WARNING: libgomp.c++/ctor-11.C  -O3 -fomit-frame-pointer  compilation failed to produce executable
FAIL: libgomp.c++/ctor-11.C  -O3 -fomit-frame-pointer -funroll-loops  (test for excess errors)
WARNING: libgomp.c++/ctor-11.C  -O3 -fomit-frame-pointer -funroll-loops  compilation failed to produce executable
FAIL: libgomp.c++/ctor-11.C  -O3 -fomit-frame-pointer -funroll-all-loops -finline-functions  (test for excess errors)
WARNING: libgomp.c++/ctor-11.C  -O3 -fomit-frame-pointer -funroll-all-loops -finline-functions  compilation failed to produce executable
FAIL: libgomp.c++/ctor-11.C  -O3 -g  (test for excess errors)
WARNING: libgomp.c++/ctor-11.C  -O3 -g  compilation failed to produce executable
FAIL: libgomp.c++/ctor-11.C  -Os  (test for excess errors)
WARNING: libgomp.c++/ctor-11.C  -Os  compilation failed to produce executable
FAIL: libgomp.c++/ctor-12.C  -O0  (test for excess errors)
WARNING: libgomp.c++/ctor-12.C  -O0  compilation failed to produce executable
FAIL: libgomp.c++/ctor-12.C  -O1  (test for excess errors)
WARNING: libgomp.c++/ctor-12.C  -O1  compilation failed to produce executable
FAIL: libgomp.c++/ctor-12.C  -O2  (test for excess errors)
WARNING: libgomp.c++/ctor-12.C  -O2  compilation failed to produce executable
FAIL: libgomp.c++/ctor-12.C  -O3 -fomit-frame-pointer  (test for excess errors)
WARNING: libgomp.c++/ctor-12.C  -O3 -fomit-frame-pointer  compilation failed to produce executable
FAIL: libgomp.c++/ctor-12.C  -O3 -fomit-frame-pointer -funroll-loops  (test for excess errors)
WARNING: libgomp.c++/ctor-12.C  -O3 -fomit-frame-pointer -funroll-loops  compilation failed to produce executable
FAIL: libgomp.c++/ctor-12.C  -O3 -fomit-frame-pointer -funroll-all-loops -finline-functions  (test for excess errors)
WARNING: libgomp.c++/ctor-12.C  -O3 -fomit-frame-pointer -funroll-all-loops -finline-functions  compilation failed to produce executable
FAIL: libgomp.c++/ctor-12.C  -O3 -g  (test for excess errors)
WARNING: libgomp.c++/ctor-12.C  -O3 -g  compilation failed to produce executable
FAIL: libgomp.c++/ctor-12.C  -Os  (test for excess errors)
WARNING: libgomp.c++/ctor-12.C  -Os  compilation failed to produce executable
FAIL: libgomp.c++/ctor-2.C  -O0  (test for excess errors)
WARNING: libgomp.c++/ctor-2.C  -O0  compilation failed to produce executable
FAIL: libgomp.c++/ctor-2.C  -O1  (test for excess errors)
WARNING: libgomp.c++/ctor-2.C  -O1  compilation failed to produce executable
FAIL: libgomp.c++/ctor-2.C  -O2  (test for excess errors)
WARNING: libgomp.c++/ctor-2.C  -O2  compilation failed to produce executable
FAIL: libgomp.c++/ctor-2.C  -O3 -fomit-frame-pointer  (test for excess errors)
WARNING: libgomp.c++/ctor-2.C  -O3 -fomit-frame-pointer  compilation failed to produce executable
FAIL: libgomp.c++/ctor-2.C  -O3 -fomit-frame-pointer -funroll-loops  (test for excess errors)
WARNING: libgomp.c++/ctor-2.C  -O3 -fomit-frame-pointer -funroll-loops  compilation failed to produce executable
FAIL: libgomp.c++/ctor-2.C  -O3 -fomit-frame-pointer -funroll-all-loops -finline-functions  (test for excess errors)
WARNING: libgomp.c++/ctor-2.C  -O3 -fomit-frame-pointer -funroll-all-loops -finline-functions  compilation failed to produce executable
FAIL: libgomp.c++/ctor-2.C  -O3 -g  (test for excess errors)
WARNING: libgomp.c++/ctor-2.C  -O3 -g  compilation failed to produce executable
FAIL: libgomp.c++/ctor-2.C  -Os  (test for excess errors)
WARNING: libgomp.c++/ctor-2.C  -Os  compilation failed to produce executable
FAIL: libgomp.c++/ctor-3.C  -O0  (test for excess errors)
WARNING: libgomp.c++/ctor-3.C  -O0  compilation failed to produce executable
FAIL: libgomp.c++/ctor-3.C  -O1  (test for excess errors)
WARNING: libgomp.c++/ctor-3.C  -O1  compilation failed to produce executable
FAIL: libgomp.c++/ctor-3.C  -O2  (test for excess errors)
WARNING: libgomp.c++/ctor-3.C  -O2  compilation failed to produce executable
FAIL: libgomp.c++/ctor-3.C  -O3 -fomit-frame-pointer  (test for excess errors)
WARNING: libgomp.c++/ctor-3.C  -O3 -fomit-frame-pointer  compilation failed to produce executable
FAIL: libgomp.c++/ctor-3.C  -O3 -fomit-frame-pointer -funroll-loops  (test for excess errors)
WARNING: libgomp.c++/ctor-3.C  -O3 -fomit-frame-pointer -funroll-loops  compilation failed to produce executable
FAIL: libgomp.c++/ctor-3.C  -O3 -fomit-frame-pointer -funroll-all-loops -finline-functions  (test for excess errors)
WARNING: libgomp.c++/ctor-3.C  -O3 -fomit-frame-pointer -funroll-all-loops -finline-functions  compilation failed to produce executable
FAIL: libgomp.c++/ctor-3.C  -O3 -g  (test for excess errors)
WARNING: libgomp.c++/ctor-3.C  -O3 -g  compilation failed to produce executable
FAIL: libgomp.c++/ctor-3.C  -Os  (test for excess errors)
WARNING: libgomp.c++/ctor-3.C  -Os  compilation failed to produce executable
FAIL: libgomp.c++/ctor-4.C  -O0  (test for excess errors)
WARNING: libgomp.c++/ctor-4.C  -O0  compilation failed to produce executable
FAIL: libgomp.c++/ctor-4.C  -O1  (test for excess errors)
WARNING: libgomp.c++/ctor-4.C  -O1  compilation failed to produce executable
FAIL: libgomp.c++/ctor-4.C  -O2  (test for excess errors)
WARNING: libgomp.c++/ctor-4.C  -O2  compilation failed to produce executable
FAIL: libgomp.c++/ctor-4.C  -O3 -fomit-frame-pointer  (test for excess errors)
WARNING: libgomp.c++/ctor-4.C  -O3 -fomit-frame-pointer  compilation failed to produce executable
FAIL: libgomp.c++/ctor-4.C  -O3 -fomit-frame-pointer -funroll-loops  (test for excess errors)
WARNING: libgomp.c++/ctor-4.C  -O3 -fomit-frame-pointer -funroll-loops  compilation failed to produce executable
FAIL: libgomp.c++/ctor-4.C  -O3 -fomit-frame-pointer -funroll-all-loops -finline-functions  (test for excess errors)
WARNING: libgomp.c++/ctor-4.C  -O3 -fomit-frame-pointer -funroll-all-loops -finline-functions  compilation failed to produce executable
FAIL: libgomp.c++/ctor-4.C  -O3 -g  (test for excess errors)
WARNING: libgomp.c++/ctor-4.C  -O3 -g  compilation failed to produce executable
FAIL: libgomp.c++/ctor-4.C  -Os  (test for excess errors)
WARNING: libgomp.c++/ctor-4.C  -Os  compilation failed to produce executable
FAIL: libgomp.c++/ctor-6.C  -O0  (test for excess errors)
WARNING: libgomp.c++/ctor-6.C  -O0  compilation failed to produce executable
FAIL: libgomp.c++/ctor-6.C  -O1  (test for excess errors)
WARNING: libgomp.c++/ctor-6.C  -O1  compilation failed to produce executable
FAIL: libgomp.c++/ctor-6.C  -O2  (test for excess errors)
WARNING: libgomp.c++/ctor-6.C  -O2  compilation failed to produce executable
FAIL: libgomp.c++/ctor-6.C  -O3 -fomit-frame-pointer  (test for excess errors)
WARNING: libgomp.c++/ctor-6.C  -O3 -fomit-frame-pointer  compilation failed to produce executable
FAIL: libgomp.c++/ctor-6.C  -O3 -fomit-frame-pointer -funroll-loops  (test for excess errors)
WARNING: libgomp.c++/ctor-6.C  -O3 -fomit-frame-pointer -funroll-loops  compilation failed to produce executable
FAIL: libgomp.c++/ctor-6.C  -O3 -fomit-frame-pointer -funroll-all-loops -finline-functions  (test for excess errors)
WARNING: libgomp.c++/ctor-6.C  -O3 -fomit-frame-pointer -funroll-all-loops -finline-functions  compilation failed to produce executable
FAIL: libgomp.c++/ctor-6.C  -O3 -g  (test for excess errors)
WARNING: libgomp.c++/ctor-6.C  -O3 -g  compilation failed to produce executable
FAIL: libgomp.c++/ctor-6.C  -Os  (test for excess errors)
WARNING: libgomp.c++/ctor-6.C  -Os  compilation failed to produce executable
FAIL: libgomp.c++/ctor-7.C  -O0  (test for excess errors)
WARNING: libgomp.c++/ctor-7.C  -O0  compilation failed to produce executable
FAIL: libgomp.c++/ctor-7.C  -O1  (test for excess errors)
WARNING: libgomp.c++/ctor-7.C  -O1  compilation failed to produce executable
FAIL: libgomp.c++/ctor-7.C  -O2  (test for excess errors)
WARNING: libgomp.c++/ctor-7.C  -O2  compilation failed to produce executable
FAIL: libgomp.c++/ctor-7.C  -O3 -fomit-frame-pointer  (test for excess errors)
WARNING: libgomp.c++/ctor-7.C  -O3 -fomit-frame-pointer  compilation failed to produce executable
FAIL: libgomp.c++/ctor-7.C  -O3 -fomit-frame-pointer -funroll-loops  (test for excess errors)
WARNING: libgomp.c++/ctor-7.C  -O3 -fomit-frame-pointer -funroll-loops  compilation failed to produce executable
FAIL: libgomp.c++/ctor-7.C  -O3 -fomit-frame-pointer -funroll-all-loops -finline-functions  (test for excess errors)
WARNING: libgomp.c++/ctor-7.C  -O3 -fomit-frame-pointer -funroll-all-loops -finline-functions  compilation failed to produce executable
FAIL: libgomp.c++/ctor-7.C  -O3 -g  (test for excess errors)
WARNING: libgomp.c++/ctor-7.C  -O3 -g  compilation failed to produce executable
FAIL: libgomp.c++/ctor-7.C  -Os  (test for excess errors)
WARNING: libgomp.c++/ctor-7.C  -Os  compilation failed to produce executable
FAIL: libgomp.c++/for-1.C  -O0  (test for excess errors)
WARNING: libgomp.c++/for-1.C  -O0  compilation failed to produce executable
FAIL: libgomp.c++/for-1.C  -O1  (test for excess errors)
WARNING: libgomp.c++/for-1.C  -O1  compilation failed to produce executable
FAIL: libgomp.c++/for-1.C  -O2  (test for excess errors)
WARNING: libgomp.c++/for-1.C  -O2  compilation failed to produce executable
FAIL: libgomp.c++/for-1.C  -O3 -fomit-frame-pointer  (test for excess errors)
WARNING: libgomp.c++/for-1.C  -O3 -fomit-frame-pointer  compilation failed to produce executable
FAIL: libgomp.c++/for-1.C  -O3 -fomit-frame-pointer -funroll-loops  (test for excess errors)
WARNING: libgomp.c++/for-1.C  -O3 -fomit-frame-pointer -funroll-loops  compilation failed to produce executable
FAIL: libgomp.c++/for-1.C  -O3 -fomit-frame-pointer -funroll-all-loops -finline-functions  (test for excess errors)
WARNING: libgomp.c++/for-1.C  -O3 -fomit-frame-pointer -funroll-all-loops -finline-functions  compilation failed to produce executable
FAIL: libgomp.c++/for-1.C  -O3 -g  (test for excess errors)
WARNING: libgomp.c++/for-1.C  -O3 -g  compilation failed to produce executable
FAIL: libgomp.c++/for-1.C  -Os  (test for excess errors)
WARNING: libgomp.c++/for-1.C  -Os  compilation failed to produce executable
FAIL: libgomp.c++/for-2.C  -O0  (test for excess errors)
WARNING: libgomp.c++/for-2.C  -O0  compilation failed to produce executable
FAIL: libgomp.c++/for-2.C  -O1  (test for excess errors)
WARNING: libgomp.c++/for-2.C  -O1  compilation failed to produce executable
FAIL: libgomp.c++/for-2.C  -O2  (test for excess errors)
WARNING: libgomp.c++/for-2.C  -O2  compilation failed to produce executable
FAIL: libgomp.c++/for-2.C  -O3 -fomit-frame-pointer  (test for excess errors)
WARNING: libgomp.c++/for-2.C  -O3 -fomit-frame-pointer  compilation failed to produce executable
FAIL: libgomp.c++/for-2.C  -O3 -fomit-frame-pointer -funroll-loops  (test for excess errors)
WARNING: libgomp.c++/for-2.C  -O3 -fomit-frame-pointer -funroll-loops  compilation failed to produce executable
FAIL: libgomp.c++/for-2.C  -O3 -fomit-frame-pointer -funroll-all-loops -finline-functions  (test for excess errors)
WARNING: libgomp.c++/for-2.C  -O3 -fomit-frame-pointer -funroll-all-loops -finline-functions  compilation failed to produce executable
FAIL: libgomp.c++/for-2.C  -O3 -g  (test for excess errors)
WARNING: libgomp.c++/for-2.C  -O3 -g  compilation failed to produce executable
FAIL: libgomp.c++/for-2.C  -Os  (test for excess errors)
WARNING: libgomp.c++/for-2.C  -Os  compilation failed to produce executable
FAIL: libgomp.c++/for-3.C  -O0  (test for excess errors)
WARNING: libgomp.c++/for-3.C  -O0  compilation failed to produce executable
FAIL: libgomp.c++/for-3.C  -O1  (test for excess errors)
WARNING: libgomp.c++/for-3.C  -O1  compilation failed to produce executable
FAIL: libgomp.c++/for-3.C  -O2  (test for excess errors)
WARNING: libgomp.c++/for-3.C  -O2  compilation failed to produce executable
FAIL: libgomp.c++/for-3.C  -O3 -fomit-frame-pointer  (test for excess errors)
WARNING: libgomp.c++/for-3.C  -O3 -fomit-frame-pointer  compilation failed to produce executable
FAIL: libgomp.c++/for-3.C  -O3 -fomit-frame-pointer -funroll-loops  (test for excess errors)
WARNING: libgomp.c++/for-3.C  -O3 -fomit-frame-pointer -funroll-loops  compilation failed to produce executable
FAIL: libgomp.c++/for-3.C  -O3 -fomit-frame-pointer -funroll-all-loops -finline-functions  (test for excess errors)
WARNING: libgomp.c++/for-3.C  -O3 -fomit-frame-pointer -funroll-all-loops -finline-functions  compilation failed to produce executable
FAIL: libgomp.c++/for-3.C  -O3 -g  (test for excess errors)
WARNING: libgomp.c++/for-3.C  -O3 -g  compilation failed to produce executable
FAIL: libgomp.c++/for-3.C  -Os  (test for excess errors)
WARNING: libgomp.c++/for-3.C  -Os  compilation failed to produce executable
FAIL: libgomp.c++/for-4.C  -O0  (test for excess errors)
WARNING: libgomp.c++/for-4.C  -O0  compilation failed to produce executable
FAIL: libgomp.c++/for-4.C  -O1  (test for excess errors)
WARNING: libgomp.c++/for-4.C  -O1  compilation failed to produce executable
FAIL: libgomp.c++/for-4.C  -O2  (test for excess errors)
WARNING: libgomp.c++/for-4.C  -O2  compilation failed to produce executable
FAIL: libgomp.c++/for-4.C  -O3 -fomit-frame-pointer  (test for excess errors)
WARNING: libgomp.c++/for-4.C  -O3 -fomit-frame-pointer  compilation failed to produce executable
FAIL: libgomp.c++/for-4.C  -O3 -fomit-frame-pointer -funroll-loops  (test for excess errors)
WARNING: libgomp.c++/for-4.C  -O3 -fomit-frame-pointer -funroll-loops  compilation failed to produce executable
FAIL: libgomp.c++/for-4.C  -O3 -fomit-frame-pointer -funroll-all-loops -finline-functions  (test for excess errors)
WARNING: libgomp.c++/for-4.C  -O3 -fomit-frame-pointer -funroll-all-loops -finline-functions  compilation failed to produce executable
FAIL: libgomp.c++/for-4.C  -O3 -g  (test for excess errors)
WARNING: libgomp.c++/for-4.C  -O3 -g  compilation failed to produce executable
FAIL: libgomp.c++/for-4.C  -Os  (test for excess errors)
WARNING: libgomp.c++/for-4.C  -Os  compilation failed to produce executable
FAIL: libgomp.c++/for-5.C  -O0  (test for excess errors)
WARNING: libgomp.c++/for-5.C  -O0  compilation failed to produce executable
FAIL: libgomp.c++/for-5.C  -O1  (test for excess errors)
WARNING: libgomp.c++/for-5.C  -O1  compilation failed to produce executable
FAIL: libgomp.c++/for-5.C  -O2  (test for excess errors)
WARNING: libgomp.c++/for-5.C  -O2  compilation failed to produce executable
FAIL: libgomp.c++/for-5.C  -O3 -fomit-frame-pointer  (test for excess errors)
WARNING: libgomp.c++/for-5.C  -O3 -fomit-frame-pointer  compilation failed to produce executable
FAIL: libgomp.c++/for-5.C  -O3 -fomit-frame-pointer -funroll-loops  (test for excess errors)
WARNING: libgomp.c++/for-5.C  -O3 -fomit-frame-pointer -funroll-loops  compilation failed to produce executable
FAIL: libgomp.c++/for-5.C  -O3 -fomit-frame-pointer -funroll-all-loops -finline-functions  (test for excess errors)
WARNING: libgomp.c++/for-5.C  -O3 -fomit-frame-pointer -funroll-all-loops -finline-functions  compilation failed to produce executable
FAIL: libgomp.c++/for-5.C  -O3 -g  (test for excess errors)
WARNING: libgomp.c++/for-5.C  -O3 -g  compilation failed to produce executable
FAIL: libgomp.c++/for-5.C  -Os  (test for excess errors)
WARNING: libgomp.c++/for-5.C  -Os  compilation failed to produce executable
FAIL: libgomp.c++/loop-1.C  -O  (test for excess errors)
WARNING: libgomp.c++/loop-1.C  -O  compilation failed to produce executable
FAIL: libgomp.c++/loop-10.C  -O0  (test for excess errors)
WARNING: libgomp.c++/loop-10.C  -O0  compilation failed to produce executable
FAIL: libgomp.c++/loop-10.C  -O1  (test for excess errors)
WARNING: libgomp.c++/loop-10.C  -O1  compilation failed to produce executable
FAIL: libgomp.c++/loop-10.C  -O2  (test for excess errors)
WARNING: libgomp.c++/loop-10.C  -O2  compilation failed to produce executable
FAIL: libgomp.c++/loop-10.C  -O3 -fomit-frame-pointer  (test for excess errors)
WARNING: libgomp.c++/loop-10.C  -O3 -fomit-frame-pointer  compilation failed to produce executable
FAIL: libgomp.c++/loop-10.C  -O3 -fomit-frame-pointer -funroll-loops  (test for excess errors)
WARNING: libgomp.c++/loop-10.C  -O3 -fomit-frame-pointer -funroll-loops  compilation failed to produce executable
FAIL: libgomp.c++/loop-10.C  -O3 -fomit-frame-pointer -funroll-all-loops -finline-functions  (test for excess errors)
WARNING: libgomp.c++/loop-10.C  -O3 -fomit-frame-pointer -funroll-all-loops -finline-functions  compilation failed to produce executable
FAIL: libgomp.c++/loop-10.C  -O3 -g  (test for excess errors)
WARNING: libgomp.c++/loop-10.C  -O3 -g  compilation failed to produce executable
FAIL: libgomp.c++/loop-10.C  -Os  (test for excess errors)
WARNING: libgomp.c++/loop-10.C  -Os  compilation failed to produce executable
FAIL: libgomp.c++/loop-2.C  -O  (test for excess errors)
WARNING: libgomp.c++/loop-2.C  -O  compilation failed to produce executable
FAIL: libgomp.c++/loop-3.C  -O  (test for excess errors)
WARNING: libgomp.c++/loop-3.C  -O  compilation failed to produce executable
FAIL: libgomp.c++/loop-4.C  -O  (test for excess errors)
WARNING: libgomp.c++/loop-4.C  -O  compilation failed to produce executable
FAIL: libgomp.c++/loop-5.C  -O  (test for excess errors)
WARNING: libgomp.c++/loop-5.C  -O  compilation failed to produce executable
FAIL: libgomp.c++/loop-6.C  -O0  (test for excess errors)
WARNING: libgomp.c++/loop-6.C  -O0  compilation failed to produce executable
FAIL: libgomp.c++/loop-6.C  -O1  (test for excess errors)
WARNING: libgomp.c++/loop-6.C  -O1  compilation failed to produce executable
FAIL: libgomp.c++/loop-6.C  -O2  (test for excess errors)
WARNING: libgomp.c++/loop-6.C  -O2  compilation failed to produce executable
FAIL: libgomp.c++/loop-6.C  -O3 -fomit-frame-pointer  (test for excess errors)
WARNING: libgomp.c++/loop-6.C  -O3 -fomit-frame-pointer  compilation failed to produce executable
FAIL: libgomp.c++/loop-6.C  -O3 -fomit-frame-pointer -funroll-loops  (test for excess errors)
WARNING: libgomp.c++/loop-6.C  -O3 -fomit-frame-pointer -funroll-loops  compilation failed to produce executable
FAIL: libgomp.c++/loop-6.C  -O3 -fomit-frame-pointer -funroll-all-loops -finline-functions  (test for excess errors)
WARNING: libgomp.c++/loop-6.C  -O3 -fomit-frame-pointer -funroll-all-loops -finline-functions  compilation failed to produce executable
FAIL: libgomp.c++/loop-6.C  -O3 -g  (test for excess errors)
WARNING: libgomp.c++/loop-6.C  -O3 -g  compilation failed to produce executable
FAIL: libgomp.c++/loop-6.C  -Os  (test for excess errors)
WARNING: libgomp.c++/loop-6.C  -Os  compilation failed to produce executable
FAIL: libgomp.c++/loop-7.C  -O0  (test for excess errors)
WARNING: libgomp.c++/loop-7.C  -O0  compilation failed to produce executable
FAIL: libgomp.c++/loop-7.C  -O1  (test for excess errors)
WARNING: libgomp.c++/loop-7.C  -O1  compilation failed to produce executable
FAIL: libgomp.c++/loop-7.C  -O2  (test for excess errors)
WARNING: libgomp.c++/loop-7.C  -O2  compilation failed to produce executable
FAIL: libgomp.c++/loop-7.C  -O3 -fomit-frame-pointer  (test for excess errors)
WARNING: libgomp.c++/loop-7.C  -O3 -fomit-frame-pointer  compilation failed to produce executable
FAIL: libgomp.c++/loop-7.C  -O3 -fomit-frame-pointer -funroll-loops  (test for excess errors)
WARNING: libgomp.c++/loop-7.C  -O3 -fomit-frame-pointer -funroll-loops  compilation failed to produce executable
FAIL: libgomp.c++/loop-7.C  -O3 -fomit-frame-pointer -funroll-all-loops -finline-functions  (test for excess errors)
WARNING: libgomp.c++/loop-7.C  -O3 -fomit-frame-pointer -funroll-all-loops -finline-functions  compilation failed to produce executable
FAIL: libgomp.c++/loop-7.C  -O3 -g  (test for excess errors)
WARNING: libgomp.c++/loop-7.C  -O3 -g  compilation failed to produce executable
FAIL: libgomp.c++/loop-7.C  -Os  (test for excess errors)
WARNING: libgomp.c++/loop-7.C  -Os  compilation failed to produce executable
FAIL: libgomp.c++/loop-8.C  -O  (test for excess errors)
WARNING: libgomp.c++/loop-8.C  -O  compilation failed to produce executable
FAIL: libgomp.c++/loop-9.C  -O0  (test for excess errors)
WARNING: libgomp.c++/loop-9.C  -O0  compilation failed to produce executable
FAIL: libgomp.c++/loop-9.C  -O1  (test for excess errors)
WARNING: libgomp.c++/loop-9.C  -O1  compilation failed to produce executable
FAIL: libgomp.c++/loop-9.C  -O2  (test for excess errors)
WARNING: libgomp.c++/loop-9.C  -O2  compilation failed to produce executable
FAIL: libgomp.c++/loop-9.C  -O3 -fomit-frame-pointer  (test for excess errors)
WARNING: libgomp.c++/loop-9.C  -O3 -fomit-frame-pointer  compilation failed to produce executable
FAIL: libgomp.c++/loop-9.C  -O3 -fomit-frame-pointer -funroll-loops  (test for excess errors)
WARNING: libgomp.c++/loop-9.C  -O3 -fomit-frame-pointer -funroll-loops  compilation failed to produce executable
FAIL: libgomp.c++/loop-9.C  -O3 -fomit-frame-pointer -funroll-all-loops -finline-functions  (test for excess errors)
WARNING: libgomp.c++/loop-9.C  -O3 -fomit-frame-pointer -funroll-all-loops -finline-functions  compilation failed to produce executable
FAIL: libgomp.c++/loop-9.C  -O3 -g  (test for excess errors)
WARNING: libgomp.c++/loop-9.C  -O3 -g  compilation failed to produce executable
FAIL: libgomp.c++/loop-9.C  -Os  (test for excess errors)
WARNING: libgomp.c++/loop-9.C  -Os  compilation failed to produce executable
FAIL: libgomp.c++/master-1.C  -O0  (test for excess errors)
WARNING: libgomp.c++/master-1.C  -O0  compilation failed to produce executable
FAIL: libgomp.c++/master-1.C  -O1  (test for excess errors)
WARNING: libgomp.c++/master-1.C  -O1  compilation failed to produce executable
FAIL: libgomp.c++/master-1.C  -O2  (test for excess errors)
WARNING: libgomp.c++/master-1.C  -O2  compilation failed to produce executable
FAIL: libgomp.c++/master-1.C  -O3 -fomit-frame-pointer  (test for excess errors)
WARNING: libgomp.c++/master-1.C  -O3 -fomit-frame-pointer  compilation failed to produce executable
FAIL: libgomp.c++/master-1.C  -O3 -fomit-frame-pointer -funroll-loops  (test for excess errors)
WARNING: libgomp.c++/master-1.C  -O3 -fomit-frame-pointer -funroll-loops  compilation failed to produce executable
FAIL: libgomp.c++/master-1.C  -O3 -fomit-frame-pointer -funroll-all-loops -finline-functions  (test for excess errors)
WARNING: libgomp.c++/master-1.C  -O3 -fomit-frame-pointer -funroll-all-loops -finline-functions  compilation failed to produce executable
FAIL: libgomp.c++/master-1.C  -O3 -g  (test for excess errors)
WARNING: libgomp.c++/master-1.C  -O3 -g  compilation failed to produce executable
FAIL: libgomp.c++/master-1.C  -Os  (test for excess errors)
WARNING: libgomp.c++/master-1.C  -Os  compilation failed to produce executable
FAIL: libgomp.c++/nested-1.C  -O0  (test for excess errors)
WARNING: libgomp.c++/nested-1.C  -O0  compilation failed to produce executable
FAIL: libgomp.c++/nested-1.C  -O1  (test for excess errors)
WARNING: libgomp.c++/nested-1.C  -O1  compilation failed to produce executable
FAIL: libgomp.c++/nested-1.C  -O2  (test for excess errors)
WARNING: libgomp.c++/nested-1.C  -O2  compilation failed to produce executable
FAIL: libgomp.c++/nested-1.C  -O3 -fomit-frame-pointer  (test for excess errors)
WARNING: libgomp.c++/nested-1.C  -O3 -fomit-frame-pointer  compilation failed to produce executable
FAIL: libgomp.c++/nested-1.C  -O3 -fomit-frame-pointer -funroll-loops  (test for excess errors)
WARNING: libgomp.c++/nested-1.C  -O3 -fomit-frame-pointer -funroll-loops  compilation failed to produce executable
FAIL: libgomp.c++/nested-1.C  -O3 -fomit-frame-pointer -funroll-all-loops -finline-functions  (test for excess errors)
WARNING: libgomp.c++/nested-1.C  -O3 -fomit-frame-pointer -funroll-all-loops -finline-functions  compilation failed to produce executable
FAIL: libgomp.c++/nested-1.C  -O3 -g  (test for excess errors)
WARNING: libgomp.c++/nested-1.C  -O3 -g  compilation failed to produce executable
FAIL: libgomp.c++/nested-1.C  -Os  (test for excess errors)
WARNING: libgomp.c++/nested-1.C  -Os  compilation failed to produce executable
FAIL: libgomp.c++/parallel-1.C  -O  (test for excess errors)
WARNING: libgomp.c++/parallel-1.C  -O  compilation failed to produce executable
FAIL: libgomp.c++/pr26691.C  -O  (test for excess errors)
WARNING: libgomp.c++/pr26691.C  -O  compilation failed to produce executable
FAIL: libgomp.c++/pr26943.C  -O0  (test for excess errors)
WARNING: libgomp.c++/pr26943.C  -O0  compilation failed to produce executable
FAIL: libgomp.c++/pr26943.C  -O1  (test for excess errors)
WARNING: libgomp.c++/pr26943.C  -O1  compilation failed to produce executable
FAIL: libgomp.c++/pr26943.C  -O2  (test for excess errors)
WARNING: libgomp.c++/pr26943.C  -O2  compilation failed to produce executable
FAIL: libgomp.c++/pr26943.C  -O3 -fomit-frame-pointer  (test for excess errors)
WARNING: libgomp.c++/pr26943.C  -O3 -fomit-frame-pointer  compilation failed to produce executable
FAIL: libgomp.c++/pr26943.C  -O3 -fomit-frame-pointer -funroll-loops  (test for excess errors)
WARNING: libgomp.c++/pr26943.C  -O3 -fomit-frame-pointer -funroll-loops  compilation failed to produce executable
FAIL: libgomp.c++/pr26943.C  -O3 -fomit-frame-pointer -funroll-all-loops -finline-functions  (test for excess errors)
WARNING: libgomp.c++/pr26943.C  -O3 -fomit-frame-pointer -funroll-all-loops -finline-functions  compilation failed to produce executable
FAIL: libgomp.c++/pr26943.C  -O3 -g  (test for excess errors)
WARNING: libgomp.c++/pr26943.C  -O3 -g  compilation failed to produce executable
FAIL: libgomp.c++/pr26943.C  -Os  (test for excess errors)
WARNING: libgomp.c++/pr26943.C  -Os  compilation failed to produce executable
FAIL: libgomp.c++/pr27337.C  -O0  (test for excess errors)
WARNING: libgomp.c++/pr27337.C  -O0  compilation failed to produce executable
FAIL: libgomp.c++/pr27337.C  -O1  (test for excess errors)
WARNING: libgomp.c++/pr27337.C  -O1  compilation failed to produce executable
FAIL: libgomp.c++/pr27337.C  -O2  (test for excess errors)
WARNING: libgomp.c++/pr27337.C  -O2  compilation failed to produce executable
FAIL: libgomp.c++/pr27337.C  -O3 -fomit-frame-pointer  (test for excess errors)
WARNING: libgomp.c++/pr27337.C  -O3 -fomit-frame-pointer  compilation failed to produce executable
FAIL: libgomp.c++/pr27337.C  -O3 -fomit-frame-pointer -funroll-loops  (test for excess errors)
WARNING: libgomp.c++/pr27337.C  -O3 -fomit-frame-pointer -funroll-loops  compilation failed to produce executable
FAIL: libgomp.c++/pr27337.C  -O3 -fomit-frame-pointer -funroll-all-loops -finline-functions  (test for excess errors)
WARNING: libgomp.c++/pr27337.C  -O3 -fomit-frame-pointer -funroll-all-loops -finline-functions  compilation failed to produce executable
FAIL: libgomp.c++/pr27337.C  -O3 -g  (test for excess errors)
WARNING: libgomp.c++/pr27337.C  -O3 -g  compilation failed to produce executable
FAIL: libgomp.c++/pr27337.C  -Os  (test for excess errors)
WARNING: libgomp.c++/pr27337.C  -Os  compilation failed to produce executable
FAIL: libgomp.c++/pr30703.C  -O0  (test for excess errors)
WARNING: libgomp.c++/pr30703.C  -O0  compilation failed to produce executable
FAIL: libgomp.c++/pr30703.C  -O1  (test for excess errors)
WARNING: libgomp.c++/pr30703.C  -O1  compilation failed to produce executable
FAIL: libgomp.c++/pr30703.C  -O2  (test for excess errors)
WARNING: libgomp.c++/pr30703.C  -O2  compilation failed to produce executable
FAIL: libgomp.c++/pr30703.C  -O3 -fomit-frame-pointer  (test for excess errors)
WARNING: libgomp.c++/pr30703.C  -O3 -fomit-frame-pointer  compilation failed to produce executable
FAIL: libgomp.c++/pr30703.C  -O3 -fomit-frame-pointer -funroll-loops  (test for excess errors)
WARNING: libgomp.c++/pr30703.C  -O3 -fomit-frame-pointer -funroll-loops  compilation failed to produce executable
FAIL: libgomp.c++/pr30703.C  -O3 -fomit-frame-pointer -funroll-all-loops -finline-functions  (test for excess errors)
WARNING: libgomp.c++/pr30703.C  -O3 -fomit-frame-pointer -funroll-all-loops -finline-functions  compilation failed to produce executable
FAIL: libgomp.c++/pr30703.C  -O3 -g  (test for excess errors)
WARNING: libgomp.c++/pr30703.C  -O3 -g  compilation failed to produce executable
FAIL: libgomp.c++/pr30703.C  -Os  (test for excess errors)
WARNING: libgomp.c++/pr30703.C  -Os  compilation failed to produce executable
FAIL: libgomp.c++/pr34513.C  -O0  (test for excess errors)
WARNING: libgomp.c++/pr34513.C  -O0  compilation failed to produce executable
FAIL: libgomp.c++/pr34513.C  -O1  (test for excess errors)
WARNING: libgomp.c++/pr34513.C  -O1  compilation failed to produce executable
FAIL: libgomp.c++/pr34513.C  -O2  (test for excess errors)
WARNING: libgomp.c++/pr34513.C  -O2  compilation failed to produce executable
FAIL: libgomp.c++/pr34513.C  -O3 -fomit-frame-pointer  (test for excess errors)
WARNING: libgomp.c++/pr34513.C  -O3 -fomit-frame-pointer  compilation failed to produce executable
FAIL: libgomp.c++/pr34513.C  -O3 -fomit-frame-pointer -funroll-loops  (test for excess errors)
WARNING: libgomp.c++/pr34513.C  -O3 -fomit-frame-pointer -funroll-loops  compilation failed to produce executable
FAIL: libgomp.c++/pr34513.C  -O3 -fomit-frame-pointer -funroll-all-loops -finline-functions  (test for excess errors)
WARNING: libgomp.c++/pr34513.C  -O3 -fomit-frame-pointer -funroll-all-loops -finline-functions  compilation failed to produce executable
FAIL: libgomp.c++/pr34513.C  -O3 -g  (test for excess errors)
WARNING: libgomp.c++/pr34513.C  -O3 -g  compilation failed to produce executable
FAIL: libgomp.c++/pr34513.C  -Os  (test for excess errors)
WARNING: libgomp.c++/pr34513.C  -Os  compilation failed to produce executable
FAIL: libgomp.c++/pr35185.C  -O0  (test for excess errors)
WARNING: libgomp.c++/pr35185.C  -O0  compilation failed to produce executable
FAIL: libgomp.c++/pr35185.C  -O1  (test for excess errors)
WARNING: libgomp.c++/pr35185.C  -O1  compilation failed to produce executable
FAIL: libgomp.c++/pr35185.C  -O2  (test for excess errors)
WARNING: libgomp.c++/pr35185.C  -O2  compilation failed to produce executable
FAIL: libgomp.c++/pr35185.C  -O3 -fomit-frame-pointer  (test for excess errors)
WARNING: libgomp.c++/pr35185.C  -O3 -fomit-frame-pointer  compilation failed to produce executable
FAIL: libgomp.c++/pr35185.C  -O3 -fomit-frame-pointer -funroll-loops  (test for excess errors)
WARNING: libgomp.c++/pr35185.C  -O3 -fomit-frame-pointer -funroll-loops  compilation failed to produce executable
FAIL: libgomp.c++/pr35185.C  -O3 -fomit-frame-pointer -funroll-all-loops -finline-functions  (test for excess errors)
WARNING: libgomp.c++/pr35185.C  -O3 -fomit-frame-pointer -funroll-all-loops -finline-functions  compilation failed to produce executable
FAIL: libgomp.c++/pr35185.C  -O3 -g  (test for excess errors)
WARNING: libgomp.c++/pr35185.C  -O3 -g  compilation failed to produce executable
FAIL: libgomp.c++/pr35185.C  -Os  (test for excess errors)
WARNING: libgomp.c++/pr35185.C  -Os  compilation failed to produce executable
FAIL: libgomp.c++/reduction-1.C  -O  (test for excess errors)
WARNING: libgomp.c++/reduction-1.C  -O  compilation failed to produce executable
FAIL: libgomp.c++/reduction-2.C  -O  (test for excess errors)
WARNING: libgomp.c++/reduction-2.C  -O  compilation failed to produce executable
FAIL: libgomp.c++/reduction-3.C  -O  (test for excess errors)
WARNING: libgomp.c++/reduction-3.C  -O  compilation failed to produce executable
FAIL: libgomp.c++/sections-1.C  -O  (test for excess errors)
WARNING: libgomp.c++/sections-1.C  -O  compilation failed to produce executable
FAIL: libgomp.c++/shared-1.C  -O  (test for excess errors)
WARNING: libgomp.c++/shared-1.C  -O  compilation failed to produce executable
FAIL: libgomp.c++/shared-2.C  -O  (test for excess errors)
WARNING: libgomp.c++/shared-2.C  -O  compilation failed to produce executable
FAIL: libgomp.c++/single-1.C  -O  (test for excess errors)
WARNING: libgomp.c++/single-1.C  -O  compilation failed to produce executable
FAIL: libgomp.c++/single-2.C  -O  (test for excess errors)
WARNING: libgomp.c++/single-2.C  -O  compilation failed to produce executable
FAIL: libgomp.c++/single-3.C  -O  (test for excess errors)
WARNING: libgomp.c++/single-3.C  -O  compilation failed to produce executable
FAIL: libgomp.c++/task-1.C  -O  (test for excess errors)
WARNING: libgomp.c++/task-1.C  -O  compilation failed to produce executable
FAIL: libgomp.c++/task-2.C  -O0  (test for excess errors)
WARNING: libgomp.c++/task-2.C  -O0  compilation failed to produce executable
FAIL: libgomp.c++/task-2.C  -O1  (test for excess errors)
WARNING: libgomp.c++/task-2.C  -O1  compilation failed to produce executable
FAIL: libgomp.c++/task-2.C  -O2  (test for excess errors)
WARNING: libgomp.c++/task-2.C  -O2  compilation failed to produce executable
FAIL: libgomp.c++/task-2.C  -O3 -fomit-frame-pointer  (test for excess errors)
WARNING: libgomp.c++/task-2.C  -O3 -fomit-frame-pointer  compilation failed to produce executable
FAIL: libgomp.c++/task-2.C  -O3 -fomit-frame-pointer -funroll-loops  (test for excess errors)
WARNING: libgomp.c++/task-2.C  -O3 -fomit-frame-pointer -funroll-loops  compilation failed to produce executable
FAIL: libgomp.c++/task-2.C  -O3 -fomit-frame-pointer -funroll-all-loops -finline-functions  (test for excess errors)
WARNING: libgomp.c++/task-2.C  -O3 -fomit-frame-pointer -funroll-all-loops -finline-functions  compilation failed to produce executable
FAIL: libgomp.c++/task-2.C  -O3 -g  (test for excess errors)
WARNING: libgomp.c++/task-2.C  -O3 -g  compilation failed to produce executable
FAIL: libgomp.c++/task-2.C  -Os  (test for excess errors)
WARNING: libgomp.c++/task-2.C  -Os  compilation failed to produce executable
FAIL: libgomp.c++/task-3.C  -O0  (test for excess errors)
WARNING: libgomp.c++/task-3.C  -O0  compilation failed to produce executable
FAIL: libgomp.c++/task-3.C  -O1  (test for excess errors)
WARNING: libgomp.c++/task-3.C  -O1  compilation failed to produce executable
FAIL: libgomp.c++/task-3.C  -O2  (test for excess errors)
WARNING: libgomp.c++/task-3.C  -O2  compilation failed to produce executable
FAIL: libgomp.c++/task-3.C  -O3 -fomit-frame-pointer  (test for excess errors)
WARNING: libgomp.c++/task-3.C  -O3 -fomit-frame-pointer  compilation failed to produce executable
FAIL: libgomp.c++/task-3.C  -O3 -fomit-frame-pointer -funroll-loops  (test for excess errors)
WARNING: libgomp.c++/task-3.C  -O3 -fomit-frame-pointer -funroll-loops  compilation failed to produce executable
FAIL: libgomp.c++/task-3.C  -O3 -fomit-frame-pointer -funroll-all-loops -finline-functions  (test for excess errors)
WARNING: libgomp.c++/task-3.C  -O3 -fomit-frame-pointer -funroll-all-loops -finline-functions  compilation failed to produce executable
FAIL: libgomp.c++/task-3.C  -O3 -g  (test for excess errors)
WARNING: libgomp.c++/task-3.C  -O3 -g  compilation failed to produce executable
FAIL: libgomp.c++/task-3.C  -Os  (test for excess errors)
WARNING: libgomp.c++/task-3.C  -Os  compilation failed to produce executable
FAIL: libgomp.c++/task-4.C  -O  (test for excess errors)
WARNING: libgomp.c++/task-4.C  -O  compilation failed to produce executable
FAIL: libgomp.c++/task-5.C  -O0  (test for excess errors)
WARNING: libgomp.c++/task-5.C  -O0  compilation failed to produce executable
FAIL: libgomp.c++/task-5.C  -O1  (test for excess errors)
WARNING: libgomp.c++/task-5.C  -O1  compilation failed to produce executable
FAIL: libgomp.c++/task-5.C  -O2  (test for excess errors)
WARNING: libgomp.c++/task-5.C  -O2  compilation failed to produce executable
FAIL: libgomp.c++/task-5.C  -O3 -fomit-frame-pointer  (test for excess errors)
WARNING: libgomp.c++/task-5.C  -O3 -fomit-frame-pointer  compilation failed to produce executable
FAIL: libgomp.c++/task-5.C  -O3 -fomit-frame-pointer -funroll-loops  (test for excess errors)
WARNING: libgomp.c++/task-5.C  -O3 -fomit-frame-pointer -funroll-loops  compilation failed to produce executable
FAIL: libgomp.c++/task-5.C  -O3 -fomit-frame-pointer -funroll-all-loops -finline-functions  (test for excess errors)
WARNING: libgomp.c++/task-5.C  -O3 -fomit-frame-pointer -funroll-all-loops -finline-functions  compilation failed to produce executable
FAIL: libgomp.c++/task-5.C  -O3 -g  (test for excess errors)
WARNING: libgomp.c++/task-5.C  -O3 -g  compilation failed to produce executable
FAIL: libgomp.c++/task-5.C  -Os  (test for excess errors)
WARNING: libgomp.c++/task-5.C  -Os  compilation failed to produce executable
FAIL: libgomp.c++/task-6.C  -O  (test for excess errors)
WARNING: libgomp.c++/task-6.C  -O  compilation failed to produce executable
FAIL: libgomp.fortran/allocatable1.f90  -O0  (test for excess errors)
WARNING: libgomp.fortran/allocatable1.f90  -O0  compilation failed to produce executable
FAIL: libgomp.fortran/allocatable1.f90  -O1  (test for excess errors)
WARNING: libgomp.fortran/allocatable1.f90  -O1  compilation failed to produce executable
FAIL: libgomp.fortran/allocatable1.f90  -O2  (test for excess errors)
WARNING: libgomp.fortran/allocatable1.f90  -O2  compilation failed to produce executable
FAIL: libgomp.fortran/allocatable1.f90  -O3 -fomit-frame-pointer  (test for excess errors)
WARNING: libgomp.fortran/allocatable1.f90  -O3 -fomit-frame-pointer  compilation failed to produce executable
FAIL: libgomp.fortran/allocatable1.f90  -O3 -fomit-frame-pointer -funroll-loops  (test for excess errors)
WARNING: libgomp.fortran/allocatable1.f90  -O3 -fomit-frame-pointer -funroll-loops  compilation failed to produce executable
FAIL: libgomp.fortran/allocatable1.f90  -O3 -fomit-frame-pointer -funroll-all-loops -finline-functions  (test for excess errors)
WARNING: libgomp.fortran/allocatable1.f90  -O3 -fomit-frame-pointer -funroll-all-loops -finline-functions  compilation failed to produce executable
FAIL: libgomp.fortran/allocatable1.f90  -O3 -g  (test for excess errors)
WARNING: libgomp.fortran/allocatable1.f90  -O3 -g  compilation failed to produce executable
FAIL: libgomp.fortran/allocatable1.f90  -Os  (test for excess errors)
WARNING: libgomp.fortran/allocatable1.f90  -Os  compilation failed to produce executable
FAIL: libgomp.fortran/allocatable3.f90  -O0  (test for excess errors)
WARNING: libgomp.fortran/allocatable3.f90  -O0  compilation failed to produce executable
FAIL: libgomp.fortran/allocatable3.f90  -O1  (test for excess errors)
WARNING: libgomp.fortran/allocatable3.f90  -O1  compilation failed to produce executable
FAIL: libgomp.fortran/allocatable3.f90  -O2  (test for excess errors)
WARNING: libgomp.fortran/allocatable3.f90  -O2  compilation failed to produce executable
FAIL: libgomp.fortran/allocatable3.f90  -O3 -fomit-frame-pointer  (test for excess errors)
WARNING: libgomp.fortran/allocatable3.f90  -O3 -fomit-frame-pointer  compilation failed to produce executable
FAIL: libgomp.fortran/allocatable3.f90  -O3 -fomit-frame-pointer -funroll-loops  (test for excess errors)
WARNING: libgomp.fortran/allocatable3.f90  -O3 -fomit-frame-pointer -funroll-loops  compilation failed to produce executable
FAIL: libgomp.fortran/allocatable3.f90  -O3 -fomit-frame-pointer -funroll-all-loops -finline-functions  (test for excess errors)
WARNING: libgomp.fortran/allocatable3.f90  -O3 -fomit-frame-pointer -funroll-all-loops -finline-functions  compilation failed to produce executable
FAIL: libgomp.fortran/allocatable3.f90  -O3 -g  (test for excess errors)
WARNING: libgomp.fortran/allocatable3.f90  -O3 -g  compilation failed to produce executable
FAIL: libgomp.fortran/allocatable3.f90  -Os  (test for excess errors)
WARNING: libgomp.fortran/allocatable3.f90  -Os  compilation failed to produce executable
FAIL: libgomp.fortran/allocatable4.f90  -O0  (test for excess errors)
WARNING: libgomp.fortran/allocatable4.f90  -O0  compilation failed to produce executable
FAIL: libgomp.fortran/allocatable4.f90  -O1  (test for excess errors)
WARNING: libgomp.fortran/allocatable4.f90  -O1  compilation failed to produce executable
FAIL: libgomp.fortran/allocatable4.f90  -O2  (test for excess errors)
WARNING: libgomp.fortran/allocatable4.f90  -O2  compilation failed to produce executable
FAIL: libgomp.fortran/allocatable4.f90  -O3 -fomit-frame-pointer  (test for excess errors)
WARNING: libgomp.fortran/allocatable4.f90  -O3 -fomit-frame-pointer  compilation failed to produce executable
FAIL: libgomp.fortran/allocatable4.f90  -O3 -fomit-frame-pointer -funroll-loops  (test for excess errors)
WARNING: libgomp.fortran/allocatable4.f90  -O3 -fomit-frame-pointer -funroll-loops  compilation failed to produce executable
FAIL: libgomp.fortran/allocatable4.f90  -O3 -fomit-frame-pointer -funroll-all-loops -finline-functions  (test for excess errors)
WARNING: libgomp.fortran/allocatable4.f90  -O3 -fomit-frame-pointer -funroll-all-loops -finline-functions  compilation failed to produce executable
FAIL: libgomp.fortran/allocatable4.f90  -O3 -g  (test for excess errors)
WARNING: libgomp.fortran/allocatable4.f90  -O3 -g  compilation failed to produce executable
FAIL: libgomp.fortran/allocatable4.f90  -Os  (test for excess errors)
WARNING: libgomp.fortran/allocatable4.f90  -Os  compilation failed to produce executable
FAIL: libgomp.fortran/appendix-a/a.16.1.f90  -O0  (test for excess errors)
WARNING: libgomp.fortran/appendix-a/a.16.1.f90  -O0  compilation failed to produce executable
FAIL: libgomp.fortran/appendix-a/a.16.1.f90  -O1  (test for excess errors)
WARNING: libgomp.fortran/appendix-a/a.16.1.f90  -O1  compilation failed to produce executable
FAIL: libgomp.fortran/appendix-a/a.16.1.f90  -O2  (test for excess errors)
WARNING: libgomp.fortran/appendix-a/a.16.1.f90  -O2  compilation failed to produce executable
FAIL: libgomp.fortran/appendix-a/a.16.1.f90  -O3 -fomit-frame-pointer  (test for excess errors)
WARNING: libgomp.fortran/appendix-a/a.16.1.f90  -O3 -fomit-frame-pointer  compilation failed to produce executable
FAIL: libgomp.fortran/appendix-a/a.16.1.f90  -O3 -fomit-frame-pointer -funroll-loops  (test for excess errors)
WARNING: libgomp.fortran/appendix-a/a.16.1.f90  -O3 -fomit-frame-pointer -funroll-loops  compilation failed to produce executable
FAIL: libgomp.fortran/appendix-a/a.16.1.f90  -O3 -fomit-frame-pointer -funroll-all-loops -finline-functions  (test for excess errors)
WARNING: libgomp.fortran/appendix-a/a.16.1.f90  -O3 -fomit-frame-pointer -funroll-all-loops -finline-functions  compilation failed to produce executable
FAIL: libgomp.fortran/appendix-a/a.16.1.f90  -O3 -g  (test for excess errors)
WARNING: libgomp.fortran/appendix-a/a.16.1.f90  -O3 -g  compilation failed to produce executable
FAIL: libgomp.fortran/appendix-a/a.16.1.f90  -Os  (test for excess errors)
WARNING: libgomp.fortran/appendix-a/a.16.1.f90  -Os  compilation failed to produce executable
FAIL: libgomp.fortran/appendix-a/a.18.1.f90  -O0  (test for excess errors)
WARNING: libgomp.fortran/appendix-a/a.18.1.f90  -O0  compilation failed to produce executable
FAIL: libgomp.fortran/appendix-a/a.18.1.f90  -O1  (test for excess errors)
WARNING: libgomp.fortran/appendix-a/a.18.1.f90  -O1  compilation failed to produce executable
FAIL: libgomp.fortran/appendix-a/a.18.1.f90  -O2  (test for excess errors)
WARNING: libgomp.fortran/appendix-a/a.18.1.f90  -O2  compilation failed to produce executable
FAIL: libgomp.fortran/appendix-a/a.18.1.f90  -O3 -fomit-frame-pointer  (test for excess errors)
WARNING: libgomp.fortran/appendix-a/a.18.1.f90  -O3 -fomit-frame-pointer  compilation failed to produce executable
FAIL: libgomp.fortran/appendix-a/a.18.1.f90  -O3 -fomit-frame-pointer -funroll-loops  (test for excess errors)
WARNING: libgomp.fortran/appendix-a/a.18.1.f90  -O3 -fomit-frame-pointer -funroll-loops  compilation failed to produce executable
FAIL: libgomp.fortran/appendix-a/a.18.1.f90  -O3 -fomit-frame-pointer -funroll-all-loops -finline-functions  (test for excess errors)
WARNING: libgomp.fortran/appendix-a/a.18.1.f90  -O3 -fomit-frame-pointer -funroll-all-loops -finline-functions  compilation failed to produce executable
FAIL: libgomp.fortran/appendix-a/a.18.1.f90  -O3 -g  (test for excess errors)
WARNING: libgomp.fortran/appendix-a/a.18.1.f90  -O3 -g  compilation failed to produce executable
FAIL: libgomp.fortran/appendix-a/a.18.1.f90  -Os  (test for excess errors)
WARNING: libgomp.fortran/appendix-a/a.18.1.f90  -Os  compilation failed to produce executable
FAIL: libgomp.fortran/appendix-a/a.19.1.f90  -O0  (test for excess errors)
WARNING: libgomp.fortran/appendix-a/a.19.1.f90  -O0  compilation failed to produce executable
FAIL: libgomp.fortran/appendix-a/a.19.1.f90  -O1  (test for excess errors)
WARNING: libgomp.fortran/appendix-a/a.19.1.f90  -O1  compilation failed to produce executable
FAIL: libgomp.fortran/appendix-a/a.19.1.f90  -O2  (test for excess errors)
WARNING: libgomp.fortran/appendix-a/a.19.1.f90  -O2  compilation failed to produce executable
FAIL: libgomp.fortran/appendix-a/a.19.1.f90  -O3 -fomit-frame-pointer  (test for excess errors)
WARNING: libgomp.fortran/appendix-a/a.19.1.f90  -O3 -fomit-frame-pointer  compilation failed to produce executable
FAIL: libgomp.fortran/appendix-a/a.19.1.f90  -O3 -fomit-frame-pointer -funroll-loops  (test for excess errors)
WARNING: libgomp.fortran/appendix-a/a.19.1.f90  -O3 -fomit-frame-pointer -funroll-loops  compilation failed to produce executable
FAIL: libgomp.fortran/appendix-a/a.19.1.f90  -O3 -fomit-frame-pointer -funroll-all-loops -finline-functions  (test for excess errors)
WARNING: libgomp.fortran/appendix-a/a.19.1.f90  -O3 -fomit-frame-pointer -funroll-all-loops -finline-functions  compilation failed to produce executable
FAIL: libgomp.fortran/appendix-a/a.19.1.f90  -O3 -g  (test for excess errors)
WARNING: libgomp.fortran/appendix-a/a.19.1.f90  -O3 -g  compilation failed to produce executable
FAIL: libgomp.fortran/appendix-a/a.19.1.f90  -Os  (test for excess errors)
WARNING: libgomp.fortran/appendix-a/a.19.1.f90  -Os  compilation failed to produce executable
FAIL: libgomp.fortran/appendix-a/a.2.1.f90  -O0  (test for excess errors)
WARNING: libgomp.fortran/appendix-a/a.2.1.f90  -O0  compilation failed to produce executable
FAIL: libgomp.fortran/appendix-a/a.2.1.f90  -O1  (test for excess errors)
WARNING: libgomp.fortran/appendix-a/a.2.1.f90  -O1  compilation failed to produce executable
FAIL: libgomp.fortran/appendix-a/a.2.1.f90  -O2  (test for excess errors)
WARNING: libgomp.fortran/appendix-a/a.2.1.f90  -O2  compilation failed to produce executable
FAIL: libgomp.fortran/appendix-a/a.2.1.f90  -O3 -fomit-frame-pointer  (test for excess errors)
WARNING: libgomp.fortran/appendix-a/a.2.1.f90  -O3 -fomit-frame-pointer  compilation failed to produce executable
FAIL: libgomp.fortran/appendix-a/a.2.1.f90  -O3 -fomit-frame-pointer -funroll-loops  (test for excess errors)
WARNING: libgomp.fortran/appendix-a/a.2.1.f90  -O3 -fomit-frame-pointer -funroll-loops  compilation failed to produce executable
FAIL: libgomp.fortran/appendix-a/a.2.1.f90  -O3 -fomit-frame-pointer -funroll-all-loops -finline-functions  (test for excess errors)
WARNING: libgomp.fortran/appendix-a/a.2.1.f90  -O3 -fomit-frame-pointer -funroll-all-loops -finline-functions  compilation failed to produce executable
FAIL: libgomp.fortran/appendix-a/a.2.1.f90  -O3 -g  (test for excess errors)
WARNING: libgomp.fortran/appendix-a/a.2.1.f90  -O3 -g  compilation failed to produce executable
FAIL: libgomp.fortran/appendix-a/a.2.1.f90  -Os  (test for excess errors)
WARNING: libgomp.fortran/appendix-a/a.2.1.f90  -Os  compilation failed to produce executable
FAIL: libgomp.fortran/appendix-a/a.26.1.f90  -O0  (test for excess errors)
WARNING: libgomp.fortran/appendix-a/a.26.1.f90  -O0  compilation failed to produce executable
FAIL: libgomp.fortran/appendix-a/a.26.1.f90  -O1  (test for excess errors)
WARNING: libgomp.fortran/appendix-a/a.26.1.f90  -O1  compilation failed to produce executable
FAIL: libgomp.fortran/appendix-a/a.26.1.f90  -O2  (test for excess errors)
WARNING: libgomp.fortran/appendix-a/a.26.1.f90  -O2  compilation failed to produce executable
FAIL: libgomp.fortran/appendix-a/a.26.1.f90  -O3 -fomit-frame-pointer  (test for excess errors)
WARNING: libgomp.fortran/appendix-a/a.26.1.f90  -O3 -fomit-frame-pointer  compilation failed to produce executable
FAIL: libgomp.fortran/appendix-a/a.26.1.f90  -O3 -fomit-frame-pointer -funroll-loops  (test for excess errors)
WARNING: libgomp.fortran/appendix-a/a.26.1.f90  -O3 -fomit-frame-pointer -funroll-loops  compilation failed to produce executable
FAIL: libgomp.fortran/appendix-a/a.26.1.f90  -O3 -fomit-frame-pointer -funroll-all-loops -finline-functions  (test for excess errors)
WARNING: libgomp.fortran/appendix-a/a.26.1.f90  -O3 -fomit-frame-pointer -funroll-all-loops -finline-functions  compilation failed to produce executable
FAIL: libgomp.fortran/appendix-a/a.26.1.f90  -O3 -g  (test for excess errors)
WARNING: libgomp.fortran/appendix-a/a.26.1.f90  -O3 -g  compilation failed to produce executable
FAIL: libgomp.fortran/appendix-a/a.26.1.f90  -Os  (test for excess errors)
WARNING: libgomp.fortran/appendix-a/a.26.1.f90  -Os  compilation failed to produce executable
FAIL: libgomp.fortran/appendix-a/a.28.1.f90  -O0  (test for excess errors)
WARNING: libgomp.fortran/appendix-a/a.28.1.f90  -O0  compilation failed to produce executable
FAIL: libgomp.fortran/appendix-a/a.28.1.f90  -O1  (test for excess errors)
WARNING: libgomp.fortran/appendix-a/a.28.1.f90  -O1  compilation failed to produce executable
FAIL: libgomp.fortran/appendix-a/a.28.1.f90  -O2  (test for excess errors)
WARNING: libgomp.fortran/appendix-a/a.28.1.f90  -O2  compilation failed to produce executable
FAIL: libgomp.fortran/appendix-a/a.28.1.f90  -O3 -fomit-frame-pointer  (test for excess errors)
WARNING: libgomp.fortran/appendix-a/a.28.1.f90  -O3 -fomit-frame-pointer  compilation failed to produce executable
FAIL: libgomp.fortran/appendix-a/a.28.1.f90  -O3 -fomit-frame-pointer -funroll-loops  (test for excess errors)
WARNING: libgomp.fortran/appendix-a/a.28.1.f90  -O3 -fomit-frame-pointer -funroll-loops  compilation failed to produce executable
FAIL: libgomp.fortran/appendix-a/a.28.1.f90  -O3 -fomit-frame-pointer -funroll-all-loops -finline-functions  (test for excess errors)
WARNING: libgomp.fortran/appendix-a/a.28.1.f90  -O3 -fomit-frame-pointer -funroll-all-loops -finline-functions  compilation failed to produce executable
FAIL: libgomp.fortran/appendix-a/a.28.1.f90  -O3 -g  (test for excess errors)
WARNING: libgomp.fortran/appendix-a/a.28.1.f90  -O3 -g  compilation failed to produce executable
FAIL: libgomp.fortran/appendix-a/a.28.1.f90  -Os  (test for excess errors)
WARNING: libgomp.fortran/appendix-a/a.28.1.f90  -Os  compilation failed to produce executable
FAIL: libgomp.fortran/appendix-a/a.28.2.f90  -O0  (test for excess errors)
WARNING: libgomp.fortran/appendix-a/a.28.2.f90  -O0  compilation failed to produce executable
FAIL: libgomp.fortran/appendix-a/a.28.2.f90  -O1  (test for excess errors)
WARNING: libgomp.fortran/appendix-a/a.28.2.f90  -O1  compilation failed to produce executable
FAIL: libgomp.fortran/appendix-a/a.28.2.f90  -O2  (test for excess errors)
WARNING: libgomp.fortran/appendix-a/a.28.2.f90  -O2  compilation failed to produce executable
FAIL: libgomp.fortran/appendix-a/a.28.2.f90  -O3 -fomit-frame-pointer  (test for excess errors)
WARNING: libgomp.fortran/appendix-a/a.28.2.f90  -O3 -fomit-frame-pointer  compilation failed to produce executable
FAIL: libgomp.fortran/appendix-a/a.28.2.f90  -O3 -fomit-frame-pointer -funroll-loops  (test for excess errors)
WARNING: libgomp.fortran/appendix-a/a.28.2.f90  -O3 -fomit-frame-pointer -funroll-loops  compilation failed to produce executable
FAIL: libgomp.fortran/appendix-a/a.28.2.f90  -O3 -fomit-frame-pointer -funroll-all-loops -finline-functions  (test for excess errors)
WARNING: libgomp.fortran/appendix-a/a.28.2.f90  -O3 -fomit-frame-pointer -funroll-all-loops -finline-functions  compilation failed to produce executable
FAIL: libgomp.fortran/appendix-a/a.28.2.f90  -O3 -g  (test for excess errors)
WARNING: libgomp.fortran/appendix-a/a.28.2.f90  -O3 -g  compilation failed to produce executable
FAIL: libgomp.fortran/appendix-a/a.28.2.f90  -Os  (test for excess errors)
WARNING: libgomp.fortran/appendix-a/a.28.2.f90  -Os  compilation failed to produce executable
FAIL: libgomp.fortran/appendix-a/a.28.3.f90  -O0  (test for excess errors)
WARNING: libgomp.fortran/appendix-a/a.28.3.f90  -O0  compilation failed to produce executable
FAIL: libgomp.fortran/appendix-a/a.28.3.f90  -O1  (test for excess errors)
WARNING: libgomp.fortran/appendix-a/a.28.3.f90  -O1  compilation failed to produce executable
FAIL: libgomp.fortran/appendix-a/a.28.3.f90  -O2  (test for excess errors)
WARNING: libgomp.fortran/appendix-a/a.28.3.f90  -O2  compilation failed to produce executable
FAIL: libgomp.fortran/appendix-a/a.28.3.f90  -O3 -fomit-frame-pointer  (test for excess errors)
WARNING: libgomp.fortran/appendix-a/a.28.3.f90  -O3 -fomit-frame-pointer  compilation failed to produce executable
FAIL: libgomp.fortran/appendix-a/a.28.3.f90  -O3 -fomit-frame-pointer -funroll-loops  (test for excess errors)
WARNING: libgomp.fortran/appendix-a/a.28.3.f90  -O3 -fomit-frame-pointer -funroll-loops  compilation failed to produce executable
FAIL: libgomp.fortran/appendix-a/a.28.3.f90  -O3 -fomit-frame-pointer -funroll-all-loops -finline-functions  (test for excess errors)
WARNING: libgomp.fortran/appendix-a/a.28.3.f90  -O3 -fomit-frame-pointer -funroll-all-loops -finline-functions  compilation failed to produce executable
FAIL: libgomp.fortran/appendix-a/a.28.3.f90  -O3 -g  (test for excess errors)
WARNING: libgomp.fortran/appendix-a/a.28.3.f90  -O3 -g  compilation failed to produce executable
FAIL: libgomp.fortran/appendix-a/a.28.3.f90  -Os  (test for excess errors)
WARNING: libgomp.fortran/appendix-a/a.28.3.f90  -Os  compilation failed to produce executable
FAIL: libgomp.fortran/appendix-a/a.28.4.f90  -O0  (test for excess errors)
WARNING: libgomp.fortran/appendix-a/a.28.4.f90  -O0  compilation failed to produce executable
FAIL: libgomp.fortran/appendix-a/a.28.4.f90  -O1  (test for excess errors)
WARNING: libgomp.fortran/appendix-a/a.28.4.f90  -O1  compilation failed to produce executable
FAIL: libgomp.fortran/appendix-a/a.28.4.f90  -O2  (test for excess errors)
WARNING: libgomp.fortran/appendix-a/a.28.4.f90  -O2  compilation failed to produce executable
FAIL: libgomp.fortran/appendix-a/a.28.4.f90  -O3 -fomit-frame-pointer  (test for excess errors)
WARNING: libgomp.fortran/appendix-a/a.28.4.f90  -O3 -fomit-frame-pointer  compilation failed to produce executable
FAIL: libgomp.fortran/appendix-a/a.28.4.f90  -O3 -fomit-frame-pointer -funroll-loops  (test for excess errors)
WARNING: libgomp.fortran/appendix-a/a.28.4.f90  -O3 -fomit-frame-pointer -funroll-loops  compilation failed to produce executable
FAIL: libgomp.fortran/appendix-a/a.28.4.f90  -O3 -fomit-frame-pointer -funroll-all-loops -finline-functions  (test for excess errors)
WARNING: libgomp.fortran/appendix-a/a.28.4.f90  -O3 -fomit-frame-pointer -funroll-all-loops -finline-functions  compilation failed to produce executable
FAIL: libgomp.fortran/appendix-a/a.28.4.f90  -O3 -g  (test for excess errors)
WARNING: libgomp.fortran/appendix-a/a.28.4.f90  -O3 -g  compilation failed to produce executable
FAIL: libgomp.fortran/appendix-a/a.28.4.f90  -Os  (test for excess errors)
WARNING: libgomp.fortran/appendix-a/a.28.4.f90  -Os  compilation failed to produce executable
FAIL: libgomp.fortran/appendix-a/a.3.1.f90  -O0  (test for excess errors)
WARNING: libgomp.fortran/appendix-a/a.3.1.f90  -O0  compilation failed to produce executable
FAIL: libgomp.fortran/appendix-a/a.3.1.f90  -O1  (test for excess errors)
WARNING: libgomp.fortran/appendix-a/a.3.1.f90  -O1  compilation failed to produce executable
FAIL: libgomp.fortran/appendix-a/a.3.1.f90  -O2  (test for excess errors)
WARNING: libgomp.fortran/appendix-a/a.3.1.f90  -O2  compilation failed to produce executable
FAIL: libgomp.fortran/appendix-a/a.3.1.f90  -O3 -fomit-frame-pointer  (test for excess errors)
WARNING: libgomp.fortran/appendix-a/a.3.1.f90  -O3 -fomit-frame-pointer  compilation failed to produce executable
FAIL: libgomp.fortran/appendix-a/a.3.1.f90  -O3 -fomit-frame-pointer -funroll-loops  (test for excess errors)
WARNING: libgomp.fortran/appendix-a/a.3.1.f90  -O3 -fomit-frame-pointer -funroll-loops  compilation failed to produce executable
FAIL: libgomp.fortran/appendix-a/a.3.1.f90  -O3 -fomit-frame-pointer -funroll-all-loops -finline-functions  (test for excess errors)
WARNING: libgomp.fortran/appendix-a/a.3.1.f90  -O3 -fomit-frame-pointer -funroll-all-loops -finline-functions  compilation failed to produce executable
FAIL: libgomp.fortran/appendix-a/a.3.1.f90  -O3 -g  (test for excess errors)
WARNING: libgomp.fortran/appendix-a/a.3.1.f90  -O3 -g  compilation failed to produce executable
FAIL: libgomp.fortran/appendix-a/a.3.1.f90  -Os  (test for excess errors)
WARNING: libgomp.fortran/appendix-a/a.3.1.f90  -Os  compilation failed to produce executable
FAIL: libgomp.fortran/appendix-a/a.31.4.f90  -O0  (test for excess errors)
WARNING: libgomp.fortran/appendix-a/a.31.4.f90  -O0  compilation failed to produce executable
FAIL: libgomp.fortran/appendix-a/a.31.4.f90  -O1  (test for excess errors)
WARNING: libgomp.fortran/appendix-a/a.31.4.f90  -O1  compilation failed to produce executable
FAIL: libgomp.fortran/appendix-a/a.31.4.f90  -O2  (test for excess errors)
WARNING: libgomp.fortran/appendix-a/a.31.4.f90  -O2  compilation failed to produce executable
FAIL: libgomp.fortran/appendix-a/a.31.4.f90  -O3 -fomit-frame-pointer  (test for excess errors)
WARNING: libgomp.fortran/appendix-a/a.31.4.f90  -O3 -fomit-frame-pointer  compilation failed to produce executable
FAIL: libgomp.fortran/appendix-a/a.31.4.f90  -O3 -fomit-frame-pointer -funroll-loops  (test for excess errors)
WARNING: libgomp.fortran/appendix-a/a.31.4.f90  -O3 -fomit-frame-pointer -funroll-loops  compilation failed to produce executable
FAIL: libgomp.fortran/appendix-a/a.31.4.f90  -O3 -fomit-frame-pointer -funroll-all-loops -finline-functions  (test for excess errors)
WARNING: libgomp.fortran/appendix-a/a.31.4.f90  -O3 -fomit-frame-pointer -funroll-all-loops -finline-functions  compilation failed to produce executable
FAIL: libgomp.fortran/appendix-a/a.31.4.f90  -O3 -g  (test for excess errors)
WARNING: libgomp.fortran/appendix-a/a.31.4.f90  -O3 -g  compilation failed to produce executable
FAIL: libgomp.fortran/appendix-a/a.31.4.f90  -Os  (test for excess errors)
WARNING: libgomp.fortran/appendix-a/a.31.4.f90  -Os  compilation failed to produce executable
FAIL: libgomp.fortran/appendix-a/a.31.5.f90  -O0  (test for excess errors)
WARNING: libgomp.fortran/appendix-a/a.31.5.f90  -O0  compilation failed to produce executable
FAIL: libgomp.fortran/appendix-a/a.31.5.f90  -O1  (test for excess errors)
WARNING: libgomp.fortran/appendix-a/a.31.5.f90  -O1  compilation failed to produce executable
FAIL: libgomp.fortran/appendix-a/a.31.5.f90  -O2  (test for excess errors)
WARNING: libgomp.fortran/appendix-a/a.31.5.f90  -O2  compilation failed to produce executable
FAIL: libgomp.fortran/appendix-a/a.31.5.f90  -O3 -fomit-frame-pointer  (test for excess errors)
WARNING: libgomp.fortran/appendix-a/a.31.5.f90  -O3 -fomit-frame-pointer  compilation failed to produce executable
FAIL: libgomp.fortran/appendix-a/a.31.5.f90  -O3 -fomit-frame-pointer -funroll-loops  (test for excess errors)
WARNING: libgomp.fortran/appendix-a/a.31.5.f90  -O3 -fomit-frame-pointer -funroll-loops  compilation failed to produce executable
FAIL: libgomp.fortran/appendix-a/a.31.5.f90  -O3 -fomit-frame-pointer -funroll-all-loops -finline-functions  (test for excess errors)
WARNING: libgomp.fortran/appendix-a/a.31.5.f90  -O3 -fomit-frame-pointer -funroll-all-loops -finline-functions  compilation failed to produce executable
FAIL: libgomp.fortran/appendix-a/a.31.5.f90  -O3 -g  (test for excess errors)
WARNING: libgomp.fortran/appendix-a/a.31.5.f90  -O3 -g  compilation failed to produce executable
FAIL: libgomp.fortran/appendix-a/a.31.5.f90  -Os  (test for excess errors)
WARNING: libgomp.fortran/appendix-a/a.31.5.f90  -Os  compilation failed to produce executable
FAIL: libgomp.fortran/appendix-a/a.39.1.f90  -O0  (test for excess errors)
WARNING: libgomp.fortran/appendix-a/a.39.1.f90  -O0  compilation failed to produce executable
FAIL: libgomp.fortran/appendix-a/a.39.1.f90  -O1  (test for excess errors)
WARNING: libgomp.fortran/appendix-a/a.39.1.f90  -O1  compilation failed to produce executable
FAIL: libgomp.fortran/appendix-a/a.39.1.f90  -O2  (test for excess errors)
WARNING: libgomp.fortran/appendix-a/a.39.1.f90  -O2  compilation failed to produce executable
FAIL: libgomp.fortran/appendix-a/a.39.1.f90  -O3 -fomit-frame-pointer  (test for excess errors)
WARNING: libgomp.fortran/appendix-a/a.39.1.f90  -O3 -fomit-frame-pointer  compilation failed to produce executable
FAIL: libgomp.fortran/appendix-a/a.39.1.f90  -O3 -fomit-frame-pointer -funroll-loops  (test for excess errors)
WARNING: libgomp.fortran/appendix-a/a.39.1.f90  -O3 -fomit-frame-pointer -funroll-loops  compilation failed to produce executable
FAIL: libgomp.fortran/appendix-a/a.39.1.f90  -O3 -fomit-frame-pointer -funroll-all-loops -finline-functions  (test for excess errors)
WARNING: libgomp.fortran/appendix-a/a.39.1.f90  -O3 -fomit-frame-pointer -funroll-all-loops -finline-functions  compilation failed to produce executable
FAIL: libgomp.fortran/appendix-a/a.39.1.f90  -O3 -g  (test for excess errors)
WARNING: libgomp.fortran/appendix-a/a.39.1.f90  -O3 -g  compilation failed to produce executable
FAIL: libgomp.fortran/appendix-a/a.39.1.f90  -Os  (test for excess errors)
WARNING: libgomp.fortran/appendix-a/a.39.1.f90  -Os  compilation failed to produce executable
FAIL: libgomp.fortran/appendix-a/a.4.1.f90  -O0  (test for excess errors)
WARNING: libgomp.fortran/appendix-a/a.4.1.f90  -O0  compilation failed to produce executable
FAIL: libgomp.fortran/appendix-a/a.4.1.f90  -O1  (test for excess errors)
WARNING: libgomp.fortran/appendix-a/a.4.1.f90  -O1  compilation failed to produce executable
FAIL: libgomp.fortran/appendix-a/a.4.1.f90  -O2  (test for excess errors)
WARNING: libgomp.fortran/appendix-a/a.4.1.f90  -O2  compilation failed to produce executable
FAIL: libgomp.fortran/appendix-a/a.4.1.f90  -O3 -fomit-frame-pointer  (test for excess errors)
WARNING: libgomp.fortran/appendix-a/a.4.1.f90  -O3 -fomit-frame-pointer  compilation failed to produce executable
FAIL: libgomp.fortran/appendix-a/a.4.1.f90  -O3 -fomit-frame-pointer -funroll-loops  (test for excess errors)
WARNING: libgomp.fortran/appendix-a/a.4.1.f90  -O3 -fomit-frame-pointer -funroll-loops  compilation failed to produce executable
FAIL: libgomp.fortran/appendix-a/a.4.1.f90  -O3 -fomit-frame-pointer -funroll-all-loops -finline-functions  (test for excess errors)
WARNING: libgomp.fortran/appendix-a/a.4.1.f90  -O3 -fomit-frame-pointer -funroll-all-loops -finline-functions  compilation failed to produce executable
FAIL: libgomp.fortran/appendix-a/a.4.1.f90  -O3 -g  (test for excess errors)
WARNING: libgomp.fortran/appendix-a/a.4.1.f90  -O3 -g  compilation failed to produce executable
FAIL: libgomp.fortran/appendix-a/a.4.1.f90  -Os  (test for excess errors)
WARNING: libgomp.fortran/appendix-a/a.4.1.f90  -Os  compilation failed to produce executable
FAIL: libgomp.fortran/appendix-a/a.5.1.f90  -O0  (test for excess errors)
WARNING: libgomp.fortran/appendix-a/a.5.1.f90  -O0  compilation failed to produce executable
FAIL: libgomp.fortran/appendix-a/a.5.1.f90  -O1  (test for excess errors)
WARNING: libgomp.fortran/appendix-a/a.5.1.f90  -O1  compilation failed to produce executable
FAIL: libgomp.fortran/appendix-a/a.5.1.f90  -O2  (test for excess errors)
WARNING: libgomp.fortran/appendix-a/a.5.1.f90  -O2  compilation failed to produce executable
FAIL: libgomp.fortran/appendix-a/a.5.1.f90  -O3 -fomit-frame-pointer  (test for excess errors)
WARNING: libgomp.fortran/appendix-a/a.5.1.f90  -O3 -fomit-frame-pointer  compilation failed to produce executable
FAIL: libgomp.fortran/appendix-a/a.5.1.f90  -O3 -fomit-frame-pointer -funroll-loops  (test for excess errors)
WARNING: libgomp.fortran/appendix-a/a.5.1.f90  -O3 -fomit-frame-pointer -funroll-loops  compilation failed to produce executable
FAIL: libgomp.fortran/appendix-a/a.5.1.f90  -O3 -fomit-frame-pointer -funroll-all-loops -finline-functions  (test for excess errors)
WARNING: libgomp.fortran/appendix-a/a.5.1.f90  -O3 -fomit-frame-pointer -funroll-all-loops -finline-functions  compilation failed to produce executable
FAIL: libgomp.fortran/appendix-a/a.5.1.f90  -O3 -g  (test for excess errors)
WARNING: libgomp.fortran/appendix-a/a.5.1.f90  -O3 -g  compilation failed to produce executable
FAIL: libgomp.fortran/appendix-a/a.5.1.f90  -Os  (test for excess errors)
WARNING: libgomp.fortran/appendix-a/a.5.1.f90  -Os  compilation failed to produce executable
FAIL: libgomp.fortran/appendix-a/a10.1.f90  -O0  (test for excess errors)
WARNING: libgomp.fortran/appendix-a/a10.1.f90  -O0  compilation failed to produce executable
FAIL: libgomp.fortran/appendix-a/a10.1.f90  -O1  (test for excess errors)
WARNING: libgomp.fortran/appendix-a/a10.1.f90  -O1  compilation failed to produce executable
FAIL: libgomp.fortran/appendix-a/a10.1.f90  -O2  (test for excess errors)
WARNING: libgomp.fortran/appendix-a/a10.1.f90  -O2  compilation failed to produce executable
FAIL: libgomp.fortran/appendix-a/a10.1.f90  -O3 -fomit-frame-pointer  (test for excess errors)
WARNING: libgomp.fortran/appendix-a/a10.1.f90  -O3 -fomit-frame-pointer  compilation failed to produce executable
FAIL: libgomp.fortran/appendix-a/a10.1.f90  -O3 -fomit-frame-pointer -funroll-loops  (test for excess errors)
WARNING: libgomp.fortran/appendix-a/a10.1.f90  -O3 -fomit-frame-pointer -funroll-loops  compilation failed to produce executable
FAIL: libgomp.fortran/appendix-a/a10.1.f90  -O3 -fomit-frame-pointer -funroll-all-loops -finline-functions  (test for excess errors)
WARNING: libgomp.fortran/appendix-a/a10.1.f90  -O3 -fomit-frame-pointer -funroll-all-loops -finline-functions  compilation failed to produce executable
FAIL: libgomp.fortran/appendix-a/a10.1.f90  -O3 -g  (test for excess errors)
WARNING: libgomp.fortran/appendix-a/a10.1.f90  -O3 -g  compilation failed to produce executable
FAIL: libgomp.fortran/appendix-a/a10.1.f90  -Os  (test for excess errors)
WARNING: libgomp.fortran/appendix-a/a10.1.f90  -Os  compilation failed to produce executable
FAIL: libgomp.fortran/character1.f90  -O0  (test for excess errors)
WARNING: libgomp.fortran/character1.f90  -O0  compilation failed to produce executable
FAIL: libgomp.fortran/character1.f90  -O1  (test for excess errors)
WARNING: libgomp.fortran/character1.f90  -O1  compilation failed to produce executable
FAIL: libgomp.fortran/character1.f90  -O2  (test for excess errors)
WARNING: libgomp.fortran/character1.f90  -O2  compilation failed to produce executable
FAIL: libgomp.fortran/character1.f90  -O3 -fomit-frame-pointer  (test for excess errors)
WARNING: libgomp.fortran/character1.f90  -O3 -fomit-frame-pointer  compilation failed to produce executable
FAIL: libgomp.fortran/character1.f90  -O3 -fomit-frame-pointer -funroll-loops  (test for excess errors)
WARNING: libgomp.fortran/character1.f90  -O3 -fomit-frame-pointer -funroll-loops  compilation failed to produce executable
FAIL: libgomp.fortran/character1.f90  -O3 -fomit-frame-pointer -funroll-all-loops -finline-functions  (test for excess errors)
WARNING: libgomp.fortran/character1.f90  -O3 -fomit-frame-pointer -funroll-all-loops -finline-functions  compilation failed to produce executable
FAIL: libgomp.fortran/character1.f90  -O3 -g  (test for excess errors)
WARNING: libgomp.fortran/character1.f90  -O3 -g  compilation failed to produce executable
FAIL: libgomp.fortran/character1.f90  -Os  (test for excess errors)
WARNING: libgomp.fortran/character1.f90  -Os  compilation failed to produce executable
FAIL: libgomp.fortran/character2.f90  -O0  (test for excess errors)
WARNING: libgomp.fortran/character2.f90  -O0  compilation failed to produce executable
FAIL: libgomp.fortran/character2.f90  -O1  (test for excess errors)
WARNING: libgomp.fortran/character2.f90  -O1  compilation failed to produce executable
FAIL: libgomp.fortran/character2.f90  -O2  (test for excess errors)
WARNING: libgomp.fortran/character2.f90  -O2  compilation failed to produce executable
FAIL: libgomp.fortran/character2.f90  -O3 -fomit-frame-pointer  (test for excess errors)
WARNING: libgomp.fortran/character2.f90  -O3 -fomit-frame-pointer  compilation failed to produce executable
FAIL: libgomp.fortran/character2.f90  -O3 -fomit-frame-pointer -funroll-loops  (test for excess errors)
WARNING: libgomp.fortran/character2.f90  -O3 -fomit-frame-pointer -funroll-loops  compilation failed to produce executable
FAIL: libgomp.fortran/character2.f90  -O3 -fomit-frame-pointer -funroll-all-loops -finline-functions  (test for excess errors)
WARNING: libgomp.fortran/character2.f90  -O3 -fomit-frame-pointer -funroll-all-loops -finline-functions  compilation failed to produce executable
FAIL: libgomp.fortran/character2.f90  -O3 -g  (test for excess errors)
WARNING: libgomp.fortran/character2.f90  -O3 -g  compilation failed to produce executable
FAIL: libgomp.fortran/character2.f90  -Os  (test for excess errors)
WARNING: libgomp.fortran/character2.f90  -Os  compilation failed to produce executable
FAIL: libgomp.fortran/collapse1.f90  -O0  (test for excess errors)
WARNING: libgomp.fortran/collapse1.f90  -O0  compilation failed to produce executable
FAIL: libgomp.fortran/collapse1.f90  -O1  (test for excess errors)
WARNING: libgomp.fortran/collapse1.f90  -O1  compilation failed to produce executable
FAIL: libgomp.fortran/collapse1.f90  -O2  (test for excess errors)
WARNING: libgomp.fortran/collapse1.f90  -O2  compilation failed to produce executable
FAIL: libgomp.fortran/collapse1.f90  -O3 -fomit-frame-pointer  (test for excess errors)
WARNING: libgomp.fortran/collapse1.f90  -O3 -fomit-frame-pointer  compilation failed to produce executable
FAIL: libgomp.fortran/collapse1.f90  -O3 -fomit-frame-pointer -funroll-loops  (test for excess errors)
WARNING: libgomp.fortran/collapse1.f90  -O3 -fomit-frame-pointer -funroll-loops  compilation failed to produce executable
FAIL: libgomp.fortran/collapse1.f90  -O3 -fomit-frame-pointer -funroll-all-loops -finline-functions  (test for excess errors)
WARNING: libgomp.fortran/collapse1.f90  -O3 -fomit-frame-pointer -funroll-all-loops -finline-functions  compilation failed to produce executable
FAIL: libgomp.fortran/collapse1.f90  -O3 -g  (test for excess errors)
WARNING: libgomp.fortran/collapse1.f90  -O3 -g  compilation failed to produce executable
FAIL: libgomp.fortran/collapse1.f90  -Os  (test for excess errors)
WARNING: libgomp.fortran/collapse1.f90  -Os  compilation failed to produce executable
FAIL: libgomp.fortran/collapse2.f90  -O0  (test for excess errors)
WARNING: libgomp.fortran/collapse2.f90  -O0  compilation failed to produce executable
FAIL: libgomp.fortran/collapse2.f90  -O1  (test for excess errors)
WARNING: libgomp.fortran/collapse2.f90  -O1  compilation failed to produce executable
FAIL: libgomp.fortran/collapse2.f90  -O2  (test for excess errors)
WARNING: libgomp.fortran/collapse2.f90  -O2  compilation failed to produce executable
FAIL: libgomp.fortran/collapse2.f90  -O3 -fomit-frame-pointer  (test for excess errors)
WARNING: libgomp.fortran/collapse2.f90  -O3 -fomit-frame-pointer  compilation failed to produce executable
FAIL: libgomp.fortran/collapse2.f90  -O3 -fomit-frame-pointer -funroll-loops  (test for excess errors)
WARNING: libgomp.fortran/collapse2.f90  -O3 -fomit-frame-pointer -funroll-loops  compilation failed to produce executable
FAIL: libgomp.fortran/collapse2.f90  -O3 -fomit-frame-pointer -funroll-all-loops -finline-functions  (test for excess errors)
WARNING: libgomp.fortran/collapse2.f90  -O3 -fomit-frame-pointer -funroll-all-loops -finline-functions  compilation failed to produce executable
FAIL: libgomp.fortran/collapse2.f90  -O3 -g  (test for excess errors)
WARNING: libgomp.fortran/collapse2.f90  -O3 -g  compilation failed to produce executable
FAIL: libgomp.fortran/collapse2.f90  -Os  (test for excess errors)
WARNING: libgomp.fortran/collapse2.f90  -Os  compilation failed to produce executable
FAIL: libgomp.fortran/collapse3.f90  -O0  (test for excess errors)
WARNING: libgomp.fortran/collapse3.f90  -O0  compilation failed to produce executable
FAIL: libgomp.fortran/collapse3.f90  -O1  (test for excess errors)
WARNING: libgomp.fortran/collapse3.f90  -O1  compilation failed to produce executable
FAIL: libgomp.fortran/collapse3.f90  -O2  (test for excess errors)
WARNING: libgomp.fortran/collapse3.f90  -O2  compilation failed to produce executable
FAIL: libgomp.fortran/collapse3.f90  -O3 -fomit-frame-pointer  (test for excess errors)
WARNING: libgomp.fortran/collapse3.f90  -O3 -fomit-frame-pointer  compilation failed to produce executable
FAIL: libgomp.fortran/collapse3.f90  -O3 -fomit-frame-pointer -funroll-loops  (test for excess errors)
WARNING: libgomp.fortran/collapse3.f90  -O3 -fomit-frame-pointer -funroll-loops  compilation failed to produce executable
FAIL: libgomp.fortran/collapse3.f90  -O3 -fomit-frame-pointer -funroll-all-loops -finline-functions  (test for excess errors)
WARNING: libgomp.fortran/collapse3.f90  -O3 -fomit-frame-pointer -funroll-all-loops -finline-functions  compilation failed to produce executable
FAIL: libgomp.fortran/collapse3.f90  -O3 -g  (test for excess errors)
WARNING: libgomp.fortran/collapse3.f90  -O3 -g  compilation failed to produce executable
FAIL: libgomp.fortran/collapse3.f90  -Os  (test for excess errors)
WARNING: libgomp.fortran/collapse3.f90  -Os  compilation failed to produce executable
FAIL: libgomp.fortran/collapse4.f90  -O0  (test for excess errors)
WARNING: libgomp.fortran/collapse4.f90  -O0  compilation failed to produce executable
FAIL: libgomp.fortran/collapse4.f90  -O1  (test for excess errors)
WARNING: libgomp.fortran/collapse4.f90  -O1  compilation failed to produce executable
FAIL: libgomp.fortran/collapse4.f90  -O2  (test for excess errors)
WARNING: libgomp.fortran/collapse4.f90  -O2  compilation failed to produce executable
FAIL: libgomp.fortran/collapse4.f90  -O3 -fomit-frame-pointer  (test for excess errors)
WARNING: libgomp.fortran/collapse4.f90  -O3 -fomit-frame-pointer  compilation failed to produce executable
FAIL: libgomp.fortran/collapse4.f90  -O3 -fomit-frame-pointer -funroll-loops  (test for excess errors)
WARNING: libgomp.fortran/collapse4.f90  -O3 -fomit-frame-pointer -funroll-loops  compilation failed to produce executable
FAIL: libgomp.fortran/collapse4.f90  -O3 -fomit-frame-pointer -funroll-all-loops -finline-functions  (test for excess errors)
WARNING: libgomp.fortran/collapse4.f90  -O3 -fomit-frame-pointer -funroll-all-loops -finline-functions  compilation failed to produce executable
FAIL: libgomp.fortran/collapse4.f90  -O3 -g  (test for excess errors)
WARNING: libgomp.fortran/collapse4.f90  -O3 -g  compilation failed to produce executable
FAIL: libgomp.fortran/collapse4.f90  -Os  (test for excess errors)
WARNING: libgomp.fortran/collapse4.f90  -Os  compilation failed to produce executable
FAIL: libgomp.fortran/condinc1.f  -O  (test for excess errors)
WARNING: libgomp.fortran/condinc1.f  -O  compilation failed to produce executable
FAIL: libgomp.fortran/condinc2.f  -O  (test for excess errors)
WARNING: libgomp.fortran/condinc2.f  -O  compilation failed to produce executable
FAIL: libgomp.fortran/condinc3.f90  -O  (test for excess errors)
WARNING: libgomp.fortran/condinc3.f90  -O  compilation failed to produce executable
FAIL: libgomp.fortran/condinc4.f90  -O  (test for excess errors)
WARNING: libgomp.fortran/condinc4.f90  -O  compilation failed to produce executable
FAIL: libgomp.fortran/crayptr1.f90  -O0  (test for excess errors)
WARNING: libgomp.fortran/crayptr1.f90  -O0  compilation failed to produce executable
FAIL: libgomp.fortran/crayptr1.f90  -O1  (test for excess errors)
WARNING: libgomp.fortran/crayptr1.f90  -O1  compilation failed to produce executable
FAIL: libgomp.fortran/crayptr1.f90  -O2  (test for excess errors)
WARNING: libgomp.fortran/crayptr1.f90  -O2  compilation failed to produce executable
FAIL: libgomp.fortran/crayptr1.f90  -O3 -fomit-frame-pointer  (test for excess errors)
WARNING: libgomp.fortran/crayptr1.f90  -O3 -fomit-frame-pointer  compilation failed to produce executable
FAIL: libgomp.fortran/crayptr1.f90  -O3 -fomit-frame-pointer -funroll-loops  (test for excess errors)
WARNING: libgomp.fortran/crayptr1.f90  -O3 -fomit-frame-pointer -funroll-loops  compilation failed to produce executable
FAIL: libgomp.fortran/crayptr1.f90  -O3 -fomit-frame-pointer -funroll-all-loops -finline-functions  (test for excess errors)
WARNING: libgomp.fortran/crayptr1.f90  -O3 -fomit-frame-pointer -funroll-all-loops -finline-functions  compilation failed to produce executable
FAIL: libgomp.fortran/crayptr1.f90  -O3 -g  (test for excess errors)
WARNING: libgomp.fortran/crayptr1.f90  -O3 -g  compilation failed to produce executable
FAIL: libgomp.fortran/crayptr1.f90  -Os  (test for excess errors)
WARNING: libgomp.fortran/crayptr1.f90  -Os  compilation failed to produce executable
FAIL: libgomp.fortran/crayptr2.f90  -O0  (test for excess errors)
WARNING: libgomp.fortran/crayptr2.f90  -O0  compilation failed to produce executable
FAIL: libgomp.fortran/crayptr2.f90  -O1  (test for excess errors)
WARNING: libgomp.fortran/crayptr2.f90  -O1  compilation failed to produce executable
FAIL: libgomp.fortran/crayptr2.f90  -O2  (test for excess errors)
WARNING: libgomp.fortran/crayptr2.f90  -O2  compilation failed to produce executable
FAIL: libgomp.fortran/crayptr2.f90  -O3 -fomit-frame-pointer  (test for excess errors)
WARNING: libgomp.fortran/crayptr2.f90  -O3 -fomit-frame-pointer  compilation failed to produce executable
FAIL: libgomp.fortran/crayptr2.f90  -O3 -fomit-frame-pointer -funroll-loops  (test for excess errors)
WARNING: libgomp.fortran/crayptr2.f90  -O3 -fomit-frame-pointer -funroll-loops  compilation failed to produce executable
FAIL: libgomp.fortran/crayptr2.f90  -O3 -fomit-frame-pointer -funroll-all-loops -finline-functions  (test for excess errors)
WARNING: libgomp.fortran/crayptr2.f90  -O3 -fomit-frame-pointer -funroll-all-loops -finline-functions  compilation failed to produce executable
FAIL: libgomp.fortran/crayptr2.f90  -O3 -g  (test for excess errors)
WARNING: libgomp.fortran/crayptr2.f90  -O3 -g  compilation failed to produce executable
FAIL: libgomp.fortran/crayptr2.f90  -Os  (test for excess errors)
WARNING: libgomp.fortran/crayptr2.f90  -Os  compilation failed to produce executable
FAIL: libgomp.fortran/do1.f90  -O0  (test for excess errors)
WARNING: libgomp.fortran/do1.f90  -O0  compilation failed to produce executable
FAIL: libgomp.fortran/do1.f90  -O1  (test for excess errors)
WARNING: libgomp.fortran/do1.f90  -O1  compilation failed to produce executable
FAIL: libgomp.fortran/do1.f90  -O2  (test for excess errors)
WARNING: libgomp.fortran/do1.f90  -O2  compilation failed to produce executable
FAIL: libgomp.fortran/do1.f90  -O3 -fomit-frame-pointer  (test for excess errors)
WARNING: libgomp.fortran/do1.f90  -O3 -fomit-frame-pointer  compilation failed to produce executable
FAIL: libgomp.fortran/do1.f90  -O3 -fomit-frame-pointer -funroll-loops  (test for excess errors)
WARNING: libgomp.fortran/do1.f90  -O3 -fomit-frame-pointer -funroll-loops  compilation failed to produce executable
FAIL: libgomp.fortran/do1.f90  -O3 -fomit-frame-pointer -funroll-all-loops -finline-functions  (test for excess errors)
WARNING: libgomp.fortran/do1.f90  -O3 -fomit-frame-pointer -funroll-all-loops -finline-functions  compilation failed to produce executable
FAIL: libgomp.fortran/do1.f90  -O3 -g  (test for excess errors)
WARNING: libgomp.fortran/do1.f90  -O3 -g  compilation failed to produce executable
FAIL: libgomp.fortran/do1.f90  -Os  (test for excess errors)
WARNING: libgomp.fortran/do1.f90  -Os  compilation failed to produce executable
FAIL: libgomp.fortran/do2.f90  -O0  (test for excess errors)
WARNING: libgomp.fortran/do2.f90  -O0  compilation failed to produce executable
FAIL: libgomp.fortran/do2.f90  -O1  (test for excess errors)
WARNING: libgomp.fortran/do2.f90  -O1  compilation failed to produce executable
FAIL: libgomp.fortran/do2.f90  -O2  (test for excess errors)
WARNING: libgomp.fortran/do2.f90  -O2  compilation failed to produce executable
FAIL: libgomp.fortran/do2.f90  -O3 -fomit-frame-pointer  (test for excess errors)
WARNING: libgomp.fortran/do2.f90  -O3 -fomit-frame-pointer  compilation failed to produce executable
FAIL: libgomp.fortran/do2.f90  -O3 -fomit-frame-pointer -funroll-loops  (test for excess errors)
WARNING: libgomp.fortran/do2.f90  -O3 -fomit-frame-pointer -funroll-loops  compilation failed to produce executable
FAIL: libgomp.fortran/do2.f90  -O3 -fomit-frame-pointer -funroll-all-loops -finline-functions  (test for excess errors)
WARNING: libgomp.fortran/do2.f90  -O3 -fomit-frame-pointer -funroll-all-loops -finline-functions  compilation failed to produce executable
FAIL: libgomp.fortran/do2.f90  -O3 -g  (test for excess errors)
WARNING: libgomp.fortran/do2.f90  -O3 -g  compilation failed to produce executable
FAIL: libgomp.fortran/do2.f90  -Os  (test for excess errors)
WARNING: libgomp.fortran/do2.f90  -Os  compilation failed to produce executable
FAIL: libgomp.fortran/jacobi.f  -O0  (test for excess errors)
WARNING: libgomp.fortran/jacobi.f  -O0  compilation failed to produce executable
FAIL: libgomp.fortran/jacobi.f  -O1  (test for excess errors)
WARNING: libgomp.fortran/jacobi.f  -O1  compilation failed to produce executable
FAIL: libgomp.fortran/jacobi.f  -O2  (test for excess errors)
WARNING: libgomp.fortran/jacobi.f  -O2  compilation failed to produce executable
FAIL: libgomp.fortran/jacobi.f  -O3 -fomit-frame-pointer  (test for excess errors)
WARNING: libgomp.fortran/jacobi.f  -O3 -fomit-frame-pointer  compilation failed to produce executable
FAIL: libgomp.fortran/jacobi.f  -O3 -fomit-frame-pointer -funroll-loops  (test for excess errors)
WARNING: libgomp.fortran/jacobi.f  -O3 -fomit-frame-pointer -funroll-loops  compilation failed to produce executable
FAIL: libgomp.fortran/jacobi.f  -O3 -fomit-frame-pointer -funroll-all-loops -finline-functions  (test for excess errors)
WARNING: libgomp.fortran/jacobi.f  -O3 -fomit-frame-pointer -funroll-all-loops -finline-functions  compilation failed to produce executable
FAIL: libgomp.fortran/jacobi.f  -O3 -g  (test for excess errors)
WARNING: libgomp.fortran/jacobi.f  -O3 -g  compilation failed to produce executable
FAIL: libgomp.fortran/jacobi.f  -Os  (test for excess errors)
WARNING: libgomp.fortran/jacobi.f  -Os  compilation failed to produce executable
FAIL: libgomp.fortran/lastprivate1.f90  -O  (test for excess errors)
WARNING: libgomp.fortran/lastprivate1.f90  -O  compilation failed to produce executable
FAIL: libgomp.fortran/lastprivate2.f90  -O  (test for excess errors)
WARNING: libgomp.fortran/lastprivate2.f90  -O  compilation failed to produce executable
FAIL: libgomp.fortran/lib1.f90  -O0  (test for excess errors)
WARNING: libgomp.fortran/lib1.f90  -O0  compilation failed to produce executable
FAIL: libgomp.fortran/lib1.f90  -O1  (test for excess errors)
WARNING: libgomp.fortran/lib1.f90  -O1  compilation failed to produce executable
FAIL: libgomp.fortran/lib1.f90  -O2  (test for excess errors)
WARNING: libgomp.fortran/lib1.f90  -O2  compilation failed to produce executable
FAIL: libgomp.fortran/lib1.f90  -O3 -fomit-frame-pointer  (test for excess errors)
WARNING: libgomp.fortran/lib1.f90  -O3 -fomit-frame-pointer  compilation failed to produce executable
FAIL: libgomp.fortran/lib1.f90  -O3 -fomit-frame-pointer -funroll-loops  (test for excess errors)
WARNING: libgomp.fortran/lib1.f90  -O3 -fomit-frame-pointer -funroll-loops  compilation failed to produce executable
FAIL: libgomp.fortran/lib1.f90  -O3 -fomit-frame-pointer -funroll-all-loops -finline-functions  (test for excess errors)
WARNING: libgomp.fortran/lib1.f90  -O3 -fomit-frame-pointer -funroll-all-loops -finline-functions  compilation failed to produce executable
FAIL: libgomp.fortran/lib1.f90  -O3 -g  (test for excess errors)
WARNING: libgomp.fortran/lib1.f90  -O3 -g  compilation failed to produce executable
FAIL: libgomp.fortran/lib1.f90  -Os  (test for excess errors)
WARNING: libgomp.fortran/lib1.f90  -Os  compilation failed to produce executable
FAIL: libgomp.fortran/lib2.f  -O0  (test for excess errors)
WARNING: libgomp.fortran/lib2.f  -O0  compilation failed to produce executable
FAIL: libgomp.fortran/lib2.f  -O1  (test for excess errors)
WARNING: libgomp.fortran/lib2.f  -O1  compilation failed to produce executable
FAIL: libgomp.fortran/lib2.f  -O2  (test for excess errors)
WARNING: libgomp.fortran/lib2.f  -O2  compilation failed to produce executable
FAIL: libgomp.fortran/lib2.f  -O3 -fomit-frame-pointer  (test for excess errors)
WARNING: libgomp.fortran/lib2.f  -O3 -fomit-frame-pointer  compilation failed to produce executable
FAIL: libgomp.fortran/lib2.f  -O3 -fomit-frame-pointer -funroll-loops  (test for excess errors)
WARNING: libgomp.fortran/lib2.f  -O3 -fomit-frame-pointer -funroll-loops  compilation failed to produce executable
FAIL: libgomp.fortran/lib2.f  -O3 -fomit-frame-pointer -funroll-all-loops -finline-functions  (test for excess errors)
WARNING: libgomp.fortran/lib2.f  -O3 -fomit-frame-pointer -funroll-all-loops -finline-functions  compilation failed to produce executable
FAIL: libgomp.fortran/lib2.f  -O3 -g  (test for excess errors)
WARNING: libgomp.fortran/lib2.f  -O3 -g  compilation failed to produce executable
FAIL: libgomp.fortran/lib2.f  -Os  (test for excess errors)
WARNING: libgomp.fortran/lib2.f  -Os  compilation failed to produce executable
FAIL: libgomp.fortran/lib3.f  -O0  (test for excess errors)
WARNING: libgomp.fortran/lib3.f  -O0  compilation failed to produce executable
FAIL: libgomp.fortran/lib3.f  -O1  (test for excess errors)
WARNING: libgomp.fortran/lib3.f  -O1  compilation failed to produce executable
FAIL: libgomp.fortran/lib3.f  -O2  (test for excess errors)
WARNING: libgomp.fortran/lib3.f  -O2  compilation failed to produce executable
FAIL: libgomp.fortran/lib3.f  -O3 -fomit-frame-pointer  (test for excess errors)
WARNING: libgomp.fortran/lib3.f  -O3 -fomit-frame-pointer  compilation failed to produce executable
FAIL: libgomp.fortran/lib3.f  -O3 -fomit-frame-pointer -funroll-loops  (test for excess errors)
WARNING: libgomp.fortran/lib3.f  -O3 -fomit-frame-pointer -funroll-loops  compilation failed to produce executable
FAIL: libgomp.fortran/lib3.f  -O3 -fomit-frame-pointer -funroll-all-loops -finline-functions  (test for excess errors)
WARNING: libgomp.fortran/lib3.f  -O3 -fomit-frame-pointer -funroll-all-loops -finline-functions  compilation failed to produce executable
FAIL: libgomp.fortran/lib3.f  -O3 -g  (test for excess errors)
WARNING: libgomp.fortran/lib3.f  -O3 -g  compilation failed to produce executable
FAIL: libgomp.fortran/lib3.f  -Os  (test for excess errors)
WARNING: libgomp.fortran/lib3.f  -Os  compilation failed to produce executable
FAIL: libgomp.fortran/lib4.f90  -O0  (test for excess errors)
WARNING: libgomp.fortran/lib4.f90  -O0  compilation failed to produce executable
FAIL: libgomp.fortran/lib4.f90  -O1  (test for excess errors)
WARNING: libgomp.fortran/lib4.f90  -O1  compilation failed to produce executable
FAIL: libgomp.fortran/lib4.f90  -O2  (test for excess errors)
WARNING: libgomp.fortran/lib4.f90  -O2  compilation failed to produce executable
FAIL: libgomp.fortran/lib4.f90  -O3 -fomit-frame-pointer  (test for excess errors)
WARNING: libgomp.fortran/lib4.f90  -O3 -fomit-frame-pointer  compilation failed to produce executable
FAIL: libgomp.fortran/lib4.f90  -O3 -fomit-frame-pointer -funroll-loops  (test for excess errors)
WARNING: libgomp.fortran/lib4.f90  -O3 -fomit-frame-pointer -funroll-loops  compilation failed to produce executable
FAIL: libgomp.fortran/lib4.f90  -O3 -fomit-frame-pointer -funroll-all-loops -finline-functions  (test for excess errors)
WARNING: libgomp.fortran/lib4.f90  -O3 -fomit-frame-pointer -funroll-all-loops -finline-functions  compilation failed to produce executable
FAIL: libgomp.fortran/lib4.f90  -O3 -g  (test for excess errors)
WARNING: libgomp.fortran/lib4.f90  -O3 -g  compilation failed to produce executable
FAIL: libgomp.fortran/lib4.f90  -Os  (test for excess errors)
WARNING: libgomp.fortran/lib4.f90  -Os  compilation failed to produce executable
FAIL: libgomp.fortran/lock-1.f90  -O0  (test for excess errors)
WARNING: libgomp.fortran/lock-1.f90  -O0  compilation failed to produce executable
FAIL: libgomp.fortran/lock-1.f90  -O1  (test for excess errors)
WARNING: libgomp.fortran/lock-1.f90  -O1  compilation failed to produce executable
FAIL: libgomp.fortran/lock-1.f90  -O2  (test for excess errors)
WARNING: libgomp.fortran/lock-1.f90  -O2  compilation failed to produce executable
FAIL: libgomp.fortran/lock-1.f90  -O3 -fomit-frame-pointer  (test for excess errors)
WARNING: libgomp.fortran/lock-1.f90  -O3 -fomit-frame-pointer  compilation failed to produce executable
FAIL: libgomp.fortran/lock-1.f90  -O3 -fomit-frame-pointer -funroll-loops  (test for excess errors)
WARNING: libgomp.fortran/lock-1.f90  -O3 -fomit-frame-pointer -funroll-loops  compilation failed to produce executable
FAIL: libgomp.fortran/lock-1.f90  -O3 -fomit-frame-pointer -funroll-all-loops -finline-functions  (test for excess errors)
WARNING: libgomp.fortran/lock-1.f90  -O3 -fomit-frame-pointer -funroll-all-loops -finline-functions  compilation failed to produce executable
FAIL: libgomp.fortran/lock-1.f90  -O3 -g  (test for excess errors)
WARNING: libgomp.fortran/lock-1.f90  -O3 -g  compilation failed to produce executable
FAIL: libgomp.fortran/lock-1.f90  -Os  (test for excess errors)
WARNING: libgomp.fortran/lock-1.f90  -Os  compilation failed to produce executable
FAIL: libgomp.fortran/lock-2.f90  -O0  (test for excess errors)
WARNING: libgomp.fortran/lock-2.f90  -O0  compilation failed to produce executable
FAIL: libgomp.fortran/lock-2.f90  -O1  (test for excess errors)
WARNING: libgomp.fortran/lock-2.f90  -O1  compilation failed to produce executable
FAIL: libgomp.fortran/lock-2.f90  -O2  (test for excess errors)
WARNING: libgomp.fortran/lock-2.f90  -O2  compilation failed to produce executable
FAIL: libgomp.fortran/lock-2.f90  -O3 -fomit-frame-pointer  (test for excess errors)
WARNING: libgomp.fortran/lock-2.f90  -O3 -fomit-frame-pointer  compilation failed to produce executable
FAIL: libgomp.fortran/lock-2.f90  -O3 -fomit-frame-pointer -funroll-loops  (test for excess errors)
WARNING: libgomp.fortran/lock-2.f90  -O3 -fomit-frame-pointer -funroll-loops  compilation failed to produce executable
FAIL: libgomp.fortran/lock-2.f90  -O3 -fomit-frame-pointer -funroll-all-loops -finline-functions  (test for excess errors)
WARNING: libgomp.fortran/lock-2.f90  -O3 -fomit-frame-pointer -funroll-all-loops -finline-functions  compilation failed to produce executable
FAIL: libgomp.fortran/lock-2.f90  -O3 -g  (test for excess errors)
WARNING: libgomp.fortran/lock-2.f90  -O3 -g  compilation failed to produce executable
FAIL: libgomp.fortran/lock-2.f90  -Os  (test for excess errors)
WARNING: libgomp.fortran/lock-2.f90  -Os  compilation failed to produce executable
FAIL: libgomp.fortran/nested1.f90  -O0  (test for excess errors)
WARNING: libgomp.fortran/nested1.f90  -O0  compilation failed to produce executable
FAIL: libgomp.fortran/nested1.f90  -O1  (test for excess errors)
WARNING: libgomp.fortran/nested1.f90  -O1  compilation failed to produce executable
FAIL: libgomp.fortran/nested1.f90  -O2  (test for excess errors)
WARNING: libgomp.fortran/nested1.f90  -O2  compilation failed to produce executable
FAIL: libgomp.fortran/nested1.f90  -O3 -fomit-frame-pointer  (test for excess errors)
WARNING: libgomp.fortran/nested1.f90  -O3 -fomit-frame-pointer  compilation failed to produce executable
FAIL: libgomp.fortran/nested1.f90  -O3 -fomit-frame-pointer -funroll-loops  (test for excess errors)
WARNING: libgomp.fortran/nested1.f90  -O3 -fomit-frame-pointer -funroll-loops  compilation failed to produce executable
FAIL: libgomp.fortran/nested1.f90  -O3 -fomit-frame-pointer -funroll-all-loops -finline-functions  (test for excess errors)
WARNING: libgomp.fortran/nested1.f90  -O3 -fomit-frame-pointer -funroll-all-loops -finline-functions  compilation failed to produce executable
FAIL: libgomp.fortran/nested1.f90  -O3 -g  (test for excess errors)
WARNING: libgomp.fortran/nested1.f90  -O3 -g  compilation failed to produce executable
FAIL: libgomp.fortran/nested1.f90  -Os  (test for excess errors)
WARNING: libgomp.fortran/nested1.f90  -Os  compilation failed to produce executable
FAIL: libgomp.fortran/nestedfn1.f90  -O0  (test for excess errors)
WARNING: libgomp.fortran/nestedfn1.f90  -O0  compilation failed to produce executable
FAIL: libgomp.fortran/nestedfn1.f90  -O1  (test for excess errors)
WARNING: libgomp.fortran/nestedfn1.f90  -O1  compilation failed to produce executable
FAIL: libgomp.fortran/nestedfn1.f90  -O2  (test for excess errors)
WARNING: libgomp.fortran/nestedfn1.f90  -O2  compilation failed to produce executable
FAIL: libgomp.fortran/nestedfn1.f90  -O3 -fomit-frame-pointer  (test for excess errors)
WARNING: libgomp.fortran/nestedfn1.f90  -O3 -fomit-frame-pointer  compilation failed to produce executable
FAIL: libgomp.fortran/nestedfn1.f90  -O3 -fomit-frame-pointer -funroll-loops  (test for excess errors)
WARNING: libgomp.fortran/nestedfn1.f90  -O3 -fomit-frame-pointer -funroll-loops  compilation failed to produce executable
FAIL: libgomp.fortran/nestedfn1.f90  -O3 -fomit-frame-pointer -funroll-all-loops -finline-functions  (test for excess errors)
WARNING: libgomp.fortran/nestedfn1.f90  -O3 -fomit-frame-pointer -funroll-all-loops -finline-functions  compilation failed to produce executable
FAIL: libgomp.fortran/nestedfn1.f90  -O3 -g  (test for excess errors)
WARNING: libgomp.fortran/nestedfn1.f90  -O3 -g  compilation failed to produce executable
FAIL: libgomp.fortran/nestedfn1.f90  -Os  (test for excess errors)
WARNING: libgomp.fortran/nestedfn1.f90  -Os  compilation failed to produce executable
FAIL: libgomp.fortran/nestedfn2.f90  -O0  (test for excess errors)
WARNING: libgomp.fortran/nestedfn2.f90  -O0  compilation failed to produce executable
FAIL: libgomp.fortran/nestedfn2.f90  -O1  (test for excess errors)
WARNING: libgomp.fortran/nestedfn2.f90  -O1  compilation failed to produce executable
FAIL: libgomp.fortran/nestedfn2.f90  -O2  (test for excess errors)
WARNING: libgomp.fortran/nestedfn2.f90  -O2  compilation failed to produce executable
FAIL: libgomp.fortran/nestedfn2.f90  -O3 -fomit-frame-pointer  (test for excess errors)
WARNING: libgomp.fortran/nestedfn2.f90  -O3 -fomit-frame-pointer  compilation failed to produce executable
FAIL: libgomp.fortran/nestedfn2.f90  -O3 -fomit-frame-pointer -funroll-loops  (test for excess errors)
WARNING: libgomp.fortran/nestedfn2.f90  -O3 -fomit-frame-pointer -funroll-loops  compilation failed to produce executable
FAIL: libgomp.fortran/nestedfn2.f90  -O3 -fomit-frame-pointer -funroll-all-loops -finline-functions  (test for excess errors)
WARNING: libgomp.fortran/nestedfn2.f90  -O3 -fomit-frame-pointer -funroll-all-loops -finline-functions  compilation failed to produce executable
FAIL: libgomp.fortran/nestedfn2.f90  -O3 -g  (test for excess errors)
WARNING: libgomp.fortran/nestedfn2.f90  -O3 -g  compilation failed to produce executable
FAIL: libgomp.fortran/nestedfn2.f90  -Os  (test for excess errors)
WARNING: libgomp.fortran/nestedfn2.f90  -Os  compilation failed to produce executable
FAIL: libgomp.fortran/nestedfn3.f90  -O0  (test for excess errors)
WARNING: libgomp.fortran/nestedfn3.f90  -O0  compilation failed to produce executable
FAIL: libgomp.fortran/nestedfn3.f90  -O1  (test for excess errors)
WARNING: libgomp.fortran/nestedfn3.f90  -O1  compilation failed to produce executable
FAIL: libgomp.fortran/nestedfn3.f90  -O2  (test for excess errors)
WARNING: libgomp.fortran/nestedfn3.f90  -O2  compilation failed to produce executable
FAIL: libgomp.fortran/nestedfn3.f90  -O3 -fomit-frame-pointer  (test for excess errors)
WARNING: libgomp.fortran/nestedfn3.f90  -O3 -fomit-frame-pointer  compilation failed to produce executable
FAIL: libgomp.fortran/nestedfn3.f90  -O3 -fomit-frame-pointer -funroll-loops  (test for excess errors)
WARNING: libgomp.fortran/nestedfn3.f90  -O3 -fomit-frame-pointer -funroll-loops  compilation failed to produce executable
FAIL: libgomp.fortran/nestedfn3.f90  -O3 -fomit-frame-pointer -funroll-all-loops -finline-functions  (test for excess errors)
WARNING: libgomp.fortran/nestedfn3.f90  -O3 -fomit-frame-pointer -funroll-all-loops -finline-functions  compilation failed to produce executable
FAIL: libgomp.fortran/nestedfn3.f90  -O3 -g  (test for excess errors)
WARNING: libgomp.fortran/nestedfn3.f90  -O3 -g  compilation failed to produce executable
FAIL: libgomp.fortran/nestedfn3.f90  -Os  (test for excess errors)
WARNING: libgomp.fortran/nestedfn3.f90  -Os  compilation failed to produce executable
FAIL: libgomp.fortran/nestedfn4.f90  -O  (test for excess errors)
WARNING: libgomp.fortran/nestedfn4.f90  -O  compilation failed to produce executable
FAIL: libgomp.fortran/omp_atomic1.f90  -O0  (test for excess errors)
WARNING: libgomp.fortran/omp_atomic1.f90  -O0  compilation failed to produce executable
FAIL: libgomp.fortran/omp_atomic1.f90  -O1  (test for excess errors)
WARNING: libgomp.fortran/omp_atomic1.f90  -O1  compilation failed to produce executable
FAIL: libgomp.fortran/omp_atomic1.f90  -O2  (test for excess errors)
WARNING: libgomp.fortran/omp_atomic1.f90  -O2  compilation failed to produce executable
FAIL: libgomp.fortran/omp_atomic1.f90  -O3 -fomit-frame-pointer  (test for excess errors)
WARNING: libgomp.fortran/omp_atomic1.f90  -O3 -fomit-frame-pointer  compilation failed to produce executable
FAIL: libgomp.fortran/omp_atomic1.f90  -O3 -fomit-frame-pointer -funroll-loops  (test for excess errors)
WARNING: libgomp.fortran/omp_atomic1.f90  -O3 -fomit-frame-pointer -funroll-loops  compilation failed to produce executable
FAIL: libgomp.fortran/omp_atomic1.f90  -O3 -fomit-frame-pointer -funroll-all-loops -finline-functions  (test for excess errors)
WARNING: libgomp.fortran/omp_atomic1.f90  -O3 -fomit-frame-pointer -funroll-all-loops -finline-functions  compilation failed to produce executable
FAIL: libgomp.fortran/omp_atomic1.f90  -O3 -g  (test for excess errors)
WARNING: libgomp.fortran/omp_atomic1.f90  -O3 -g  compilation failed to produce executable
FAIL: libgomp.fortran/omp_atomic1.f90  -Os  (test for excess errors)
WARNING: libgomp.fortran/omp_atomic1.f90  -Os  compilation failed to produce executable
FAIL: libgomp.fortran/omp_atomic2.f90  -O0  (test for excess errors)
WARNING: libgomp.fortran/omp_atomic2.f90  -O0  compilation failed to produce executable
FAIL: libgomp.fortran/omp_atomic2.f90  -O1  (test for excess errors)
WARNING: libgomp.fortran/omp_atomic2.f90  -O1  compilation failed to produce executable
FAIL: libgomp.fortran/omp_atomic2.f90  -O2  (test for excess errors)
WARNING: libgomp.fortran/omp_atomic2.f90  -O2  compilation failed to produce executable
FAIL: libgomp.fortran/omp_atomic2.f90  -O3 -fomit-frame-pointer  (test for excess errors)
WARNING: libgomp.fortran/omp_atomic2.f90  -O3 -fomit-frame-pointer  compilation failed to produce executable
FAIL: libgomp.fortran/omp_atomic2.f90  -O3 -fomit-frame-pointer -funroll-loops  (test for excess errors)
WARNING: libgomp.fortran/omp_atomic2.f90  -O3 -fomit-frame-pointer -funroll-loops  compilation failed to produce executable
FAIL: libgomp.fortran/omp_atomic2.f90  -O3 -fomit-frame-pointer -funroll-all-loops -finline-functions  (test for excess errors)
WARNING: libgomp.fortran/omp_atomic2.f90  -O3 -fomit-frame-pointer -funroll-all-loops -finline-functions  compilation failed to produce executable
FAIL: libgomp.fortran/omp_atomic2.f90  -O3 -g  (test for excess errors)
WARNING: libgomp.fortran/omp_atomic2.f90  -O3 -g  compilation failed to produce executable
FAIL: libgomp.fortran/omp_atomic2.f90  -Os  (test for excess errors)
WARNING: libgomp.fortran/omp_atomic2.f90  -Os  compilation failed to produce executable
FAIL: libgomp.fortran/omp_cond1.f  -O  (test for excess errors)
WARNING: libgomp.fortran/omp_cond1.f  -O  compilation failed to produce executable
FAIL: libgomp.fortran/omp_cond2.f  -O  (test for excess errors)
WARNING: libgomp.fortran/omp_cond2.f  -O  compilation failed to produce executable
FAIL: libgomp.fortran/omp_cond3.F90  -O  (test for excess errors)
WARNING: libgomp.fortran/omp_cond3.F90  -O  compilation failed to produce executable
FAIL: libgomp.fortran/omp_cond4.F90  -O  (test for excess errors)
WARNING: libgomp.fortran/omp_cond4.F90  -O  compilation failed to produce executable
FAIL: libgomp.fortran/omp_hello.f  -O  (test for excess errors)
WARNING: libgomp.fortran/omp_hello.f  -O  compilation failed to produce executable
FAIL: libgomp.fortran/omp_orphan.f  -O  (test for excess errors)
WARNING: libgomp.fortran/omp_orphan.f  -O  compilation failed to produce executable
FAIL: libgomp.fortran/omp_parse1.f90  -O0  (test for excess errors)
WARNING: libgomp.fortran/omp_parse1.f90  -O0  compilation failed to produce executable
FAIL: libgomp.fortran/omp_parse1.f90  -O1  (test for excess errors)
WARNING: libgomp.fortran/omp_parse1.f90  -O1  compilation failed to produce executable
FAIL: libgomp.fortran/omp_parse1.f90  -O2  (test for excess errors)
WARNING: libgomp.fortran/omp_parse1.f90  -O2  compilation failed to produce executable
FAIL: libgomp.fortran/omp_parse1.f90  -O3 -fomit-frame-pointer  (test for excess errors)
WARNING: libgomp.fortran/omp_parse1.f90  -O3 -fomit-frame-pointer  compilation failed to produce executable
FAIL: libgomp.fortran/omp_parse1.f90  -O3 -fomit-frame-pointer -funroll-loops  (test for excess errors)
WARNING: libgomp.fortran/omp_parse1.f90  -O3 -fomit-frame-pointer -funroll-loops  compilation failed to produce executable
FAIL: libgomp.fortran/omp_parse1.f90  -O3 -fomit-frame-pointer -funroll-all-loops -finline-functions  (test for excess errors)
WARNING: libgomp.fortran/omp_parse1.f90  -O3 -fomit-frame-pointer -funroll-all-loops -finline-functions  compilation failed to produce executable
FAIL: libgomp.fortran/omp_parse1.f90  -O3 -g  (test for excess errors)
WARNING: libgomp.fortran/omp_parse1.f90  -O3 -g  compilation failed to produce executable
FAIL: libgomp.fortran/omp_parse1.f90  -Os  (test for excess errors)
WARNING: libgomp.fortran/omp_parse1.f90  -Os  compilation failed to produce executable
FAIL: libgomp.fortran/omp_parse2.f90  -O0  (test for excess errors)
WARNING: libgomp.fortran/omp_parse2.f90  -O0  compilation failed to produce executable
FAIL: libgomp.fortran/omp_parse2.f90  -O1  (test for excess errors)
WARNING: libgomp.fortran/omp_parse2.f90  -O1  compilation failed to produce executable
FAIL: libgomp.fortran/omp_parse2.f90  -O2  (test for excess errors)
WARNING: libgomp.fortran/omp_parse2.f90  -O2  compilation failed to produce executable
FAIL: libgomp.fortran/omp_parse2.f90  -O3 -fomit-frame-pointer  (test for excess errors)
WARNING: libgomp.fortran/omp_parse2.f90  -O3 -fomit-frame-pointer  compilation failed to produce executable
FAIL: libgomp.fortran/omp_parse2.f90  -O3 -fomit-frame-pointer -funroll-loops  (test for excess errors)
WARNING: libgomp.fortran/omp_parse2.f90  -O3 -fomit-frame-pointer -funroll-loops  compilation failed to produce executable
FAIL: libgomp.fortran/omp_parse2.f90  -O3 -fomit-frame-pointer -funroll-all-loops -finline-functions  (test for excess errors)
WARNING: libgomp.fortran/omp_parse2.f90  -O3 -fomit-frame-pointer -funroll-all-loops -finline-functions  compilation failed to produce executable
FAIL: libgomp.fortran/omp_parse2.f90  -O3 -g  (test for excess errors)
WARNING: libgomp.fortran/omp_parse2.f90  -O3 -g  compilation failed to produce executable
FAIL: libgomp.fortran/omp_parse2.f90  -Os  (test for excess errors)
WARNING: libgomp.fortran/omp_parse2.f90  -Os  compilation failed to produce executable
FAIL: libgomp.fortran/omp_parse4.f90  -O0  (test for excess errors)
WARNING: libgomp.fortran/omp_parse4.f90  -O0  compilation failed to produce executable
FAIL: libgomp.fortran/omp_parse4.f90  -O1  (test for excess errors)
WARNING: libgomp.fortran/omp_parse4.f90  -O1  compilation failed to produce executable
FAIL: libgomp.fortran/omp_parse4.f90  -O2  (test for excess errors)
WARNING: libgomp.fortran/omp_parse4.f90  -O2  compilation failed to produce executable
FAIL: libgomp.fortran/omp_parse4.f90  -O3 -fomit-frame-pointer  (test for excess errors)
WARNING: libgomp.fortran/omp_parse4.f90  -O3 -fomit-frame-pointer  compilation failed to produce executable
FAIL: libgomp.fortran/omp_parse4.f90  -O3 -fomit-frame-pointer -funroll-loops  (test for excess errors)
WARNING: libgomp.fortran/omp_parse4.f90  -O3 -fomit-frame-pointer -funroll-loops  compilation failed to produce executable
FAIL: libgomp.fortran/omp_parse4.f90  -O3 -fomit-frame-pointer -funroll-all-loops -finline-functions  (test for excess errors)
WARNING: libgomp.fortran/omp_parse4.f90  -O3 -fomit-frame-pointer -funroll-all-loops -finline-functions  compilation failed to produce executable
FAIL: libgomp.fortran/omp_parse4.f90  -O3 -g  (test for excess errors)
WARNING: libgomp.fortran/omp_parse4.f90  -O3 -g  compilation failed to produce executable
FAIL: libgomp.fortran/omp_parse4.f90  -Os  (test for excess errors)
WARNING: libgomp.fortran/omp_parse4.f90  -Os  compilation failed to produce executable
FAIL: libgomp.fortran/omp_reduction.f  -O  (test for excess errors)
WARNING: libgomp.fortran/omp_reduction.f  -O  compilation failed to produce executable
FAIL: libgomp.fortran/omp_workshare1.f  -O  (test for excess errors)
WARNING: libgomp.fortran/omp_workshare1.f  -O  compilation failed to produce executable
FAIL: libgomp.fortran/omp_workshare2.f  -O  (test for excess errors)
WARNING: libgomp.fortran/omp_workshare2.f  -O  compilation failed to produce executable
FAIL: libgomp.fortran/pr25219.f90  -O  (test for excess errors)
WARNING: libgomp.fortran/pr25219.f90  -O  compilation failed to produce executable
FAIL: libgomp.fortran/pr27395-1.f90  -O0  (test for excess errors)
WARNING: libgomp.fortran/pr27395-1.f90  -O0  compilation failed to produce executable
FAIL: libgomp.fortran/pr27395-1.f90  -O1  (test for excess errors)
WARNING: libgomp.fortran/pr27395-1.f90  -O1  compilation failed to produce executable
FAIL: libgomp.fortran/pr27395-1.f90  -O2  (test for excess errors)
WARNING: libgomp.fortran/pr27395-1.f90  -O2  compilation failed to produce executable
FAIL: libgomp.fortran/pr27395-1.f90  -O3 -fomit-frame-pointer  (test for excess errors)
WARNING: libgomp.fortran/pr27395-1.f90  -O3 -fomit-frame-pointer  compilation failed to produce executable
FAIL: libgomp.fortran/pr27395-1.f90  -O3 -fomit-frame-pointer -funroll-loops  (test for excess errors)
WARNING: libgomp.fortran/pr27395-1.f90  -O3 -fomit-frame-pointer -funroll-loops  compilation failed to produce executable
FAIL: libgomp.fortran/pr27395-1.f90  -O3 -fomit-frame-pointer -funroll-all-loops -finline-functions  (test for excess errors)
WARNING: libgomp.fortran/pr27395-1.f90  -O3 -fomit-frame-pointer -funroll-all-loops -finline-functions  compilation failed to produce executable
FAIL: libgomp.fortran/pr27395-1.f90  -O3 -g  (test for excess errors)
WARNING: libgomp.fortran/pr27395-1.f90  -O3 -g  compilation failed to produce executable
FAIL: libgomp.fortran/pr27395-1.f90  -Os  (test for excess errors)
WARNING: libgomp.fortran/pr27395-1.f90  -Os  compilation failed to produce executable
FAIL: libgomp.fortran/pr27395-2.f90  -O0  (test for excess errors)
WARNING: libgomp.fortran/pr27395-2.f90  -O0  compilation failed to produce executable
FAIL: libgomp.fortran/pr27395-2.f90  -O1  (test for excess errors)
WARNING: libgomp.fortran/pr27395-2.f90  -O1  compilation failed to produce executable
FAIL: libgomp.fortran/pr27395-2.f90  -O2  (test for excess errors)
WARNING: libgomp.fortran/pr27395-2.f90  -O2  compilation failed to produce executable
FAIL: libgomp.fortran/pr27395-2.f90  -O3 -fomit-frame-pointer  (test for excess errors)
WARNING: libgomp.fortran/pr27395-2.f90  -O3 -fomit-frame-pointer  compilation failed to produce executable
FAIL: libgomp.fortran/pr27395-2.f90  -O3 -fomit-frame-pointer -funroll-loops  (test for excess errors)
WARNING: libgomp.fortran/pr27395-2.f90  -O3 -fomit-frame-pointer -funroll-loops  compilation failed to produce executable
FAIL: libgomp.fortran/pr27395-2.f90  -O3 -fomit-frame-pointer -funroll-all-loops -finline-functions  (test for excess errors)
WARNING: libgomp.fortran/pr27395-2.f90  -O3 -fomit-frame-pointer -funroll-all-loops -finline-functions  compilation failed to produce executable
FAIL: libgomp.fortran/pr27395-2.f90  -O3 -g  (test for excess errors)
WARNING: libgomp.fortran/pr27395-2.f90  -O3 -g  compilation failed to produce executable
FAIL: libgomp.fortran/pr27395-2.f90  -Os  (test for excess errors)
WARNING: libgomp.fortran/pr27395-2.f90  -Os  compilation failed to produce executable
FAIL: libgomp.fortran/pr27416-1.f90  -O0  (test for excess errors)
WARNING: libgomp.fortran/pr27416-1.f90  -O0  compilation failed to produce executable
FAIL: libgomp.fortran/pr27416-1.f90  -O1  (test for excess errors)
WARNING: libgomp.fortran/pr27416-1.f90  -O1  compilation failed to produce executable
FAIL: libgomp.fortran/pr27416-1.f90  -O2  (test for excess errors)
WARNING: libgomp.fortran/pr27416-1.f90  -O2  compilation failed to produce executable
FAIL: libgomp.fortran/pr27416-1.f90  -O3 -fomit-frame-pointer  (test for excess errors)
WARNING: libgomp.fortran/pr27416-1.f90  -O3 -fomit-frame-pointer  compilation failed to produce executable
FAIL: libgomp.fortran/pr27416-1.f90  -O3 -fomit-frame-pointer -funroll-loops  (test for excess errors)
WARNING: libgomp.fortran/pr27416-1.f90  -O3 -fomit-frame-pointer -funroll-loops  compilation failed to produce executable
FAIL: libgomp.fortran/pr27416-1.f90  -O3 -fomit-frame-pointer -funroll-all-loops -finline-functions  (test for excess errors)
WARNING: libgomp.fortran/pr27416-1.f90  -O3 -fomit-frame-pointer -funroll-all-loops -finline-functions  compilation failed to produce executable
FAIL: libgomp.fortran/pr27416-1.f90  -O3 -g  (test for excess errors)
WARNING: libgomp.fortran/pr27416-1.f90  -O3 -g  compilation failed to produce executable
FAIL: libgomp.fortran/pr27416-1.f90  -Os  (test for excess errors)
WARNING: libgomp.fortran/pr27416-1.f90  -Os  compilation failed to produce executable
FAIL: libgomp.fortran/pr27916-1.f90  -O0  (test for excess errors)
WARNING: libgomp.fortran/pr27916-1.f90  -O0  compilation failed to produce executable
FAIL: libgomp.fortran/pr27916-1.f90  -O1  (test for excess errors)
WARNING: libgomp.fortran/pr27916-1.f90  -O1  compilation failed to produce executable
FAIL: libgomp.fortran/pr27916-1.f90  -O2  (test for excess errors)
WARNING: libgomp.fortran/pr27916-1.f90  -O2  compilation failed to produce executable
FAIL: libgomp.fortran/pr27916-1.f90  -O3 -fomit-frame-pointer  (test for excess errors)
WARNING: libgomp.fortran/pr27916-1.f90  -O3 -fomit-frame-pointer  compilation failed to produce executable
FAIL: libgomp.fortran/pr27916-1.f90  -O3 -fomit-frame-pointer -funroll-loops  (test for excess errors)
WARNING: libgomp.fortran/pr27916-1.f90  -O3 -fomit-frame-pointer -funroll-loops  compilation failed to produce executable
FAIL: libgomp.fortran/pr27916-1.f90  -O3 -fomit-frame-pointer -funroll-all-loops -finline-functions  (test for excess errors)
WARNING: libgomp.fortran/pr27916-1.f90  -O3 -fomit-frame-pointer -funroll-all-loops -finline-functions  compilation failed to produce executable
FAIL: libgomp.fortran/pr27916-1.f90  -O3 -g  (test for excess errors)
WARNING: libgomp.fortran/pr27916-1.f90  -O3 -g  compilation failed to produce executable
FAIL: libgomp.fortran/pr27916-1.f90  -Os  (test for excess errors)
WARNING: libgomp.fortran/pr27916-1.f90  -Os  compilation failed to produce executable
FAIL: libgomp.fortran/pr27916-2.f90  -O0  (test for excess errors)
WARNING: libgomp.fortran/pr27916-2.f90  -O0  compilation failed to produce executable
FAIL: libgomp.fortran/pr27916-2.f90  -O1  (test for excess errors)
WARNING: libgomp.fortran/pr27916-2.f90  -O1  compilation failed to produce executable
FAIL: libgomp.fortran/pr27916-2.f90  -O2  (test for excess errors)
WARNING: libgomp.fortran/pr27916-2.f90  -O2  compilation failed to produce executable
FAIL: libgomp.fortran/pr27916-2.f90  -O3 -fomit-frame-pointer  (test for excess errors)
WARNING: libgomp.fortran/pr27916-2.f90  -O3 -fomit-frame-pointer  compilation failed to produce executable
FAIL: libgomp.fortran/pr27916-2.f90  -O3 -fomit-frame-pointer -funroll-loops  (test for excess errors)
WARNING: libgomp.fortran/pr27916-2.f90  -O3 -fomit-frame-pointer -funroll-loops  compilation failed to produce executable
FAIL: libgomp.fortran/pr27916-2.f90  -O3 -fomit-frame-pointer -funroll-all-loops -finline-functions  (test for excess errors)
WARNING: libgomp.fortran/pr27916-2.f90  -O3 -fomit-frame-pointer -funroll-all-loops -finline-functions  compilation failed to produce executable
FAIL: libgomp.fortran/pr27916-2.f90  -O3 -g  (test for excess errors)
WARNING: libgomp.fortran/pr27916-2.f90  -O3 -g  compilation failed to produce executable
FAIL: libgomp.fortran/pr27916-2.f90  -Os  (test for excess errors)
WARNING: libgomp.fortran/pr27916-2.f90  -Os  compilation failed to produce executable
FAIL: libgomp.fortran/pr28390.f  -O  (test for excess errors)
WARNING: libgomp.fortran/pr28390.f  -O  compilation failed to produce executable
FAIL: libgomp.fortran/pr29629.f90  -O0  (test for excess errors)
WARNING: libgomp.fortran/pr29629.f90  -O0  compilation failed to produce executable
FAIL: libgomp.fortran/pr29629.f90  -O1  (test for excess errors)
WARNING: libgomp.fortran/pr29629.f90  -O1  compilation failed to produce executable
FAIL: libgomp.fortran/pr29629.f90  -O2  (test for excess errors)
WARNING: libgomp.fortran/pr29629.f90  -O2  compilation failed to produce executable
FAIL: libgomp.fortran/pr29629.f90  -O3 -fomit-frame-pointer  (test for excess errors)
WARNING: libgomp.fortran/pr29629.f90  -O3 -fomit-frame-pointer  compilation failed to produce executable
FAIL: libgomp.fortran/pr29629.f90  -O3 -fomit-frame-pointer -funroll-loops  (test for excess errors)
WARNING: libgomp.fortran/pr29629.f90  -O3 -fomit-frame-pointer -funroll-loops  compilation failed to produce executable
FAIL: libgomp.fortran/pr29629.f90  -O3 -fomit-frame-pointer -funroll-all-loops -finline-functions  (test for excess errors)
WARNING: libgomp.fortran/pr29629.f90  -O3 -fomit-frame-pointer -funroll-all-loops -finline-functions  compilation failed to produce executable
FAIL: libgomp.fortran/pr29629.f90  -O3 -g  (test for excess errors)
WARNING: libgomp.fortran/pr29629.f90  -O3 -g  compilation failed to produce executable
FAIL: libgomp.fortran/pr29629.f90  -Os  (test for excess errors)
WARNING: libgomp.fortran/pr29629.f90  -Os  compilation failed to produce executable
FAIL: libgomp.fortran/pr32550.f90  -O0  (test for excess errors)
WARNING: libgomp.fortran/pr32550.f90  -O0  compilation failed to produce executable
FAIL: libgomp.fortran/pr32550.f90  -O1  (test for excess errors)
WARNING: libgomp.fortran/pr32550.f90  -O1  compilation failed to produce executable
FAIL: libgomp.fortran/pr32550.f90  -O2  (test for excess errors)
WARNING: libgomp.fortran/pr32550.f90  -O2  compilation failed to produce executable
FAIL: libgomp.fortran/pr32550.f90  -O3 -fomit-frame-pointer  (test for excess errors)
WARNING: libgomp.fortran/pr32550.f90  -O3 -fomit-frame-pointer  compilation failed to produce executable
FAIL: libgomp.fortran/pr32550.f90  -O3 -fomit-frame-pointer -funroll-loops  (test for excess errors)
WARNING: libgomp.fortran/pr32550.f90  -O3 -fomit-frame-pointer -funroll-loops  compilation failed to produce executable
FAIL: libgomp.fortran/pr32550.f90  -O3 -fomit-frame-pointer -funroll-all-loops -finline-functions  (test for excess errors)
WARNING: libgomp.fortran/pr32550.f90  -O3 -fomit-frame-pointer -funroll-all-loops -finline-functions  compilation failed to produce executable
FAIL: libgomp.fortran/pr32550.f90  -O3 -g  (test for excess errors)
WARNING: libgomp.fortran/pr32550.f90  -O3 -g  compilation failed to produce executable
FAIL: libgomp.fortran/pr32550.f90  -Os  (test for excess errors)
WARNING: libgomp.fortran/pr32550.f90  -Os  compilation failed to produce executable
FAIL: libgomp.fortran/pr33880.f90  -O0  (test for excess errors)
WARNING: libgomp.fortran/pr33880.f90  -O0  compilation failed to produce executable
FAIL: libgomp.fortran/pr33880.f90  -O1  (test for excess errors)
WARNING: libgomp.fortran/pr33880.f90  -O1  compilation failed to produce executable
FAIL: libgomp.fortran/pr33880.f90  -O2  (test for excess errors)
WARNING: libgomp.fortran/pr33880.f90  -O2  compilation failed to produce executable
FAIL: libgomp.fortran/pr33880.f90  -O3 -fomit-frame-pointer  (test for excess errors)
WARNING: libgomp.fortran/pr33880.f90  -O3 -fomit-frame-pointer  compilation failed to produce executable
FAIL: libgomp.fortran/pr33880.f90  -O3 -fomit-frame-pointer -funroll-loops  (test for excess errors)
WARNING: libgomp.fortran/pr33880.f90  -O3 -fomit-frame-pointer -funroll-loops  compilation failed to produce executable
FAIL: libgomp.fortran/pr33880.f90  -O3 -fomit-frame-pointer -funroll-all-loops -finline-functions  (test for excess errors)
WARNING: libgomp.fortran/pr33880.f90  -O3 -fomit-frame-pointer -funroll-all-loops -finline-functions  compilation failed to produce executable
FAIL: libgomp.fortran/pr33880.f90  -O3 -g  (test for excess errors)
WARNING: libgomp.fortran/pr33880.f90  -O3 -g  compilation failed to produce executable
FAIL: libgomp.fortran/pr33880.f90  -Os  (test for excess errors)
WARNING: libgomp.fortran/pr33880.f90  -Os  compilation failed to produce executable
FAIL: libgomp.fortran/pr34020.f90  -O0  (test for excess errors)
WARNING: libgomp.fortran/pr34020.f90  -O0  compilation failed to produce executable
FAIL: libgomp.fortran/pr34020.f90  -O1  (test for excess errors)
WARNING: libgomp.fortran/pr34020.f90  -O1  compilation failed to produce executable
FAIL: libgomp.fortran/pr34020.f90  -O2  (test for excess errors)
WARNING: libgomp.fortran/pr34020.f90  -O2  compilation failed to produce executable
FAIL: libgomp.fortran/pr34020.f90  -O3 -fomit-frame-pointer  (test for excess errors)
WARNING: libgomp.fortran/pr34020.f90  -O3 -fomit-frame-pointer  compilation failed to produce executable
FAIL: libgomp.fortran/pr34020.f90  -O3 -fomit-frame-pointer -funroll-loops  (test for excess errors)
WARNING: libgomp.fortran/pr34020.f90  -O3 -fomit-frame-pointer -funroll-loops  compilation failed to produce executable
FAIL: libgomp.fortran/pr34020.f90  -O3 -fomit-frame-pointer -funroll-all-loops -finline-functions  (test for excess errors)
WARNING: libgomp.fortran/pr34020.f90  -O3 -fomit-frame-pointer -funroll-all-loops -finline-functions  compilation failed to produce executable
FAIL: libgomp.fortran/pr34020.f90  -O3 -g  (test for excess errors)
WARNING: libgomp.fortran/pr34020.f90  -O3 -g  compilation failed to produce executable
FAIL: libgomp.fortran/pr34020.f90  -Os  (test for excess errors)
WARNING: libgomp.fortran/pr34020.f90  -Os  compilation failed to produce executable
FAIL: libgomp.fortran/pr35130.f90  -O  (test for excess errors)
WARNING: libgomp.fortran/pr35130.f90  -O  compilation failed to produce executable
FAIL: libgomp.fortran/reduction1.f90  -O0  (test for excess errors)
WARNING: libgomp.fortran/reduction1.f90  -O0  compilation failed to produce executable
FAIL: libgomp.fortran/reduction1.f90  -O1  (test for excess errors)
WARNING: libgomp.fortran/reduction1.f90  -O1  compilation failed to produce executable
FAIL: libgomp.fortran/reduction1.f90  -O2  (test for excess errors)
WARNING: libgomp.fortran/reduction1.f90  -O2  compilation failed to produce executable
FAIL: libgomp.fortran/reduction1.f90  -O3 -fomit-frame-pointer  (test for excess errors)
WARNING: libgomp.fortran/reduction1.f90  -O3 -fomit-frame-pointer  compilation failed to produce executable
FAIL: libgomp.fortran/reduction1.f90  -O3 -fomit-frame-pointer -funroll-loops  (test for excess errors)
WARNING: libgomp.fortran/reduction1.f90  -O3 -fomit-frame-pointer -funroll-loops  compilation failed to produce executable
FAIL: libgomp.fortran/reduction1.f90  -O3 -fomit-frame-pointer -funroll-all-loops -finline-functions  (test for excess errors)
WARNING: libgomp.fortran/reduction1.f90  -O3 -fomit-frame-pointer -funroll-all-loops -finline-functions  compilation failed to produce executable
FAIL: libgomp.fortran/reduction1.f90  -O3 -g  (test for excess errors)
WARNING: libgomp.fortran/reduction1.f90  -O3 -g  compilation failed to produce executable
FAIL: libgomp.fortran/reduction1.f90  -Os  (test for excess errors)
WARNING: libgomp.fortran/reduction1.f90  -Os  compilation failed to produce executable
FAIL: libgomp.fortran/reduction2.f90  -O0  (test for excess errors)
WARNING: libgomp.fortran/reduction2.f90  -O0  compilation failed to produce executable
FAIL: libgomp.fortran/reduction2.f90  -O1  (test for excess errors)
WARNING: libgomp.fortran/reduction2.f90  -O1  compilation failed to produce executable
FAIL: libgomp.fortran/reduction2.f90  -O2  (test for excess errors)
WARNING: libgomp.fortran/reduction2.f90  -O2  compilation failed to produce executable
FAIL: libgomp.fortran/reduction2.f90  -O3 -fomit-frame-pointer  (test for excess errors)
WARNING: libgomp.fortran/reduction2.f90  -O3 -fomit-frame-pointer  compilation failed to produce executable
FAIL: libgomp.fortran/reduction2.f90  -O3 -fomit-frame-pointer -funroll-loops  (test for excess errors)
WARNING: libgomp.fortran/reduction2.f90  -O3 -fomit-frame-pointer -funroll-loops  compilation failed to produce executable
FAIL: libgomp.fortran/reduction2.f90  -O3 -fomit-frame-pointer -funroll-all-loops -finline-functions  (test for excess errors)
WARNING: libgomp.fortran/reduction2.f90  -O3 -fomit-frame-pointer -funroll-all-loops -finline-functions  compilation failed to produce executable
FAIL: libgomp.fortran/reduction2.f90  -O3 -g  (test for excess errors)
WARNING: libgomp.fortran/reduction2.f90  -O3 -g  compilation failed to produce executable
FAIL: libgomp.fortran/reduction2.f90  -Os  (test for excess errors)
WARNING: libgomp.fortran/reduction2.f90  -Os  compilation failed to produce executable
FAIL: libgomp.fortran/reduction3.f90  -O0  (test for excess errors)
WARNING: libgomp.fortran/reduction3.f90  -O0  compilation failed to produce executable
FAIL: libgomp.fortran/reduction3.f90  -O1  (test for excess errors)
WARNING: libgomp.fortran/reduction3.f90  -O1  compilation failed to produce executable
FAIL: libgomp.fortran/reduction3.f90  -O2  (test for excess errors)
WARNING: libgomp.fortran/reduction3.f90  -O2  compilation failed to produce executable
FAIL: libgomp.fortran/reduction3.f90  -O3 -fomit-frame-pointer  (test for excess errors)
WARNING: libgomp.fortran/reduction3.f90  -O3 -fomit-frame-pointer  compilation failed to produce executable
FAIL: libgomp.fortran/reduction3.f90  -O3 -fomit-frame-pointer -funroll-loops  (test for excess errors)
WARNING: libgomp.fortran/reduction3.f90  -O3 -fomit-frame-pointer -funroll-loops  compilation failed to produce executable
FAIL: libgomp.fortran/reduction3.f90  -O3 -fomit-frame-pointer -funroll-all-loops -finline-functions  (test for excess errors)
WARNING: libgomp.fortran/reduction3.f90  -O3 -fomit-frame-pointer -funroll-all-loops -finline-functions  compilation failed to produce executable
FAIL: libgomp.fortran/reduction3.f90  -O3 -g  (test for excess errors)
WARNING: libgomp.fortran/reduction3.f90  -O3 -g  compilation failed to produce executable
FAIL: libgomp.fortran/reduction3.f90  -Os  (test for excess errors)
WARNING: libgomp.fortran/reduction3.f90  -Os  compilation failed to produce executable
FAIL: libgomp.fortran/reduction4.f90  -O0  (test for excess errors)
WARNING: libgomp.fortran/reduction4.f90  -O0  compilation failed to produce executable
FAIL: libgomp.fortran/reduction4.f90  -O1  (test for excess errors)
WARNING: libgomp.fortran/reduction4.f90  -O1  compilation failed to produce executable
FAIL: libgomp.fortran/reduction4.f90  -O2  (test for excess errors)
WARNING: libgomp.fortran/reduction4.f90  -O2  compilation failed to produce executable
FAIL: libgomp.fortran/reduction4.f90  -O3 -fomit-frame-pointer  (test for excess errors)
WARNING: libgomp.fortran/reduction4.f90  -O3 -fomit-frame-pointer  compilation failed to produce executable
FAIL: libgomp.fortran/reduction4.f90  -O3 -fomit-frame-pointer -funroll-loops  (test for excess errors)
WARNING: libgomp.fortran/reduction4.f90  -O3 -fomit-frame-pointer -funroll-loops  compilation failed to produce executable
FAIL: libgomp.fortran/reduction4.f90  -O3 -fomit-frame-pointer -funroll-all-loops -finline-functions  (test for excess errors)
WARNING: libgomp.fortran/reduction4.f90  -O3 -fomit-frame-pointer -funroll-all-loops -finline-functions  compilation failed to produce executable
FAIL: libgomp.fortran/reduction4.f90  -O3 -g  (test for excess errors)
WARNING: libgomp.fortran/reduction4.f90  -O3 -g  compilation failed to produce executable
FAIL: libgomp.fortran/reduction4.f90  -Os  (test for excess errors)
WARNING: libgomp.fortran/reduction4.f90  -Os  compilation failed to produce executable
FAIL: libgomp.fortran/reduction5.f90  -O0  (test for excess errors)
WARNING: libgomp.fortran/reduction5.f90  -O0  compilation failed to produce executable
FAIL: libgomp.fortran/reduction5.f90  -O1  (test for excess errors)
WARNING: libgomp.fortran/reduction5.f90  -O1  compilation failed to produce executable
FAIL: libgomp.fortran/reduction5.f90  -O2  (test for excess errors)
WARNING: libgomp.fortran/reduction5.f90  -O2  compilation failed to produce executable
FAIL: libgomp.fortran/reduction5.f90  -O3 -fomit-frame-pointer  (test for excess errors)
WARNING: libgomp.fortran/reduction5.f90  -O3 -fomit-frame-pointer  compilation failed to produce executable
FAIL: libgomp.fortran/reduction5.f90  -O3 -fomit-frame-pointer -funroll-loops  (test for excess errors)
WARNING: libgomp.fortran/reduction5.f90  -O3 -fomit-frame-pointer -funroll-loops  compilation failed to produce executable
FAIL: libgomp.fortran/reduction5.f90  -O3 -fomit-frame-pointer -funroll-all-loops -finline-functions  (test for excess errors)
WARNING: libgomp.fortran/reduction5.f90  -O3 -fomit-frame-pointer -funroll-all-loops -finline-functions  compilation failed to produce executable
FAIL: libgomp.fortran/reduction5.f90  -O3 -g  (test for excess errors)
WARNING: libgomp.fortran/reduction5.f90  -O3 -g  compilation failed to produce executable
FAIL: libgomp.fortran/reduction5.f90  -Os  (test for excess errors)
WARNING: libgomp.fortran/reduction5.f90  -Os  compilation failed to produce executable
FAIL: libgomp.fortran/reduction6.f90  -O0  (test for excess errors)
WARNING: libgomp.fortran/reduction6.f90  -O0  compilation failed to produce executable
FAIL: libgomp.fortran/reduction6.f90  -O1  (test for excess errors)
WARNING: libgomp.fortran/reduction6.f90  -O1  compilation failed to produce executable
FAIL: libgomp.fortran/reduction6.f90  -O2  (test for excess errors)
WARNING: libgomp.fortran/reduction6.f90  -O2  compilation failed to produce executable
FAIL: libgomp.fortran/reduction6.f90  -O3 -fomit-frame-pointer  (test for excess errors)
WARNING: libgomp.fortran/reduction6.f90  -O3 -fomit-frame-pointer  compilation failed to produce executable
FAIL: libgomp.fortran/reduction6.f90  -O3 -fomit-frame-pointer -funroll-loops  (test for excess errors)
WARNING: libgomp.fortran/reduction6.f90  -O3 -fomit-frame-pointer -funroll-loops  compilation failed to produce executable
FAIL: libgomp.fortran/reduction6.f90  -O3 -fomit-frame-pointer -funroll-all-loops -finline-functions  (test for excess errors)
WARNING: libgomp.fortran/reduction6.f90  -O3 -fomit-frame-pointer -funroll-all-loops -finline-functions  compilation failed to produce executable
FAIL: libgomp.fortran/reduction6.f90  -O3 -g  (test for excess errors)
WARNING: libgomp.fortran/reduction6.f90  -O3 -g  compilation failed to produce executable
FAIL: libgomp.fortran/reduction6.f90  -Os  (test for excess errors)
WARNING: libgomp.fortran/reduction6.f90  -Os  compilation failed to produce executable
FAIL: libgomp.fortran/reference1.f90  -O0  (test for excess errors)
WARNING: libgomp.fortran/reference1.f90  -O0  compilation failed to produce executable
FAIL: libgomp.fortran/reference1.f90  -O1  (test for excess errors)
WARNING: libgomp.fortran/reference1.f90  -O1  compilation failed to produce executable
FAIL: libgomp.fortran/reference1.f90  -O2  (test for excess errors)
WARNING: libgomp.fortran/reference1.f90  -O2  compilation failed to produce executable
FAIL: libgomp.fortran/reference1.f90  -O3 -fomit-frame-pointer  (test for excess errors)
WARNING: libgomp.fortran/reference1.f90  -O3 -fomit-frame-pointer  compilation failed to produce executable
FAIL: libgomp.fortran/reference1.f90  -O3 -fomit-frame-pointer -funroll-loops  (test for excess errors)
WARNING: libgomp.fortran/reference1.f90  -O3 -fomit-frame-pointer -funroll-loops  compilation failed to produce executable
FAIL: libgomp.fortran/reference1.f90  -O3 -fomit-frame-pointer -funroll-all-loops -finline-functions  (test for excess errors)
WARNING: libgomp.fortran/reference1.f90  -O3 -fomit-frame-pointer -funroll-all-loops -finline-functions  compilation failed to produce executable
FAIL: libgomp.fortran/reference1.f90  -O3 -g  (test for excess errors)
WARNING: libgomp.fortran/reference1.f90  -O3 -g  compilation failed to produce executable
FAIL: libgomp.fortran/reference1.f90  -Os  (test for excess errors)
WARNING: libgomp.fortran/reference1.f90  -Os  compilation failed to produce executable
FAIL: libgomp.fortran/reference2.f90  -O0  (test for excess errors)
WARNING: libgomp.fortran/reference2.f90  -O0  compilation failed to produce executable
FAIL: libgomp.fortran/reference2.f90  -O1  (test for excess errors)
WARNING: libgomp.fortran/reference2.f90  -O1  compilation failed to produce executable
FAIL: libgomp.fortran/reference2.f90  -O2  (test for excess errors)
WARNING: libgomp.fortran/reference2.f90  -O2  compilation failed to produce executable
FAIL: libgomp.fortran/reference2.f90  -O3 -fomit-frame-pointer  (test for excess errors)
WARNING: libgomp.fortran/reference2.f90  -O3 -fomit-frame-pointer  compilation failed to produce executable
FAIL: libgomp.fortran/reference2.f90  -O3 -fomit-frame-pointer -funroll-loops  (test for excess errors)
WARNING: libgomp.fortran/reference2.f90  -O3 -fomit-frame-pointer -funroll-loops  compilation failed to produce executable
FAIL: libgomp.fortran/reference2.f90  -O3 -fomit-frame-pointer -funroll-all-loops -finline-functions  (test for excess errors)
WARNING: libgomp.fortran/reference2.f90  -O3 -fomit-frame-pointer -funroll-all-loops -finline-functions  compilation failed to produce executable
FAIL: libgomp.fortran/reference2.f90  -O3 -g  (test for excess errors)
WARNING: libgomp.fortran/reference2.f90  -O3 -g  compilation failed to produce executable
FAIL: libgomp.fortran/reference2.f90  -Os  (test for excess errors)
WARNING: libgomp.fortran/reference2.f90  -Os  compilation failed to produce executable
FAIL: libgomp.fortran/retval1.f90  -O0  (test for excess errors)
WARNING: libgomp.fortran/retval1.f90  -O0  compilation failed to produce executable
FAIL: libgomp.fortran/retval1.f90  -O1  (test for excess errors)
WARNING: libgomp.fortran/retval1.f90  -O1  compilation failed to produce executable
FAIL: libgomp.fortran/retval1.f90  -O2  (test for excess errors)
WARNING: libgomp.fortran/retval1.f90  -O2  compilation failed to produce executable
FAIL: libgomp.fortran/retval1.f90  -O3 -fomit-frame-pointer  (test for excess errors)
WARNING: libgomp.fortran/retval1.f90  -O3 -fomit-frame-pointer  compilation failed to produce executable
FAIL: libgomp.fortran/retval1.f90  -O3 -fomit-frame-pointer -funroll-loops  (test for excess errors)
WARNING: libgomp.fortran/retval1.f90  -O3 -fomit-frame-pointer -funroll-loops  compilation failed to produce executable
FAIL: libgomp.fortran/retval1.f90  -O3 -fomit-frame-pointer -funroll-all-loops -finline-functions  (test for excess errors)
WARNING: libgomp.fortran/retval1.f90  -O3 -fomit-frame-pointer -funroll-all-loops -finline-functions  compilation failed to produce executable
FAIL: libgomp.fortran/retval1.f90  -O3 -g  (test for excess errors)
WARNING: libgomp.fortran/retval1.f90  -O3 -g  compilation failed to produce executable
FAIL: libgomp.fortran/retval1.f90  -Os  (test for excess errors)
WARNING: libgomp.fortran/retval1.f90  -Os  compilation failed to produce executable
FAIL: libgomp.fortran/retval2.f90  -O0  (test for excess errors)
WARNING: libgomp.fortran/retval2.f90  -O0  compilation failed to produce executable
FAIL: libgomp.fortran/retval2.f90  -O1  (test for excess errors)
WARNING: libgomp.fortran/retval2.f90  -O1  compilation failed to produce executable
FAIL: libgomp.fortran/retval2.f90  -O2  (test for excess errors)
WARNING: libgomp.fortran/retval2.f90  -O2  compilation failed to produce executable
FAIL: libgomp.fortran/retval2.f90  -O3 -fomit-frame-pointer  (test for excess errors)
WARNING: libgomp.fortran/retval2.f90  -O3 -fomit-frame-pointer  compilation failed to produce executable
FAIL: libgomp.fortran/retval2.f90  -O3 -fomit-frame-pointer -funroll-loops  (test for excess errors)
WARNING: libgomp.fortran/retval2.f90  -O3 -fomit-frame-pointer -funroll-loops  compilation failed to produce executable
FAIL: libgomp.fortran/retval2.f90  -O3 -fomit-frame-pointer -funroll-all-loops -finline-functions  (test for excess errors)
WARNING: libgomp.fortran/retval2.f90  -O3 -fomit-frame-pointer -funroll-all-loops -finline-functions  compilation failed to produce executable
FAIL: libgomp.fortran/retval2.f90  -O3 -g  (test for excess errors)
WARNING: libgomp.fortran/retval2.f90  -O3 -g  compilation failed to produce executable
FAIL: libgomp.fortran/retval2.f90  -Os  (test for excess errors)
WARNING: libgomp.fortran/retval2.f90  -Os  compilation failed to produce executable
FAIL: libgomp.fortran/sharing1.f90  -O0  (test for excess errors)
WARNING: libgomp.fortran/sharing1.f90  -O0  compilation failed to produce executable
FAIL: libgomp.fortran/sharing1.f90  -O1  (test for excess errors)
WARNING: libgomp.fortran/sharing1.f90  -O1  compilation failed to produce executable
FAIL: libgomp.fortran/sharing1.f90  -O2  (test for excess errors)
WARNING: libgomp.fortran/sharing1.f90  -O2  compilation failed to produce executable
FAIL: libgomp.fortran/sharing1.f90  -O3 -fomit-frame-pointer  (test for excess errors)
WARNING: libgomp.fortran/sharing1.f90  -O3 -fomit-frame-pointer  compilation failed to produce executable
FAIL: libgomp.fortran/sharing1.f90  -O3 -fomit-frame-pointer -funroll-loops  (test for excess errors)
WARNING: libgomp.fortran/sharing1.f90  -O3 -fomit-frame-pointer -funroll-loops  compilation failed to produce executable
FAIL: libgomp.fortran/sharing1.f90  -O3 -fomit-frame-pointer -funroll-all-loops -finline-functions  (test for excess errors)
WARNING: libgomp.fortran/sharing1.f90  -O3 -fomit-frame-pointer -funroll-all-loops -finline-functions  compilation failed to produce executable
FAIL: libgomp.fortran/sharing1.f90  -O3 -g  (test for excess errors)
WARNING: libgomp.fortran/sharing1.f90  -O3 -g  compilation failed to produce executable
FAIL: libgomp.fortran/sharing1.f90  -Os  (test for excess errors)
WARNING: libgomp.fortran/sharing1.f90  -Os  compilation failed to produce executable
FAIL: libgomp.fortran/sharing2.f90  -O0  (test for excess errors)
WARNING: libgomp.fortran/sharing2.f90  -O0  compilation failed to produce executable
FAIL: libgomp.fortran/sharing2.f90  -O1  (test for excess errors)
WARNING: libgomp.fortran/sharing2.f90  -O1  compilation failed to produce executable
FAIL: libgomp.fortran/sharing2.f90  -O2  (test for excess errors)
WARNING: libgomp.fortran/sharing2.f90  -O2  compilation failed to produce executable
FAIL: libgomp.fortran/sharing2.f90  -O3 -fomit-frame-pointer  (test for excess errors)
WARNING: libgomp.fortran/sharing2.f90  -O3 -fomit-frame-pointer  compilation failed to produce executable
FAIL: libgomp.fortran/sharing2.f90  -O3 -fomit-frame-pointer -funroll-loops  (test for excess errors)
WARNING: libgomp.fortran/sharing2.f90  -O3 -fomit-frame-pointer -funroll-loops  compilation failed to produce executable
FAIL: libgomp.fortran/sharing2.f90  -O3 -fomit-frame-pointer -funroll-all-loops -finline-functions  (test for excess errors)
WARNING: libgomp.fortran/sharing2.f90  -O3 -fomit-frame-pointer -funroll-all-loops -finline-functions  compilation failed to produce executable
FAIL: libgomp.fortran/sharing2.f90  -O3 -g  (test for excess errors)
WARNING: libgomp.fortran/sharing2.f90  -O3 -g  compilation failed to produce executable
FAIL: libgomp.fortran/sharing2.f90  -Os  (test for excess errors)
WARNING: libgomp.fortran/sharing2.f90  -Os  compilation failed to produce executable
FAIL: libgomp.fortran/stack.f90  -O0  (test for excess errors)
WARNING: libgomp.fortran/stack.f90  -O0  compilation failed to produce executable
FAIL: libgomp.fortran/stack.f90  -O1  (test for excess errors)
WARNING: libgomp.fortran/stack.f90  -O1  compilation failed to produce executable
FAIL: libgomp.fortran/stack.f90  -O2  (test for excess errors)
WARNING: libgomp.fortran/stack.f90  -O2  compilation failed to produce executable
FAIL: libgomp.fortran/stack.f90  -O3 -fomit-frame-pointer  (test for excess errors)
WARNING: libgomp.fortran/stack.f90  -O3 -fomit-frame-pointer  compilation failed to produce executable
FAIL: libgomp.fortran/stack.f90  -O3 -fomit-frame-pointer -funroll-loops  (test for excess errors)
WARNING: libgomp.fortran/stack.f90  -O3 -fomit-frame-pointer -funroll-loops  compilation failed to produce executable
FAIL: libgomp.fortran/stack.f90  -O3 -fomit-frame-pointer -funroll-all-loops -finline-functions  (test for excess errors)
WARNING: libgomp.fortran/stack.f90  -O3 -fomit-frame-pointer -funroll-all-loops -finline-functions  compilation failed to produce executable
FAIL: libgomp.fortran/stack.f90  -O3 -g  (test for excess errors)
WARNING: libgomp.fortran/stack.f90  -O3 -g  compilation failed to produce executable
FAIL: libgomp.fortran/stack.f90  -Os  (test for excess errors)
WARNING: libgomp.fortran/stack.f90  -Os  compilation failed to produce executable
FAIL: libgomp.fortran/strassen.f90  -O  (test for excess errors)
WARNING: libgomp.fortran/strassen.f90  -O  compilation failed to produce executable
FAIL: libgomp.fortran/tabs1.f90  -O  (test for excess errors)
WARNING: libgomp.fortran/tabs1.f90  -O  compilation failed to produce executable
FAIL: libgomp.fortran/tabs2.f  -O  (test for excess errors)
WARNING: libgomp.fortran/tabs2.f  -O  compilation failed to produce executable
FAIL: libgomp.fortran/task1.f90  -O0  (test for excess errors)
WARNING: libgomp.fortran/task1.f90  -O0  compilation failed to produce executable
FAIL: libgomp.fortran/task1.f90  -O1  (test for excess errors)
WARNING: libgomp.fortran/task1.f90  -O1  compilation failed to produce executable
FAIL: libgomp.fortran/task1.f90  -O2  (test for excess errors)
WARNING: libgomp.fortran/task1.f90  -O2  compilation failed to produce executable
FAIL: libgomp.fortran/task1.f90  -O3 -fomit-frame-pointer  (test for excess errors)
WARNING: libgomp.fortran/task1.f90  -O3 -fomit-frame-pointer  compilation failed to produce executable
FAIL: libgomp.fortran/task1.f90  -O3 -fomit-frame-pointer -funroll-loops  (test for excess errors)
WARNING: libgomp.fortran/task1.f90  -O3 -fomit-frame-pointer -funroll-loops  compilation failed to produce executable
FAIL: libgomp.fortran/task1.f90  -O3 -fomit-frame-pointer -funroll-all-loops -finline-functions  (test for excess errors)
WARNING: libgomp.fortran/task1.f90  -O3 -fomit-frame-pointer -funroll-all-loops -finline-functions  compilation failed to produce executable
FAIL: libgomp.fortran/task1.f90  -O3 -g  (test for excess errors)
WARNING: libgomp.fortran/task1.f90  -O3 -g  compilation failed to produce executable
FAIL: libgomp.fortran/task1.f90  -Os  (test for excess errors)
WARNING: libgomp.fortran/task1.f90  -Os  compilation failed to produce executable
FAIL: libgomp.fortran/task2.f90  -O  (test for excess errors)
WARNING: libgomp.fortran/task2.f90  -O  compilation failed to produce executable
FAIL: libgomp.fortran/vla1.f90  -O0  (test for excess errors)
WARNING: libgomp.fortran/vla1.f90  -O0  compilation failed to produce executable
FAIL: libgomp.fortran/vla1.f90  -O1  (test for excess errors)
WARNING: libgomp.fortran/vla1.f90  -O1  compilation failed to produce executable
FAIL: libgomp.fortran/vla1.f90  -O2  (test for excess errors)
WARNING: libgomp.fortran/vla1.f90  -O2  compilation failed to produce executable
FAIL: libgomp.fortran/vla1.f90  -O3 -fomit-frame-pointer  (test for excess errors)
WARNING: libgomp.fortran/vla1.f90  -O3 -fomit-frame-pointer  compilation failed to produce executable
FAIL: libgomp.fortran/vla1.f90  -O3 -fomit-frame-pointer -funroll-loops  (test for excess errors)
WARNING: libgomp.fortran/vla1.f90  -O3 -fomit-frame-pointer -funroll-loops  compilation failed to produce executable
FAIL: libgomp.fortran/vla1.f90  -O3 -fomit-frame-pointer -funroll-all-loops -finline-functions  (test for excess errors)
WARNING: libgomp.fortran/vla1.f90  -O3 -fomit-frame-pointer -funroll-all-loops -finline-functions  compilation failed to produce executable
FAIL: libgomp.fortran/vla1.f90  -O3 -g  (test for excess errors)
WARNING: libgomp.fortran/vla1.f90  -O3 -g  compilation failed to produce executable
FAIL: libgomp.fortran/vla1.f90  -Os  (test for excess errors)
WARNING: libgomp.fortran/vla1.f90  -Os  compilation failed to produce executable
FAIL: libgomp.fortran/vla2.f90  -O0  (test for excess errors)
WARNING: libgomp.fortran/vla2.f90  -O0  compilation failed to produce executable
FAIL: libgomp.fortran/vla2.f90  -O1  (test for excess errors)
WARNING: libgomp.fortran/vla2.f90  -O1  compilation failed to produce executable
FAIL: libgomp.fortran/vla2.f90  -O2  (test for excess errors)
WARNING: libgomp.fortran/vla2.f90  -O2  compilation failed to produce executable
FAIL: libgomp.fortran/vla2.f90  -O3 -fomit-frame-pointer  (test for excess errors)
WARNING: libgomp.fortran/vla2.f90  -O3 -fomit-frame-pointer  compilation failed to produce executable
FAIL: libgomp.fortran/vla2.f90  -O3 -fomit-frame-pointer -funroll-loops  (test for excess errors)
WARNING: libgomp.fortran/vla2.f90  -O3 -fomit-frame-pointer -funroll-loops  compilation failed to produce executable
FAIL: libgomp.fortran/vla2.f90  -O3 -fomit-frame-pointer -funroll-all-loops -finline-functions  (test for excess errors)
WARNING: libgomp.fortran/vla2.f90  -O3 -fomit-frame-pointer -funroll-all-loops -finline-functions  compilation failed to produce executable
FAIL: libgomp.fortran/vla2.f90  -O3 -g  (test for excess errors)
WARNING: libgomp.fortran/vla2.f90  -O3 -g  compilation failed to produce executable
FAIL: libgomp.fortran/vla2.f90  -Os  (test for excess errors)
WARNING: libgomp.fortran/vla2.f90  -Os  compilation failed to produce executable
FAIL: libgomp.fortran/vla3.f90  -O0  (test for excess errors)
WARNING: libgomp.fortran/vla3.f90  -O0  compilation failed to produce executable
FAIL: libgomp.fortran/vla3.f90  -O1  (test for excess errors)
WARNING: libgomp.fortran/vla3.f90  -O1  compilation failed to produce executable
FAIL: libgomp.fortran/vla3.f90  -O2  (test for excess errors)
WARNING: libgomp.fortran/vla3.f90  -O2  compilation failed to produce executable
FAIL: libgomp.fortran/vla3.f90  -O3 -fomit-frame-pointer  (test for excess errors)
WARNING: libgomp.fortran/vla3.f90  -O3 -fomit-frame-pointer  compilation failed to produce executable
FAIL: libgomp.fortran/vla3.f90  -O3 -fomit-frame-pointer -funroll-loops  (test for excess errors)
WARNING: libgomp.fortran/vla3.f90  -O3 -fomit-frame-pointer -funroll-loops  compilation failed to produce executable
FAIL: libgomp.fortran/vla3.f90  -O3 -fomit-frame-pointer -funroll-all-loops -finline-functions  (test for excess errors)
WARNING: libgomp.fortran/vla3.f90  -O3 -fomit-frame-pointer -funroll-all-loops -finline-functions  compilation failed to produce executable
FAIL: libgomp.fortran/vla3.f90  -O3 -g  (test for excess errors)
WARNING: libgomp.fortran/vla3.f90  -O3 -g  compilation failed to produce executable
FAIL: libgomp.fortran/vla3.f90  -Os  (test for excess errors)
WARNING: libgomp.fortran/vla3.f90  -Os  compilation failed to produce executable
FAIL: libgomp.fortran/vla4.f90  -O0  (test for excess errors)
WARNING: libgomp.fortran/vla4.f90  -O0  compilation failed to produce executable
FAIL: libgomp.fortran/vla4.f90  -O1  (test for excess errors)
WARNING: libgomp.fortran/vla4.f90  -O1  compilation failed to produce executable
FAIL: libgomp.fortran/vla4.f90  -O2  (test for excess errors)
WARNING: libgomp.fortran/vla4.f90  -O2  compilation failed to produce executable
FAIL: libgomp.fortran/vla4.f90  -O3 -fomit-frame-pointer  (test for excess errors)
WARNING: libgomp.fortran/vla4.f90  -O3 -fomit-frame-pointer  compilation failed to produce executable
FAIL: libgomp.fortran/vla4.f90  -O3 -fomit-frame-pointer -funroll-loops  (test for excess errors)
WARNING: libgomp.fortran/vla4.f90  -O3 -fomit-frame-pointer -funroll-loops  compilation failed to produce executable
FAIL: libgomp.fortran/vla4.f90  -O3 -fomit-frame-pointer -funroll-all-loops -finline-functions  (test for excess errors)
WARNING: libgomp.fortran/vla4.f90  -O3 -fomit-frame-pointer -funroll-all-loops -finline-functions  compilation failed to produce executable
FAIL: libgomp.fortran/vla4.f90  -O3 -g  (test for excess errors)
WARNING: libgomp.fortran/vla4.f90  -O3 -g  compilation failed to produce executable
FAIL: libgomp.fortran/vla4.f90  -Os  (test for excess errors)
WARNING: libgomp.fortran/vla4.f90  -Os  compilation failed to produce executable
FAIL: libgomp.fortran/vla5.f90  -O0  (test for excess errors)
WARNING: libgomp.fortran/vla5.f90  -O0  compilation failed to produce executable
FAIL: libgomp.fortran/vla5.f90  -O1  (test for excess errors)
WARNING: libgomp.fortran/vla5.f90  -O1  compilation failed to produce executable
FAIL: libgomp.fortran/vla5.f90  -O2  (test for excess errors)
WARNING: libgomp.fortran/vla5.f90  -O2  compilation failed to produce executable
FAIL: libgomp.fortran/vla5.f90  -O3 -fomit-frame-pointer  (test for excess errors)
WARNING: libgomp.fortran/vla5.f90  -O3 -fomit-frame-pointer  compilation failed to produce executable
FAIL: libgomp.fortran/vla5.f90  -O3 -fomit-frame-pointer -funroll-loops  (test for excess errors)
WARNING: libgomp.fortran/vla5.f90  -O3 -fomit-frame-pointer -funroll-loops  compilation failed to produce executable
FAIL: libgomp.fortran/vla5.f90  -O3 -fomit-frame-pointer -funroll-all-loops -finline-functions  (test for excess errors)
WARNING: libgomp.fortran/vla5.f90  -O3 -fomit-frame-pointer -funroll-all-loops -finline-functions  compilation failed to produce executable
FAIL: libgomp.fortran/vla5.f90  -O3 -g  (test for excess errors)
WARNING: libgomp.fortran/vla5.f90  -O3 -g  compilation failed to produce executable
FAIL: libgomp.fortran/vla5.f90  -Os  (test for excess errors)
WARNING: libgomp.fortran/vla5.f90  -Os  compilation failed to produce executable
FAIL: libgomp.fortran/vla6.f90  -O0  (test for excess errors)
WARNING: libgomp.fortran/vla6.f90  -O0  compilation failed to produce executable
FAIL: libgomp.fortran/vla6.f90  -O1  (test for excess errors)
WARNING: libgomp.fortran/vla6.f90  -O1  compilation failed to produce executable
FAIL: libgomp.fortran/vla6.f90  -O2  (test for excess errors)
WARNING: libgomp.fortran/vla6.f90  -O2  compilation failed to produce executable
FAIL: libgomp.fortran/vla6.f90  -O3 -fomit-frame-pointer  (test for excess errors)
WARNING: libgomp.fortran/vla6.f90  -O3 -fomit-frame-pointer  compilation failed to produce executable
FAIL: libgomp.fortran/vla6.f90  -O3 -fomit-frame-pointer -funroll-loops  (test for excess errors)
WARNING: libgomp.fortran/vla6.f90  -O3 -fomit-frame-pointer -funroll-loops  compilation failed to produce executable
FAIL: libgomp.fortran/vla6.f90  -O3 -fomit-frame-pointer -funroll-all-loops -finline-functions  (test for excess errors)
WARNING: libgomp.fortran/vla6.f90  -O3 -fomit-frame-pointer -funroll-all-loops -finline-functions  compilation failed to produce executable
FAIL: libgomp.fortran/vla6.f90  -O3 -g  (test for excess errors)
WARNING: libgomp.fortran/vla6.f90  -O3 -g  compilation failed to produce executable
FAIL: libgomp.fortran/vla6.f90  -Os  (test for excess errors)
WARNING: libgomp.fortran/vla6.f90  -Os  compilation failed to produce executable
FAIL: libgomp.fortran/vla7.f90  -O0  (test for excess errors)
WARNING: libgomp.fortran/vla7.f90  -O0  compilation failed to produce executable
FAIL: libgomp.fortran/vla7.f90  -O1  (test for excess errors)
WARNING: libgomp.fortran/vla7.f90  -O1  compilation failed to produce executable
FAIL: libgomp.fortran/vla7.f90  -O2  (test for excess errors)
WARNING: libgomp.fortran/vla7.f90  -O2  compilation failed to produce executable
FAIL: libgomp.fortran/vla7.f90  -O3 -fomit-frame-pointer  (test for excess errors)
WARNING: libgomp.fortran/vla7.f90  -O3 -fomit-frame-pointer  compilation failed to produce executable
FAIL: libgomp.fortran/vla7.f90  -O3 -fomit-frame-pointer -funroll-loops  (test for excess errors)
WARNING: libgomp.fortran/vla7.f90  -O3 -fomit-frame-pointer -funroll-loops  compilation failed to produce executable
FAIL: libgomp.fortran/vla7.f90  -O3 -fomit-frame-pointer -funroll-all-loops -finline-functions  (test for excess errors)
WARNING: libgomp.fortran/vla7.f90  -O3 -fomit-frame-pointer -funroll-all-loops -finline-functions  compilation failed to produce executable
FAIL: libgomp.fortran/vla7.f90  -O3 -g  (test for excess errors)
WARNING: libgomp.fortran/vla7.f90  -O3 -g  compilation failed to produce executable
FAIL: libgomp.fortran/vla7.f90  -Os  (test for excess errors)
WARNING: libgomp.fortran/vla7.f90  -Os  compilation failed to produce executable
FAIL: libgomp.fortran/workshare1.f90  -O  (test for excess errors)
WARNING: libgomp.fortran/workshare1.f90  -O  compilation failed to produce executable

		=== libgomp Summary ===

# of expected passes		35
# of unexpected failures	988
# of unsupported tests		127
		=== libmudflap tests ===


Running target unix
FAIL: libmudflap.c/fail40-frag.c output pattern test
FAIL: libmudflap.c/pass51-frag.c execution test
FAIL: libmudflap.c/pass51-frag.c execution test
FAIL: libmudflap.c/fail40-frag.c (-static) output pattern test
FAIL: libmudflap.c/pass51-frag.c (-static) execution test
FAIL: libmudflap.c/pass51-frag.c (-static) execution test
FAIL: libmudflap.c/fail40-frag.c (-O2) output pattern test
FAIL: libmudflap.c/pass51-frag.c (-O2) execution test
FAIL: libmudflap.c/pass51-frag.c (-O2) execution test
FAIL: libmudflap.c/fail40-frag.c (-O3) output pattern test
FAIL: libmudflap.c/pass51-frag.c (-O3) execution test
FAIL: libmudflap.c/pass51-frag.c (-O3) execution test
FAIL: externs-12 linkage 
FAIL: externs-21 linkage 
FAIL: externs-12 linkage -static
FAIL: externs-21 linkage -static
FAIL: externs-12 linkage -O2
FAIL: externs-21 linkage -O2
FAIL: externs-12 linkage -O3
FAIL: externs-21 linkage -O3
FAIL: libmudflap.cth/pass37-frag.c execution test
FAIL: libmudflap.cth/pass37-frag.c output pattern test
FAIL: libmudflap.cth/pass37-frag.c (rerun 1) execution test
FAIL: libmudflap.cth/pass37-frag.c (rerun 1) output pattern test
FAIL: libmudflap.cth/pass37-frag.c (rerun 2) execution test
FAIL: libmudflap.cth/pass37-frag.c (rerun 2) output pattern test
FAIL: libmudflap.cth/pass37-frag.c (rerun 3) execution test
FAIL: libmudflap.cth/pass37-frag.c (rerun 3) output pattern test
FAIL: libmudflap.cth/pass37-frag.c (rerun 4) execution test
FAIL: libmudflap.cth/pass37-frag.c (rerun 4) output pattern test
FAIL: libmudflap.cth/pass37-frag.c (rerun 5) execution test
FAIL: libmudflap.cth/pass37-frag.c (rerun 5) output pattern test
FAIL: libmudflap.cth/pass37-frag.c (rerun 6) execution test
FAIL: libmudflap.cth/pass37-frag.c (rerun 6) output pattern test
FAIL: libmudflap.cth/pass37-frag.c (rerun 7) execution test
FAIL: libmudflap.cth/pass37-frag.c (rerun 7) output pattern test
FAIL: libmudflap.cth/pass37-frag.c (rerun 8) execution test
FAIL: libmudflap.cth/pass37-frag.c (rerun 8) output pattern test
FAIL: libmudflap.cth/pass37-frag.c (rerun 9) execution test
FAIL: libmudflap.cth/pass37-frag.c (rerun 9) output pattern test
FAIL: libmudflap.cth/pass37-frag.c (rerun 10) execution test
FAIL: libmudflap.cth/pass37-frag.c (rerun 10) output pattern test
FAIL: libmudflap.cth/pass37-frag.c (rerun 11) execution test
FAIL: libmudflap.cth/pass37-frag.c (rerun 11) output pattern test
FAIL: libmudflap.cth/pass37-frag.c (rerun 12) execution test
FAIL: libmudflap.cth/pass37-frag.c (rerun 12) output pattern test
FAIL: libmudflap.cth/pass37-frag.c (rerun 13) execution test
FAIL: libmudflap.cth/pass37-frag.c (rerun 13) output pattern test
FAIL: libmudflap.cth/pass37-frag.c (rerun 14) execution test
FAIL: libmudflap.cth/pass37-frag.c (rerun 14) output pattern test
FAIL: libmudflap.cth/pass37-frag.c (rerun 15) execution test
FAIL: libmudflap.cth/pass37-frag.c (rerun 15) output pattern test
FAIL: libmudflap.cth/pass37-frag.c (rerun 16) execution test
FAIL: libmudflap.cth/pass37-frag.c (rerun 16) output pattern test
FAIL: libmudflap.cth/pass37-frag.c (rerun 17) execution test
FAIL: libmudflap.cth/pass37-frag.c (rerun 17) output pattern test
FAIL: libmudflap.cth/pass37-frag.c (rerun 18) execution test
FAIL: libmudflap.cth/pass37-frag.c (rerun 18) output pattern test
FAIL: libmudflap.cth/pass37-frag.c (rerun 19) execution test
FAIL: libmudflap.cth/pass37-frag.c (rerun 19) output pattern test
FAIL: libmudflap.cth/pass39-frag.c execution test
FAIL: libmudflap.cth/pass39-frag.c output pattern test
FAIL: libmudflap.cth/pass39-frag.c (rerun 1) execution test
FAIL: libmudflap.cth/pass39-frag.c (rerun 1) output pattern test
FAIL: libmudflap.cth/pass39-frag.c (rerun 2) execution test
FAIL: libmudflap.cth/pass39-frag.c (rerun 2) output pattern test
FAIL: libmudflap.cth/pass39-frag.c (rerun 3) execution test
FAIL: libmudflap.cth/pass39-frag.c (rerun 3) output pattern test
FAIL: libmudflap.cth/pass39-frag.c (rerun 4) execution test
FAIL: libmudflap.cth/pass39-frag.c (rerun 4) output pattern test
FAIL: libmudflap.cth/pass39-frag.c (rerun 5) execution test
FAIL: libmudflap.cth/pass39-frag.c (rerun 5) output pattern test
FAIL: libmudflap.cth/pass39-frag.c (rerun 6) execution test
FAIL: libmudflap.cth/pass39-frag.c (rerun 6) output pattern test
FAIL: libmudflap.cth/pass39-frag.c (rerun 7) execution test
FAIL: libmudflap.cth/pass39-frag.c (rerun 7) output pattern test
FAIL: libmudflap.cth/pass39-frag.c (rerun 8) execution test
FAIL: libmudflap.cth/pass39-frag.c (rerun 8) output pattern test
FAIL: libmudflap.cth/pass39-frag.c (rerun 9) execution test
FAIL: libmudflap.cth/pass39-frag.c (rerun 9) output pattern test
FAIL: libmudflap.cth/pass39-frag.c (rerun 10) execution test
FAIL: libmudflap.cth/pass39-frag.c (rerun 10) output pattern test
FAIL: libmudflap.cth/pass39-frag.c (rerun 11) execution test
FAIL: libmudflap.cth/pass39-frag.c (rerun 11) output pattern test
FAIL: libmudflap.cth/pass39-frag.c (rerun 12) execution test
FAIL: libmudflap.cth/pass39-frag.c (rerun 12) output pattern test
FAIL: libmudflap.cth/pass39-frag.c (rerun 13) execution test
FAIL: libmudflap.cth/pass39-frag.c (rerun 13) output pattern test
FAIL: libmudflap.cth/pass39-frag.c (rerun 14) execution test
FAIL: libmudflap.cth/pass39-frag.c (rerun 14) output pattern test
FAIL: libmudflap.cth/pass39-frag.c (rerun 15) execution test
FAIL: libmudflap.cth/pass39-frag.c (rerun 15) output pattern test
FAIL: libmudflap.cth/pass39-frag.c (rerun 16) execution test
FAIL: libmudflap.cth/pass39-frag.c (rerun 16) output pattern test
FAIL: libmudflap.cth/pass39-frag.c (rerun 17) execution test
FAIL: libmudflap.cth/pass39-frag.c (rerun 17) output pattern test
FAIL: libmudflap.cth/pass39-frag.c (rerun 18) execution test
FAIL: libmudflap.cth/pass39-frag.c (rerun 18) output pattern test
FAIL: libmudflap.cth/pass39-frag.c (rerun 19) execution test
FAIL: libmudflap.cth/pass39-frag.c (rerun 19) output pattern test
FAIL: libmudflap.cth/pass40-frag.c execution test
FAIL: libmudflap.cth/pass40-frag.c output pattern test
FAIL: libmudflap.cth/pass59-frag.c execution test
FAIL: libmudflap.cth/pass59-frag.c output pattern test
FAIL: libmudflap.cth/pass37-frag.c (-static -DSTATIC) execution test
FAIL: libmudflap.cth/pass37-frag.c (-static -DSTATIC) output pattern test
FAIL: libmudflap.cth/pass37-frag.c (-static -DSTATIC) (rerun 1) execution test
FAIL: libmudflap.cth/pass37-frag.c (-static -DSTATIC) (rerun 1) output pattern test
FAIL: libmudflap.cth/pass37-frag.c (-static -DSTATIC) (rerun 2) execution test
FAIL: libmudflap.cth/pass37-frag.c (-static -DSTATIC) (rerun 2) output pattern test
FAIL: libmudflap.cth/pass37-frag.c (-static -DSTATIC) (rerun 3) execution test
FAIL: libmudflap.cth/pass37-frag.c (-static -DSTATIC) (rerun 3) output pattern test
FAIL: libmudflap.cth/pass37-frag.c (-static -DSTATIC) (rerun 4) execution test
FAIL: libmudflap.cth/pass37-frag.c (-static -DSTATIC) (rerun 4) output pattern test
FAIL: libmudflap.cth/pass37-frag.c (-static -DSTATIC) (rerun 5) execution test
FAIL: libmudflap.cth/pass37-frag.c (-static -DSTATIC) (rerun 5) output pattern test
FAIL: libmudflap.cth/pass37-frag.c (-static -DSTATIC) (rerun 6) execution test
FAIL: libmudflap.cth/pass37-frag.c (-static -DSTATIC) (rerun 6) output pattern test
FAIL: libmudflap.cth/pass37-frag.c (-static -DSTATIC) (rerun 7) execution test
FAIL: libmudflap.cth/pass37-frag.c (-static -DSTATIC) (rerun 7) output pattern test
FAIL: libmudflap.cth/pass37-frag.c (-static -DSTATIC) (rerun 8) execution test
FAIL: libmudflap.cth/pass37-frag.c (-static -DSTATIC) (rerun 8) output pattern test
FAIL: libmudflap.cth/pass37-frag.c (-static -DSTATIC) (rerun 9) execution test
FAIL: libmudflap.cth/pass37-frag.c (-static -DSTATIC) (rerun 9) output pattern test
FAIL: libmudflap.cth/pass37-frag.c (-static -DSTATIC) (rerun 10) execution test
FAIL: libmudflap.cth/pass37-frag.c (-static -DSTATIC) (rerun 10) output pattern test
FAIL: libmudflap.cth/pass37-frag.c (-static -DSTATIC) (rerun 11) execution test
FAIL: libmudflap.cth/pass37-frag.c (-static -DSTATIC) (rerun 11) output pattern test
FAIL: libmudflap.cth/pass37-frag.c (-static -DSTATIC) (rerun 12) execution test
FAIL: libmudflap.cth/pass37-frag.c (-static -DSTATIC) (rerun 12) output pattern test
FAIL: libmudflap.cth/pass37-frag.c (-static -DSTATIC) (rerun 13) execution test
FAIL: libmudflap.cth/pass37-frag.c (-static -DSTATIC) (rerun 13) output pattern test
FAIL: libmudflap.cth/pass37-frag.c (-static -DSTATIC) (rerun 14) execution test
FAIL: libmudflap.cth/pass37-frag.c (-static -DSTATIC) (rerun 14) output pattern test
FAIL: libmudflap.cth/pass37-frag.c (-static -DSTATIC) (rerun 15) execution test
FAIL: libmudflap.cth/pass37-frag.c (-static -DSTATIC) (rerun 15) output pattern test
FAIL: libmudflap.cth/pass37-frag.c (-static -DSTATIC) (rerun 16) execution test
FAIL: libmudflap.cth/pass37-frag.c (-static -DSTATIC) (rerun 16) output pattern test
FAIL: libmudflap.cth/pass37-frag.c (-static -DSTATIC) (rerun 17) execution test
FAIL: libmudflap.cth/pass37-frag.c (-static -DSTATIC) (rerun 17) output pattern test
FAIL: libmudflap.cth/pass37-frag.c (-static -DSTATIC) (rerun 18) execution test
FAIL: libmudflap.cth/pass37-frag.c (-static -DSTATIC) (rerun 18) output pattern test
FAIL: libmudflap.cth/pass37-frag.c (-static -DSTATIC) (rerun 19) execution test
FAIL: libmudflap.cth/pass37-frag.c (-static -DSTATIC) (rerun 19) output pattern test
FAIL: libmudflap.cth/pass39-frag.c (-static -DSTATIC) execution test
FAIL: libmudflap.cth/pass39-frag.c (-static -DSTATIC) output pattern test
FAIL: libmudflap.cth/pass39-frag.c (-static -DSTATIC) (rerun 1) execution test
FAIL: libmudflap.cth/pass39-frag.c (-static -DSTATIC) (rerun 1) output pattern test
FAIL: libmudflap.cth/pass39-frag.c (-static -DSTATIC) (rerun 2) execution test
FAIL: libmudflap.cth/pass39-frag.c (-static -DSTATIC) (rerun 2) output pattern test
FAIL: libmudflap.cth/pass39-frag.c (-static -DSTATIC) (rerun 3) execution test
FAIL: libmudflap.cth/pass39-frag.c (-static -DSTATIC) (rerun 3) output pattern test
FAIL: libmudflap.cth/pass39-frag.c (-static -DSTATIC) (rerun 4) execution test
FAIL: libmudflap.cth/pass39-frag.c (-static -DSTATIC) (rerun 4) output pattern test
FAIL: libmudflap.cth/pass39-frag.c (-static -DSTATIC) (rerun 5) execution test
FAIL: libmudflap.cth/pass39-frag.c (-static -DSTATIC) (rerun 5) output pattern test
FAIL: libmudflap.cth/pass39-frag.c (-static -DSTATIC) (rerun 6) execution test
FAIL: libmudflap.cth/pass39-frag.c (-static -DSTATIC) (rerun 6) output pattern test
FAIL: libmudflap.cth/pass39-frag.c (-static -DSTATIC) (rerun 7) execution test
FAIL: libmudflap.cth/pass39-frag.c (-static -DSTATIC) (rerun 7) output pattern test
FAIL: libmudflap.cth/pass39-frag.c (-static -DSTATIC) (rerun 8) execution test
FAIL: libmudflap.cth/pass39-frag.c (-static -DSTATIC) (rerun 8) output pattern test
FAIL: libmudflap.cth/pass39-frag.c (-static -DSTATIC) (rerun 9) execution test
FAIL: libmudflap.cth/pass39-frag.c (-static -DSTATIC) (rerun 9) output pattern test
FAIL: libmudflap.cth/pass39-frag.c (-static -DSTATIC) (rerun 10) execution test
FAIL: libmudflap.cth/pass39-frag.c (-static -DSTATIC) (rerun 10) output pattern test
FAIL: libmudflap.cth/pass39-frag.c (-static -DSTATIC) (rerun 11) execution test
FAIL: libmudflap.cth/pass39-frag.c (-static -DSTATIC) (rerun 11) output pattern test
FAIL: libmudflap.cth/pass39-frag.c (-static -DSTATIC) (rerun 12) execution test
FAIL: libmudflap.cth/pass39-frag.c (-static -DSTATIC) (rerun 12) output pattern test
FAIL: libmudflap.cth/pass39-frag.c (-static -DSTATIC) (rerun 13) execution test
FAIL: libmudflap.cth/pass39-frag.c (-static -DSTATIC) (rerun 13) output pattern test
FAIL: libmudflap.cth/pass39-frag.c (-static -DSTATIC) (rerun 14) execution test
FAIL: libmudflap.cth/pass39-frag.c (-static -DSTATIC) (rerun 14) output pattern test
FAIL: libmudflap.cth/pass39-frag.c (-static -DSTATIC) (rerun 15) execution test
FAIL: libmudflap.cth/pass39-frag.c (-static -DSTATIC) (rerun 15) output pattern test
FAIL: libmudflap.cth/pass39-frag.c (-static -DSTATIC) (rerun 16) execution test
FAIL: libmudflap.cth/pass39-frag.c (-static -DSTATIC) (rerun 16) output pattern test
FAIL: libmudflap.cth/pass39-frag.c (-static -DSTATIC) (rerun 17) execution test
FAIL: libmudflap.cth/pass39-frag.c (-static -DSTATIC) (rerun 17) output pattern test
FAIL: libmudflap.cth/pass39-frag.c (-static -DSTATIC) (rerun 18) execution test
FAIL: libmudflap.cth/pass39-frag.c (-static -DSTATIC) (rerun 18) output pattern test
FAIL: libmudflap.cth/pass39-frag.c (-static -DSTATIC) (rerun 19) execution test
FAIL: libmudflap.cth/pass39-frag.c (-static -DSTATIC) (rerun 19) output pattern test
FAIL: libmudflap.cth/pass40-frag.c (-static -DSTATIC) execution test
FAIL: libmudflap.cth/pass40-frag.c (-static -DSTATIC) output pattern test
FAIL: libmudflap.cth/pass59-frag.c (-static -DSTATIC) execution test
FAIL: libmudflap.cth/pass59-frag.c (-static -DSTATIC) output pattern test
FAIL: libmudflap.cth/pass37-frag.c (-O2) execution test
FAIL: libmudflap.cth/pass37-frag.c (-O2) output pattern test
FAIL: libmudflap.cth/pass37-frag.c (-O2) (rerun 1) execution test
FAIL: libmudflap.cth/pass37-frag.c (-O2) (rerun 1) output pattern test
FAIL: libmudflap.cth/pass37-frag.c (-O2) (rerun 2) execution test
FAIL: libmudflap.cth/pass37-frag.c (-O2) (rerun 2) output pattern test
FAIL: libmudflap.cth/pass37-frag.c (-O2) (rerun 3) execution test
FAIL: libmudflap.cth/pass37-frag.c (-O2) (rerun 3) output pattern test
FAIL: libmudflap.cth/pass37-frag.c (-O2) (rerun 4) execution test
FAIL: libmudflap.cth/pass37-frag.c (-O2) (rerun 4) output pattern test
FAIL: libmudflap.cth/pass37-frag.c (-O2) (rerun 5) execution test
FAIL: libmudflap.cth/pass37-frag.c (-O2) (rerun 5) output pattern test
FAIL: libmudflap.cth/pass37-frag.c (-O2) (rerun 6) execution test
FAIL: libmudflap.cth/pass37-frag.c (-O2) (rerun 6) output pattern test
FAIL: libmudflap.cth/pass37-frag.c (-O2) (rerun 7) execution test
FAIL: libmudflap.cth/pass37-frag.c (-O2) (rerun 7) output pattern test
FAIL: libmudflap.cth/pass37-frag.c (-O2) (rerun 8) execution test
FAIL: libmudflap.cth/pass37-frag.c (-O2) (rerun 8) output pattern test
FAIL: libmudflap.cth/pass37-frag.c (-O2) (rerun 9) execution test
FAIL: libmudflap.cth/pass37-frag.c (-O2) (rerun 9) output pattern test
FAIL: libmudflap.cth/pass37-frag.c (-O2) (rerun 10) execution test
FAIL: libmudflap.cth/pass37-frag.c (-O2) (rerun 10) output pattern test
FAIL: libmudflap.cth/pass37-frag.c (-O2) (rerun 11) execution test
FAIL: libmudflap.cth/pass37-frag.c (-O2) (rerun 11) output pattern test
FAIL: libmudflap.cth/pass37-frag.c (-O2) (rerun 12) execution test
FAIL: libmudflap.cth/pass37-frag.c (-O2) (rerun 12) output pattern test
FAIL: libmudflap.cth/pass37-frag.c (-O2) (rerun 13) execution test
FAIL: libmudflap.cth/pass37-frag.c (-O2) (rerun 13) output pattern test
FAIL: libmudflap.cth/pass37-frag.c (-O2) (rerun 14) execution test
FAIL: libmudflap.cth/pass37-frag.c (-O2) (rerun 14) output pattern test
FAIL: libmudflap.cth/pass37-frag.c (-O2) (rerun 15) execution test
FAIL: libmudflap.cth/pass37-frag.c (-O2) (rerun 15) output pattern test
FAIL: libmudflap.cth/pass37-frag.c (-O2) (rerun 16) execution test
FAIL: libmudflap.cth/pass37-frag.c (-O2) (rerun 16) output pattern test
FAIL: libmudflap.cth/pass37-frag.c (-O2) (rerun 17) execution test
FAIL: libmudflap.cth/pass37-frag.c (-O2) (rerun 17) output pattern test
FAIL: libmudflap.cth/pass37-frag.c (-O2) (rerun 18) execution test
FAIL: libmudflap.cth/pass37-frag.c (-O2) (rerun 18) output pattern test
FAIL: libmudflap.cth/pass37-frag.c (-O2) (rerun 19) execution test
FAIL: libmudflap.cth/pass37-frag.c (-O2) (rerun 19) output pattern test
FAIL: libmudflap.cth/pass39-frag.c (-O2) execution test
FAIL: libmudflap.cth/pass39-frag.c (-O2) output pattern test
FAIL: libmudflap.cth/pass39-frag.c (-O2) (rerun 1) execution test
FAIL: libmudflap.cth/pass39-frag.c (-O2) (rerun 1) output pattern test
FAIL: libmudflap.cth/pass39-frag.c (-O2) (rerun 2) execution test
FAIL: libmudflap.cth/pass39-frag.c (-O2) (rerun 2) output pattern test
FAIL: libmudflap.cth/pass39-frag.c (-O2) (rerun 3) execution test
FAIL: libmudflap.cth/pass39-frag.c (-O2) (rerun 3) output pattern test
FAIL: libmudflap.cth/pass39-frag.c (-O2) (rerun 4) execution test
FAIL: libmudflap.cth/pass39-frag.c (-O2) (rerun 4) output pattern test
FAIL: libmudflap.cth/pass39-frag.c (-O2) (rerun 5) execution test
FAIL: libmudflap.cth/pass39-frag.c (-O2) (rerun 5) output pattern test
FAIL: libmudflap.cth/pass39-frag.c (-O2) (rerun 6) execution test
FAIL: libmudflap.cth/pass39-frag.c (-O2) (rerun 6) output pattern test
FAIL: libmudflap.cth/pass39-frag.c (-O2) (rerun 7) execution test
FAIL: libmudflap.cth/pass39-frag.c (-O2) (rerun 7) output pattern test
FAIL: libmudflap.cth/pass39-frag.c (-O2) (rerun 8) execution test
FAIL: libmudflap.cth/pass39-frag.c (-O2) (rerun 8) output pattern test
FAIL: libmudflap.cth/pass39-frag.c (-O2) (rerun 9) execution test
FAIL: libmudflap.cth/pass39-frag.c (-O2) (rerun 9) output pattern test
FAIL: libmudflap.cth/pass39-frag.c (-O2) (rerun 10) execution test
FAIL: libmudflap.cth/pass39-frag.c (-O2) (rerun 10) output pattern test
FAIL: libmudflap.cth/pass39-frag.c (-O2) (rerun 11) execution test
FAIL: libmudflap.cth/pass39-frag.c (-O2) (rerun 11) output pattern test
FAIL: libmudflap.cth/pass39-frag.c (-O2) (rerun 12) execution test
FAIL: libmudflap.cth/pass39-frag.c (-O2) (rerun 12) output pattern test
FAIL: libmudflap.cth/pass39-frag.c (-O2) (rerun 13) execution test
FAIL: libmudflap.cth/pass39-frag.c (-O2) (rerun 13) output pattern test
FAIL: libmudflap.cth/pass39-frag.c (-O2) (rerun 14) execution test
FAIL: libmudflap.cth/pass39-frag.c (-O2) (rerun 14) output pattern test
FAIL: libmudflap.cth/pass39-frag.c (-O2) (rerun 15) execution test
FAIL: libmudflap.cth/pass39-frag.c (-O2) (rerun 15) output pattern test
FAIL: libmudflap.cth/pass39-frag.c (-O2) (rerun 16) execution test
FAIL: libmudflap.cth/pass39-frag.c (-O2) (rerun 16) output pattern test
FAIL: libmudflap.cth/pass39-frag.c (-O2) (rerun 17) execution test
FAIL: libmudflap.cth/pass39-frag.c (-O2) (rerun 17) output pattern test
FAIL: libmudflap.cth/pass39-frag.c (-O2) (rerun 18) execution test
FAIL: libmudflap.cth/pass39-frag.c (-O2) (rerun 18) output pattern test
FAIL: libmudflap.cth/pass39-frag.c (-O2) (rerun 19) execution test
FAIL: libmudflap.cth/pass39-frag.c (-O2) (rerun 19) output pattern test
FAIL: libmudflap.cth/pass40-frag.c (-O2) execution test
FAIL: libmudflap.cth/pass40-frag.c (-O2) output pattern test
FAIL: libmudflap.cth/pass59-frag.c (-O2) execution test
FAIL: libmudflap.cth/pass59-frag.c (-O2) output pattern test
FAIL: libmudflap.cth/pass37-frag.c (-O3) execution test
FAIL: libmudflap.cth/pass37-frag.c (-O3) output pattern test
FAIL: libmudflap.cth/pass37-frag.c (-O3) (rerun 1) execution test
FAIL: libmudflap.cth/pass37-frag.c (-O3) (rerun 1) output pattern test
FAIL: libmudflap.cth/pass37-frag.c (-O3) (rerun 2) execution test
FAIL: libmudflap.cth/pass37-frag.c (-O3) (rerun 2) output pattern test
FAIL: libmudflap.cth/pass37-frag.c (-O3) (rerun 3) execution test
FAIL: libmudflap.cth/pass37-frag.c (-O3) (rerun 3) output pattern test
FAIL: libmudflap.cth/pass37-frag.c (-O3) (rerun 4) execution test
FAIL: libmudflap.cth/pass37-frag.c (-O3) (rerun 4) output pattern test
FAIL: libmudflap.cth/pass37-frag.c (-O3) (rerun 5) execution test
FAIL: libmudflap.cth/pass37-frag.c (-O3) (rerun 5) output pattern test
FAIL: libmudflap.cth/pass37-frag.c (-O3) (rerun 6) execution test
FAIL: libmudflap.cth/pass37-frag.c (-O3) (rerun 6) output pattern test
FAIL: libmudflap.cth/pass37-frag.c (-O3) (rerun 7) execution test
FAIL: libmudflap.cth/pass37-frag.c (-O3) (rerun 7) output pattern test
FAIL: libmudflap.cth/pass37-frag.c (-O3) (rerun 8) execution test
FAIL: libmudflap.cth/pass37-frag.c (-O3) (rerun 8) output pattern test
FAIL: libmudflap.cth/pass37-frag.c (-O3) (rerun 9) execution test
FAIL: libmudflap.cth/pass37-frag.c (-O3) (rerun 9) output pattern test
FAIL: libmudflap.cth/pass37-frag.c (-O3) (rerun 10) execution test
FAIL: libmudflap.cth/pass37-frag.c (-O3) (rerun 10) output pattern test
FAIL: libmudflap.cth/pass37-frag.c (-O3) (rerun 11) execution test
FAIL: libmudflap.cth/pass37-frag.c (-O3) (rerun 11) output pattern test
FAIL: libmudflap.cth/pass37-frag.c (-O3) (rerun 12) execution test
FAIL: libmudflap.cth/pass37-frag.c (-O3) (rerun 12) output pattern test
FAIL: libmudflap.cth/pass37-frag.c (-O3) (rerun 13) execution test
FAIL: libmudflap.cth/pass37-frag.c (-O3) (rerun 13) output pattern test
FAIL: libmudflap.cth/pass37-frag.c (-O3) (rerun 14) execution test
FAIL: libmudflap.cth/pass37-frag.c (-O3) (rerun 14) output pattern test
FAIL: libmudflap.cth/pass37-frag.c (-O3) (rerun 15) execution test
FAIL: libmudflap.cth/pass37-frag.c (-O3) (rerun 15) output pattern test
FAIL: libmudflap.cth/pass37-frag.c (-O3) (rerun 16) execution test
FAIL: libmudflap.cth/pass37-frag.c (-O3) (rerun 16) output pattern test
FAIL: libmudflap.cth/pass37-frag.c (-O3) (rerun 17) execution test
FAIL: libmudflap.cth/pass37-frag.c (-O3) (rerun 17) output pattern test
FAIL: libmudflap.cth/pass37-frag.c (-O3) (rerun 18) execution test
FAIL: libmudflap.cth/pass37-frag.c (-O3) (rerun 18) output pattern test
FAIL: libmudflap.cth/pass37-frag.c (-O3) (rerun 19) execution test
FAIL: libmudflap.cth/pass37-frag.c (-O3) (rerun 19) output pattern test
FAIL: libmudflap.cth/pass39-frag.c (-O3) execution test
FAIL: libmudflap.cth/pass39-frag.c (-O3) output pattern test
FAIL: libmudflap.cth/pass39-frag.c (-O3) (rerun 1) execution test
FAIL: libmudflap.cth/pass39-frag.c (-O3) (rerun 1) output pattern test
FAIL: libmudflap.cth/pass39-frag.c (-O3) (rerun 2) execution test
FAIL: libmudflap.cth/pass39-frag.c (-O3) (rerun 2) output pattern test
FAIL: libmudflap.cth/pass39-frag.c (-O3) (rerun 3) execution test
FAIL: libmudflap.cth/pass39-frag.c (-O3) (rerun 3) output pattern test
FAIL: libmudflap.cth/pass39-frag.c (-O3) (rerun 4) execution test
FAIL: libmudflap.cth/pass39-frag.c (-O3) (rerun 4) output pattern test
FAIL: libmudflap.cth/pass39-frag.c (-O3) (rerun 5) execution test
FAIL: libmudflap.cth/pass39-frag.c (-O3) (rerun 5) output pattern test
FAIL: libmudflap.cth/pass39-frag.c (-O3) (rerun 6) execution test
FAIL: libmudflap.cth/pass39-frag.c (-O3) (rerun 6) output pattern test
FAIL: libmudflap.cth/pass39-frag.c (-O3) (rerun 7) execution test
FAIL: libmudflap.cth/pass39-frag.c (-O3) (rerun 7) output pattern test
FAIL: libmudflap.cth/pass39-frag.c (-O3) (rerun 8) execution test
FAIL: libmudflap.cth/pass39-frag.c (-O3) (rerun 8) output pattern test
FAIL: libmudflap.cth/pass39-frag.c (-O3) (rerun 9) execution test
FAIL: libmudflap.cth/pass39-frag.c (-O3) (rerun 9) output pattern test
FAIL: libmudflap.cth/pass39-frag.c (-O3) (rerun 10) execution test
FAIL: libmudflap.cth/pass39-frag.c (-O3) (rerun 10) output pattern test
FAIL: libmudflap.cth/pass39-frag.c (-O3) (rerun 11) execution test
FAIL: libmudflap.cth/pass39-frag.c (-O3) (rerun 11) output pattern test
FAIL: libmudflap.cth/pass39-frag.c (-O3) (rerun 12) execution test
FAIL: libmudflap.cth/pass39-frag.c (-O3) (rerun 12) output pattern test
FAIL: libmudflap.cth/pass39-frag.c (-O3) (rerun 13) execution test
FAIL: libmudflap.cth/pass39-frag.c (-O3) (rerun 13) output pattern test
FAIL: libmudflap.cth/pass39-frag.c (-O3) (rerun 14) execution test
FAIL: libmudflap.cth/pass39-frag.c (-O3) (rerun 14) output pattern test
FAIL: libmudflap.cth/pass39-frag.c (-O3) (rerun 15) execution test
FAIL: libmudflap.cth/pass39-frag.c (-O3) (rerun 15) output pattern test
FAIL: libmudflap.cth/pass39-frag.c (-O3) (rerun 16) execution test
FAIL: libmudflap.cth/pass39-frag.c (-O3) (rerun 16) output pattern test
FAIL: libmudflap.cth/pass39-frag.c (-O3) (rerun 17) execution test
FAIL: libmudflap.cth/pass39-frag.c (-O3) (rerun 17) output pattern test
FAIL: libmudflap.cth/pass39-frag.c (-O3) (rerun 18) execution test
FAIL: libmudflap.cth/pass39-frag.c (-O3) (rerun 18) output pattern test
FAIL: libmudflap.cth/pass39-frag.c (-O3) (rerun 19) execution test
FAIL: libmudflap.cth/pass39-frag.c (-O3) (rerun 19) output pattern test
FAIL: libmudflap.cth/pass40-frag.c (-O3) execution test
FAIL: libmudflap.cth/pass40-frag.c (-O3) output pattern test
FAIL: libmudflap.cth/pass59-frag.c (-O3) execution test
FAIL: libmudflap.cth/pass59-frag.c (-O3) output pattern test

		=== libmudflap Summary ===

# of expected passes		1509
# of unexpected failures	356
		=== libstdc++ tests ===


Running target unix
FAIL: 27_io/basic_istream/extractors_arithmetic/char/12.cc execution test
FAIL: 27_io/basic_istream/extractors_arithmetic/wchar_t/12.cc execution test
FAIL: tr1/8_c_compatibility/cinttypes/functions.cc (test for excess errors)

		=== libstdc++ Summary ===

# of expected passes		5086
# of unexpected failures	3
# of expected failures		75
# of unsupported tests		340

Compiler version: 4.4.0 20080609 (experimental) (GCC) 
Platform: i386-unknown-freebsd6.2
configure flags: --prefix=/files/pfeifer/gcc --disable-libgcj


Index Nav: [Date Index] [Subject Index] [Author Index] [Thread Index]
Message Nav: [Date Prev] [Date Next] [Thread Prev] [Thread Next]