This is the mail archive of the gcc-testresults@gcc.gnu.org mailing list for the GCC project.


Index Nav: [Date Index] [Subject Index] [Author Index] [Thread Index]
Message Nav: [Date Prev] [Date Next] [Thread Prev] [Thread Next]
Other format: [Raw text]

Results for 4.3.0 20080214 (experimental) [trunk revision 132323] (GCC) gcc testsuite on avr-unknown-none


Debian 4 on x86_64
cross tool versions:
GNU assembler (GNU Binutils) 2.18.50.20080210
GNU gdb 6.7.50.20080210-cvs
GNU ld (GNU Binutils) 2.18.50.20080210

GNU Make 3.81
expect version 5.43.0
host gcc version: gcc (GCC) 4.3.0 20080214 (experimental) [trunk revision 132323]
LAST_UPDATED: Thu Feb 14 23:02:52 UTC 2008 (revision 132323)

Target is avr-unknown-none
Host   is x86_64-unknown-linux-gnu

		=== gcc tests ===


Running target atmega128-sim
WARNING: program timed out.
FAIL: gcc.c-torture/compile/20001226-1.c  -O1  (test for excess errors)
WARNING: program timed out.
FAIL: gcc.c-torture/compile/20001226-1.c  -O2  (test for excess errors)
WARNING: program timed out.
FAIL: gcc.c-torture/compile/20001226-1.c  -O3 -fomit-frame-pointer  (test for excess errors)
WARNING: program timed out.
FAIL: gcc.c-torture/compile/20001226-1.c  -O3 -g  (test for excess errors)
WARNING: program timed out.
FAIL: gcc.c-torture/compile/20001226-1.c  -Os  (test for excess errors)
FAIL: gcc.c-torture/compile/20010226-1.c  -O0  (internal compiler error)
FAIL: gcc.c-torture/compile/20010226-1.c  -O0  (test for excess errors)
FAIL: gcc.c-torture/compile/20010226-1.c  -O1  (internal compiler error)
FAIL: gcc.c-torture/compile/20010226-1.c  -O1  (test for excess errors)
FAIL: gcc.c-torture/compile/20010226-1.c  -O2  (internal compiler error)
FAIL: gcc.c-torture/compile/20010226-1.c  -O2  (test for excess errors)
FAIL: gcc.c-torture/compile/20010226-1.c  -O3 -fomit-frame-pointer  (internal compiler error)
FAIL: gcc.c-torture/compile/20010226-1.c  -O3 -fomit-frame-pointer  (test for excess errors)
FAIL: gcc.c-torture/compile/20010226-1.c  -O3 -g  (internal compiler error)
FAIL: gcc.c-torture/compile/20010226-1.c  -O3 -g  (test for excess errors)
FAIL: gcc.c-torture/compile/20010226-1.c  -Os  (internal compiler error)
FAIL: gcc.c-torture/compile/20010226-1.c  -Os  (test for excess errors)
FAIL: gcc.c-torture/compile/20010327-1.c  -O0  (test for excess errors)
FAIL: gcc.c-torture/compile/20010327-1.c  -O1  (test for excess errors)
FAIL: gcc.c-torture/compile/20010327-1.c  -O2  (test for excess errors)
FAIL: gcc.c-torture/compile/20010327-1.c  -O3 -fomit-frame-pointer  (test for excess errors)
FAIL: gcc.c-torture/compile/20010327-1.c  -O3 -g  (test for excess errors)
FAIL: gcc.c-torture/compile/20010327-1.c  -Os  (test for excess errors)
FAIL: gcc.c-torture/compile/20020604-1.c  -O0  (test for excess errors)
FAIL: gcc.c-torture/compile/20020604-1.c  -O1  (test for excess errors)
FAIL: gcc.c-torture/compile/20020604-1.c  -O2  (test for excess errors)
FAIL: gcc.c-torture/compile/20020604-1.c  -O3 -fomit-frame-pointer  (test for excess errors)
FAIL: gcc.c-torture/compile/20020604-1.c  -O3 -fomit-frame-pointer -funroll-loops  (test for excess errors)
FAIL: gcc.c-torture/compile/20020604-1.c  -O3 -fomit-frame-pointer -funroll-all-loops -finline-functions  (test for excess errors)
FAIL: gcc.c-torture/compile/20020604-1.c  -O3 -g  (test for excess errors)
FAIL: gcc.c-torture/compile/20020604-1.c  -Os  (test for excess errors)
FAIL: gcc.c-torture/compile/20050122-2.c  -O0  (internal compiler error)
FAIL: gcc.c-torture/compile/20050122-2.c  -O0  (test for excess errors)
FAIL: gcc.c-torture/compile/20050122-2.c  -O1  (internal compiler error)
FAIL: gcc.c-torture/compile/20050122-2.c  -O1  (test for excess errors)
FAIL: gcc.c-torture/compile/20050122-2.c  -O2  (internal compiler error)
FAIL: gcc.c-torture/compile/20050122-2.c  -O2  (test for excess errors)
FAIL: gcc.c-torture/compile/20050122-2.c  -O3 -fomit-frame-pointer  (internal compiler error)
FAIL: gcc.c-torture/compile/20050122-2.c  -O3 -fomit-frame-pointer  (test for excess errors)
FAIL: gcc.c-torture/compile/20050122-2.c  -O3 -g  (internal compiler error)
FAIL: gcc.c-torture/compile/20050122-2.c  -O3 -g  (test for excess errors)
FAIL: gcc.c-torture/compile/20050122-2.c  -Os  (internal compiler error)
FAIL: gcc.c-torture/compile/20050122-2.c  -Os  (test for excess errors)
FAIL: gcc.c-torture/compile/980408-1.c  -O2  (internal compiler error)
FAIL: gcc.c-torture/compile/980408-1.c  -O2  (test for excess errors)
FAIL: gcc.c-torture/compile/980408-1.c  -O3 -fomit-frame-pointer  (internal compiler error)
FAIL: gcc.c-torture/compile/980408-1.c  -O3 -fomit-frame-pointer  (test for excess errors)
FAIL: gcc.c-torture/compile/980408-1.c  -O3 -fomit-frame-pointer -funroll-loops  (internal compiler error)
FAIL: gcc.c-torture/compile/980408-1.c  -O3 -fomit-frame-pointer -funroll-loops  (test for excess errors)
FAIL: gcc.c-torture/compile/980408-1.c  -O3 -fomit-frame-pointer -funroll-all-loops -finline-functions  (internal compiler error)
FAIL: gcc.c-torture/compile/980408-1.c  -O3 -fomit-frame-pointer -funroll-all-loops -finline-functions  (test for excess errors)
FAIL: gcc.c-torture/compile/980408-1.c  -O3 -g  (internal compiler error)
FAIL: gcc.c-torture/compile/980408-1.c  -O3 -g  (test for excess errors)
FAIL: gcc.c-torture/compile/limits-fndefn.c  -O1  (internal compiler error)
FAIL: gcc.c-torture/compile/limits-fndefn.c  -O1  (test for excess errors)
FAIL: gcc.c-torture/compile/limits-fndefn.c  -O2  (internal compiler error)
FAIL: gcc.c-torture/compile/limits-fndefn.c  -O2  (test for excess errors)
FAIL: gcc.c-torture/compile/limits-fndefn.c  -O3 -fomit-frame-pointer  (internal compiler error)
FAIL: gcc.c-torture/compile/limits-fndefn.c  -O3 -fomit-frame-pointer  (test for excess errors)
FAIL: gcc.c-torture/compile/limits-fndefn.c  -O3 -g  (internal compiler error)
FAIL: gcc.c-torture/compile/limits-fndefn.c  -O3 -g  (test for excess errors)
FAIL: gcc.c-torture/compile/limits-fndefn.c  -Os  (internal compiler error)
FAIL: gcc.c-torture/compile/limits-fndefn.c  -Os  (test for excess errors)
FAIL: gcc.c-torture/compile/limits-stringlit.c  -O0  (test for excess errors)
FAIL: gcc.c-torture/compile/limits-stringlit.c  -O1  (test for excess errors)
FAIL: gcc.c-torture/compile/limits-stringlit.c  -O2  (test for excess errors)
FAIL: gcc.c-torture/compile/limits-stringlit.c  -O3 -fomit-frame-pointer  (test for excess errors)
FAIL: gcc.c-torture/compile/limits-stringlit.c  -O3 -g  (test for excess errors)
FAIL: gcc.c-torture/compile/limits-stringlit.c  -Os  (test for excess errors)
FAIL: gcc.c-torture/compile/limits-structnest.c  -O2  (test for excess errors)
FAIL: gcc.c-torture/compile/limits-structnest.c  -O3 -fomit-frame-pointer  (test for excess errors)
FAIL: gcc.c-torture/compile/limits-structnest.c  -O3 -g  (test for excess errors)
FAIL: gcc.c-torture/compile/limits-structnest.c  -Os  (test for excess errors)
FAIL: gcc.c-torture/compile/nested-1.c  -O0  (internal compiler error)
FAIL: gcc.c-torture/compile/nested-1.c  -O0  (test for excess errors)
FAIL: gcc.c-torture/compile/nested-1.c  -O1  (internal compiler error)
FAIL: gcc.c-torture/compile/nested-1.c  -O1  (test for excess errors)
FAIL: gcc.c-torture/compile/nested-1.c  -O2  (internal compiler error)
FAIL: gcc.c-torture/compile/nested-1.c  -O2  (test for excess errors)
FAIL: gcc.c-torture/compile/nested-1.c  -O3 -fomit-frame-pointer  (internal compiler error)
FAIL: gcc.c-torture/compile/nested-1.c  -O3 -fomit-frame-pointer  (test for excess errors)
FAIL: gcc.c-torture/compile/nested-1.c  -O3 -g  (internal compiler error)
FAIL: gcc.c-torture/compile/nested-1.c  -O3 -g  (test for excess errors)
FAIL: gcc.c-torture/compile/nested-1.c  -Os  (internal compiler error)
FAIL: gcc.c-torture/compile/nested-1.c  -Os  (test for excess errors)
FAIL: gcc.c-torture/compile/pr27889.c  -O0  (internal compiler error)
FAIL: gcc.c-torture/compile/pr27889.c  -O0  (test for excess errors)
FAIL: gcc.c-torture/compile/pr27889.c  -O1  (internal compiler error)
FAIL: gcc.c-torture/compile/pr27889.c  -O1  (test for excess errors)
FAIL: gcc.c-torture/compile/pr27889.c  -O2  (internal compiler error)
FAIL: gcc.c-torture/compile/pr27889.c  -O2  (test for excess errors)
FAIL: gcc.c-torture/compile/pr27889.c  -O3 -fomit-frame-pointer  (internal compiler error)
FAIL: gcc.c-torture/compile/pr27889.c  -O3 -fomit-frame-pointer  (test for excess errors)
FAIL: gcc.c-torture/compile/pr27889.c  -O3 -g  (internal compiler error)
FAIL: gcc.c-torture/compile/pr27889.c  -O3 -g  (test for excess errors)
FAIL: gcc.c-torture/compile/pr27889.c  -Os  (internal compiler error)
FAIL: gcc.c-torture/compile/pr27889.c  -Os  (test for excess errors)
FAIL: gcc.c-torture/execute/builtins/memcpy-chk.c compilation,  -O0 
UNRESOLVED: gcc.c-torture/execute/builtins/memcpy-chk.c execution,  -O0 
FAIL: gcc.c-torture/execute/builtins/memcpy-chk.c compilation,  -O1  (internal compiler error)
UNRESOLVED: gcc.c-torture/execute/builtins/memcpy-chk.c execution,  -O1 
FAIL: gcc.c-torture/execute/builtins/memcpy-chk.c compilation,  -O2 
UNRESOLVED: gcc.c-torture/execute/builtins/memcpy-chk.c execution,  -O2 
FAIL: gcc.c-torture/execute/builtins/memcpy-chk.c compilation,  -O3 -fomit-frame-pointer 
UNRESOLVED: gcc.c-torture/execute/builtins/memcpy-chk.c execution,  -O3 -fomit-frame-pointer 
FAIL: gcc.c-torture/execute/builtins/memcpy-chk.c compilation,  -O3 -fomit-frame-pointer -funroll-loops 
UNRESOLVED: gcc.c-torture/execute/builtins/memcpy-chk.c execution,  -O3 -fomit-frame-pointer -funroll-loops 
FAIL: gcc.c-torture/execute/builtins/memcpy-chk.c compilation,  -O3 -fomit-frame-pointer -funroll-all-loops -finline-functions 
UNRESOLVED: gcc.c-torture/execute/builtins/memcpy-chk.c execution,  -O3 -fomit-frame-pointer -funroll-all-loops -finline-functions 
FAIL: gcc.c-torture/execute/builtins/memcpy-chk.c compilation,  -O3 -g 
UNRESOLVED: gcc.c-torture/execute/builtins/memcpy-chk.c execution,  -O3 -g 
FAIL: gcc.c-torture/execute/builtins/memcpy-chk.c compilation,  -Os 
UNRESOLVED: gcc.c-torture/execute/builtins/memcpy-chk.c execution,  -Os 
FAIL: gcc.c-torture/execute/builtins/memmove-chk.c compilation,  -O0 
UNRESOLVED: gcc.c-torture/execute/builtins/memmove-chk.c execution,  -O0 
FAIL: gcc.c-torture/execute/builtins/memmove-chk.c compilation,  -O1  (internal compiler error)
UNRESOLVED: gcc.c-torture/execute/builtins/memmove-chk.c execution,  -O1 
FAIL: gcc.c-torture/execute/builtins/memmove-chk.c compilation,  -O2 
UNRESOLVED: gcc.c-torture/execute/builtins/memmove-chk.c execution,  -O2 
FAIL: gcc.c-torture/execute/builtins/memmove-chk.c compilation,  -O3 -fomit-frame-pointer 
UNRESOLVED: gcc.c-torture/execute/builtins/memmove-chk.c execution,  -O3 -fomit-frame-pointer 
FAIL: gcc.c-torture/execute/builtins/memmove-chk.c compilation,  -O3 -fomit-frame-pointer -funroll-loops 
UNRESOLVED: gcc.c-torture/execute/builtins/memmove-chk.c execution,  -O3 -fomit-frame-pointer -funroll-loops 
FAIL: gcc.c-torture/execute/builtins/memmove-chk.c compilation,  -O3 -fomit-frame-pointer -funroll-all-loops -finline-functions 
UNRESOLVED: gcc.c-torture/execute/builtins/memmove-chk.c execution,  -O3 -fomit-frame-pointer -funroll-all-loops -finline-functions 
FAIL: gcc.c-torture/execute/builtins/memmove-chk.c compilation,  -O3 -g 
UNRESOLVED: gcc.c-torture/execute/builtins/memmove-chk.c execution,  -O3 -g 
FAIL: gcc.c-torture/execute/builtins/memmove-chk.c compilation,  -Os 
UNRESOLVED: gcc.c-torture/execute/builtins/memmove-chk.c execution,  -Os 
FAIL: gcc.c-torture/execute/builtins/mempcpy-chk.c compilation,  -O0 
UNRESOLVED: gcc.c-torture/execute/builtins/mempcpy-chk.c execution,  -O0 
FAIL: gcc.c-torture/execute/builtins/mempcpy-chk.c compilation,  -O1  (internal compiler error)
UNRESOLVED: gcc.c-torture/execute/builtins/mempcpy-chk.c execution,  -O1 
FAIL: gcc.c-torture/execute/builtins/mempcpy-chk.c compilation,  -O2 
UNRESOLVED: gcc.c-torture/execute/builtins/mempcpy-chk.c execution,  -O2 
FAIL: gcc.c-torture/execute/builtins/mempcpy-chk.c compilation,  -O3 -fomit-frame-pointer 
UNRESOLVED: gcc.c-torture/execute/builtins/mempcpy-chk.c execution,  -O3 -fomit-frame-pointer 
FAIL: gcc.c-torture/execute/builtins/mempcpy-chk.c compilation,  -O3 -fomit-frame-pointer -funroll-loops 
UNRESOLVED: gcc.c-torture/execute/builtins/mempcpy-chk.c execution,  -O3 -fomit-frame-pointer -funroll-loops 
FAIL: gcc.c-torture/execute/builtins/mempcpy-chk.c compilation,  -O3 -fomit-frame-pointer -funroll-all-loops -finline-functions 
UNRESOLVED: gcc.c-torture/execute/builtins/mempcpy-chk.c execution,  -O3 -fomit-frame-pointer -funroll-all-loops -finline-functions 
FAIL: gcc.c-torture/execute/builtins/mempcpy-chk.c compilation,  -O3 -g 
UNRESOLVED: gcc.c-torture/execute/builtins/mempcpy-chk.c execution,  -O3 -g 
FAIL: gcc.c-torture/execute/builtins/mempcpy-chk.c compilation,  -Os 
UNRESOLVED: gcc.c-torture/execute/builtins/mempcpy-chk.c execution,  -Os 
FAIL: gcc.c-torture/execute/builtins/memset-chk.c compilation,  -O0 
UNRESOLVED: gcc.c-torture/execute/builtins/memset-chk.c execution,  -O0 
FAIL: gcc.c-torture/execute/builtins/memset-chk.c compilation,  -O1  (internal compiler error)
UNRESOLVED: gcc.c-torture/execute/builtins/memset-chk.c execution,  -O1 
FAIL: gcc.c-torture/execute/builtins/memset-chk.c compilation,  -O2 
UNRESOLVED: gcc.c-torture/execute/builtins/memset-chk.c execution,  -O2 
FAIL: gcc.c-torture/execute/builtins/memset-chk.c compilation,  -O3 -fomit-frame-pointer 
UNRESOLVED: gcc.c-torture/execute/builtins/memset-chk.c execution,  -O3 -fomit-frame-pointer 
FAIL: gcc.c-torture/execute/builtins/memset-chk.c compilation,  -O3 -fomit-frame-pointer -funroll-loops 
UNRESOLVED: gcc.c-torture/execute/builtins/memset-chk.c execution,  -O3 -fomit-frame-pointer -funroll-loops 
FAIL: gcc.c-torture/execute/builtins/memset-chk.c compilation,  -O3 -fomit-frame-pointer -funroll-all-loops -finline-functions 
UNRESOLVED: gcc.c-torture/execute/builtins/memset-chk.c execution,  -O3 -fomit-frame-pointer -funroll-all-loops -finline-functions 
FAIL: gcc.c-torture/execute/builtins/memset-chk.c compilation,  -O3 -g 
UNRESOLVED: gcc.c-torture/execute/builtins/memset-chk.c execution,  -O3 -g 
FAIL: gcc.c-torture/execute/builtins/memset-chk.c compilation,  -Os 
UNRESOLVED: gcc.c-torture/execute/builtins/memset-chk.c execution,  -Os 
FAIL: gcc.c-torture/execute/builtins/pr23484-chk.c compilation,  -O0 
UNRESOLVED: gcc.c-torture/execute/builtins/pr23484-chk.c execution,  -O0 
FAIL: gcc.c-torture/execute/builtins/pr23484-chk.c compilation,  -O1 
UNRESOLVED: gcc.c-torture/execute/builtins/pr23484-chk.c execution,  -O1 
FAIL: gcc.c-torture/execute/builtins/pr23484-chk.c compilation,  -O2 
UNRESOLVED: gcc.c-torture/execute/builtins/pr23484-chk.c execution,  -O2 
FAIL: gcc.c-torture/execute/builtins/pr23484-chk.c compilation,  -O3 -fomit-frame-pointer 
UNRESOLVED: gcc.c-torture/execute/builtins/pr23484-chk.c execution,  -O3 -fomit-frame-pointer 
FAIL: gcc.c-torture/execute/builtins/pr23484-chk.c compilation,  -O3 -g 
UNRESOLVED: gcc.c-torture/execute/builtins/pr23484-chk.c execution,  -O3 -g 
FAIL: gcc.c-torture/execute/builtins/pr23484-chk.c compilation,  -Os 
UNRESOLVED: gcc.c-torture/execute/builtins/pr23484-chk.c execution,  -Os 
FAIL: gcc.c-torture/execute/builtins/snprintf-chk.c compilation,  -O0 
UNRESOLVED: gcc.c-torture/execute/builtins/snprintf-chk.c execution,  -O0 
FAIL: gcc.c-torture/execute/builtins/snprintf-chk.c compilation,  -O1  (internal compiler error)
UNRESOLVED: gcc.c-torture/execute/builtins/snprintf-chk.c execution,  -O1 
FAIL: gcc.c-torture/execute/builtins/snprintf-chk.c compilation,  -O2 
UNRESOLVED: gcc.c-torture/execute/builtins/snprintf-chk.c execution,  -O2 
FAIL: gcc.c-torture/execute/builtins/snprintf-chk.c compilation,  -O3 -fomit-frame-pointer 
UNRESOLVED: gcc.c-torture/execute/builtins/snprintf-chk.c execution,  -O3 -fomit-frame-pointer 
FAIL: gcc.c-torture/execute/builtins/snprintf-chk.c compilation,  -O3 -fomit-frame-pointer -funroll-loops 
UNRESOLVED: gcc.c-torture/execute/builtins/snprintf-chk.c execution,  -O3 -fomit-frame-pointer -funroll-loops 
FAIL: gcc.c-torture/execute/builtins/snprintf-chk.c compilation,  -O3 -fomit-frame-pointer -funroll-all-loops -finline-functions 
UNRESOLVED: gcc.c-torture/execute/builtins/snprintf-chk.c execution,  -O3 -fomit-frame-pointer -funroll-all-loops -finline-functions 
FAIL: gcc.c-torture/execute/builtins/snprintf-chk.c compilation,  -O3 -g 
UNRESOLVED: gcc.c-torture/execute/builtins/snprintf-chk.c execution,  -O3 -g 
FAIL: gcc.c-torture/execute/builtins/snprintf-chk.c compilation,  -Os 
UNRESOLVED: gcc.c-torture/execute/builtins/snprintf-chk.c execution,  -Os 
FAIL: gcc.c-torture/execute/builtins/sprintf-chk.c compilation,  -O0 
UNRESOLVED: gcc.c-torture/execute/builtins/sprintf-chk.c execution,  -O0 
FAIL: gcc.c-torture/execute/builtins/sprintf-chk.c compilation,  -O1  (internal compiler error)
UNRESOLVED: gcc.c-torture/execute/builtins/sprintf-chk.c execution,  -O1 
FAIL: gcc.c-torture/execute/builtins/sprintf-chk.c compilation,  -O2 
UNRESOLVED: gcc.c-torture/execute/builtins/sprintf-chk.c execution,  -O2 
FAIL: gcc.c-torture/execute/builtins/sprintf-chk.c compilation,  -O3 -fomit-frame-pointer 
UNRESOLVED: gcc.c-torture/execute/builtins/sprintf-chk.c execution,  -O3 -fomit-frame-pointer 
FAIL: gcc.c-torture/execute/builtins/sprintf-chk.c compilation,  -O3 -fomit-frame-pointer -funroll-loops 
UNRESOLVED: gcc.c-torture/execute/builtins/sprintf-chk.c execution,  -O3 -fomit-frame-pointer -funroll-loops 
FAIL: gcc.c-torture/execute/builtins/sprintf-chk.c compilation,  -O3 -fomit-frame-pointer -funroll-all-loops -finline-functions 
UNRESOLVED: gcc.c-torture/execute/builtins/sprintf-chk.c execution,  -O3 -fomit-frame-pointer -funroll-all-loops -finline-functions 
FAIL: gcc.c-torture/execute/builtins/sprintf-chk.c compilation,  -O3 -g 
UNRESOLVED: gcc.c-torture/execute/builtins/sprintf-chk.c execution,  -O3 -g 
FAIL: gcc.c-torture/execute/builtins/sprintf-chk.c compilation,  -Os 
UNRESOLVED: gcc.c-torture/execute/builtins/sprintf-chk.c execution,  -Os 
FAIL: gcc.c-torture/execute/builtins/stpcpy-chk.c compilation,  -O0 
UNRESOLVED: gcc.c-torture/execute/builtins/stpcpy-chk.c execution,  -O0 
FAIL: gcc.c-torture/execute/builtins/stpcpy-chk.c compilation,  -O1  (internal compiler error)
UNRESOLVED: gcc.c-torture/execute/builtins/stpcpy-chk.c execution,  -O1 
FAIL: gcc.c-torture/execute/builtins/stpcpy-chk.c compilation,  -O2 
UNRESOLVED: gcc.c-torture/execute/builtins/stpcpy-chk.c execution,  -O2 
FAIL: gcc.c-torture/execute/builtins/stpcpy-chk.c compilation,  -O3 -fomit-frame-pointer 
UNRESOLVED: gcc.c-torture/execute/builtins/stpcpy-chk.c execution,  -O3 -fomit-frame-pointer 
FAIL: gcc.c-torture/execute/builtins/stpcpy-chk.c compilation,  -O3 -fomit-frame-pointer -funroll-loops 
UNRESOLVED: gcc.c-torture/execute/builtins/stpcpy-chk.c execution,  -O3 -fomit-frame-pointer -funroll-loops 
FAIL: gcc.c-torture/execute/builtins/stpcpy-chk.c compilation,  -O3 -fomit-frame-pointer -funroll-all-loops -finline-functions 
UNRESOLVED: gcc.c-torture/execute/builtins/stpcpy-chk.c execution,  -O3 -fomit-frame-pointer -funroll-all-loops -finline-functions 
FAIL: gcc.c-torture/execute/builtins/stpcpy-chk.c compilation,  -O3 -g 
UNRESOLVED: gcc.c-torture/execute/builtins/stpcpy-chk.c execution,  -O3 -g 
FAIL: gcc.c-torture/execute/builtins/stpcpy-chk.c compilation,  -Os 
UNRESOLVED: gcc.c-torture/execute/builtins/stpcpy-chk.c execution,  -Os 
FAIL: gcc.c-torture/execute/builtins/strcat-chk.c compilation,  -O0 
UNRESOLVED: gcc.c-torture/execute/builtins/strcat-chk.c execution,  -O0 
FAIL: gcc.c-torture/execute/builtins/strcat-chk.c compilation,  -O1  (internal compiler error)
UNRESOLVED: gcc.c-torture/execute/builtins/strcat-chk.c execution,  -O1 
FAIL: gcc.c-torture/execute/builtins/strcat-chk.c compilation,  -O2 
UNRESOLVED: gcc.c-torture/execute/builtins/strcat-chk.c execution,  -O2 
FAIL: gcc.c-torture/execute/builtins/strcat-chk.c compilation,  -O3 -fomit-frame-pointer 
UNRESOLVED: gcc.c-torture/execute/builtins/strcat-chk.c execution,  -O3 -fomit-frame-pointer 
FAIL: gcc.c-torture/execute/builtins/strcat-chk.c compilation,  -O3 -fomit-frame-pointer -funroll-loops 
UNRESOLVED: gcc.c-torture/execute/builtins/strcat-chk.c execution,  -O3 -fomit-frame-pointer -funroll-loops 
FAIL: gcc.c-torture/execute/builtins/strcat-chk.c compilation,  -O3 -fomit-frame-pointer -funroll-all-loops -finline-functions 
UNRESOLVED: gcc.c-torture/execute/builtins/strcat-chk.c execution,  -O3 -fomit-frame-pointer -funroll-all-loops -finline-functions 
FAIL: gcc.c-torture/execute/builtins/strcat-chk.c compilation,  -O3 -g 
UNRESOLVED: gcc.c-torture/execute/builtins/strcat-chk.c execution,  -O3 -g 
FAIL: gcc.c-torture/execute/builtins/strcat-chk.c compilation,  -Os 
UNRESOLVED: gcc.c-torture/execute/builtins/strcat-chk.c execution,  -Os 
FAIL: gcc.c-torture/execute/builtins/strcpy-chk.c compilation,  -O0 
UNRESOLVED: gcc.c-torture/execute/builtins/strcpy-chk.c execution,  -O0 
FAIL: gcc.c-torture/execute/builtins/strcpy-chk.c compilation,  -O1  (internal compiler error)
UNRESOLVED: gcc.c-torture/execute/builtins/strcpy-chk.c execution,  -O1 
FAIL: gcc.c-torture/execute/builtins/strcpy-chk.c compilation,  -O2 
UNRESOLVED: gcc.c-torture/execute/builtins/strcpy-chk.c execution,  -O2 
FAIL: gcc.c-torture/execute/builtins/strcpy-chk.c compilation,  -O3 -fomit-frame-pointer 
UNRESOLVED: gcc.c-torture/execute/builtins/strcpy-chk.c execution,  -O3 -fomit-frame-pointer 
FAIL: gcc.c-torture/execute/builtins/strcpy-chk.c compilation,  -O3 -fomit-frame-pointer -funroll-loops 
UNRESOLVED: gcc.c-torture/execute/builtins/strcpy-chk.c execution,  -O3 -fomit-frame-pointer -funroll-loops 
FAIL: gcc.c-torture/execute/builtins/strcpy-chk.c compilation,  -O3 -fomit-frame-pointer -funroll-all-loops -finline-functions 
UNRESOLVED: gcc.c-torture/execute/builtins/strcpy-chk.c execution,  -O3 -fomit-frame-pointer -funroll-all-loops -finline-functions 
FAIL: gcc.c-torture/execute/builtins/strcpy-chk.c compilation,  -O3 -g 
UNRESOLVED: gcc.c-torture/execute/builtins/strcpy-chk.c execution,  -O3 -g 
FAIL: gcc.c-torture/execute/builtins/strcpy-chk.c compilation,  -Os 
UNRESOLVED: gcc.c-torture/execute/builtins/strcpy-chk.c execution,  -Os 
FAIL: gcc.c-torture/execute/builtins/strncat-chk.c compilation,  -O0 
UNRESOLVED: gcc.c-torture/execute/builtins/strncat-chk.c execution,  -O0 
FAIL: gcc.c-torture/execute/builtins/strncat-chk.c compilation,  -O1  (internal compiler error)
UNRESOLVED: gcc.c-torture/execute/builtins/strncat-chk.c execution,  -O1 
FAIL: gcc.c-torture/execute/builtins/strncat-chk.c compilation,  -O2 
UNRESOLVED: gcc.c-torture/execute/builtins/strncat-chk.c execution,  -O2 
FAIL: gcc.c-torture/execute/builtins/strncat-chk.c compilation,  -O3 -fomit-frame-pointer 
UNRESOLVED: gcc.c-torture/execute/builtins/strncat-chk.c execution,  -O3 -fomit-frame-pointer 
FAIL: gcc.c-torture/execute/builtins/strncat-chk.c compilation,  -O3 -fomit-frame-pointer -funroll-loops 
UNRESOLVED: gcc.c-torture/execute/builtins/strncat-chk.c execution,  -O3 -fomit-frame-pointer -funroll-loops 
FAIL: gcc.c-torture/execute/builtins/strncat-chk.c compilation,  -O3 -fomit-frame-pointer -funroll-all-loops -finline-functions 
UNRESOLVED: gcc.c-torture/execute/builtins/strncat-chk.c execution,  -O3 -fomit-frame-pointer -funroll-all-loops -finline-functions 
FAIL: gcc.c-torture/execute/builtins/strncat-chk.c compilation,  -O3 -g 
UNRESOLVED: gcc.c-torture/execute/builtins/strncat-chk.c execution,  -O3 -g 
FAIL: gcc.c-torture/execute/builtins/strncat-chk.c compilation,  -Os 
UNRESOLVED: gcc.c-torture/execute/builtins/strncat-chk.c execution,  -Os 
FAIL: gcc.c-torture/execute/builtins/strncpy-chk.c compilation,  -O0 
UNRESOLVED: gcc.c-torture/execute/builtins/strncpy-chk.c execution,  -O0 
FAIL: gcc.c-torture/execute/builtins/strncpy-chk.c compilation,  -O1  (internal compiler error)
UNRESOLVED: gcc.c-torture/execute/builtins/strncpy-chk.c execution,  -O1 
FAIL: gcc.c-torture/execute/builtins/strncpy-chk.c compilation,  -O2 
UNRESOLVED: gcc.c-torture/execute/builtins/strncpy-chk.c execution,  -O2 
FAIL: gcc.c-torture/execute/builtins/strncpy-chk.c compilation,  -O3 -fomit-frame-pointer 
UNRESOLVED: gcc.c-torture/execute/builtins/strncpy-chk.c execution,  -O3 -fomit-frame-pointer 
FAIL: gcc.c-torture/execute/builtins/strncpy-chk.c compilation,  -O3 -fomit-frame-pointer -funroll-loops 
UNRESOLVED: gcc.c-torture/execute/builtins/strncpy-chk.c execution,  -O3 -fomit-frame-pointer -funroll-loops 
FAIL: gcc.c-torture/execute/builtins/strncpy-chk.c compilation,  -O3 -fomit-frame-pointer -funroll-all-loops -finline-functions 
UNRESOLVED: gcc.c-torture/execute/builtins/strncpy-chk.c execution,  -O3 -fomit-frame-pointer -funroll-all-loops -finline-functions 
FAIL: gcc.c-torture/execute/builtins/strncpy-chk.c compilation,  -O3 -g 
UNRESOLVED: gcc.c-torture/execute/builtins/strncpy-chk.c execution,  -O3 -g 
FAIL: gcc.c-torture/execute/builtins/strncpy-chk.c compilation,  -Os 
UNRESOLVED: gcc.c-torture/execute/builtins/strncpy-chk.c execution,  -Os 
FAIL: gcc.c-torture/execute/builtins/vsnprintf-chk.c compilation,  -O0 
UNRESOLVED: gcc.c-torture/execute/builtins/vsnprintf-chk.c execution,  -O0 
FAIL: gcc.c-torture/execute/builtins/vsnprintf-chk.c compilation,  -O1  (internal compiler error)
UNRESOLVED: gcc.c-torture/execute/builtins/vsnprintf-chk.c execution,  -O1 
FAIL: gcc.c-torture/execute/builtins/vsnprintf-chk.c compilation,  -O2 
UNRESOLVED: gcc.c-torture/execute/builtins/vsnprintf-chk.c execution,  -O2 
FAIL: gcc.c-torture/execute/builtins/vsnprintf-chk.c compilation,  -O3 -fomit-frame-pointer 
UNRESOLVED: gcc.c-torture/execute/builtins/vsnprintf-chk.c execution,  -O3 -fomit-frame-pointer 
FAIL: gcc.c-torture/execute/builtins/vsnprintf-chk.c compilation,  -O3 -fomit-frame-pointer -funroll-loops 
UNRESOLVED: gcc.c-torture/execute/builtins/vsnprintf-chk.c execution,  -O3 -fomit-frame-pointer -funroll-loops 
FAIL: gcc.c-torture/execute/builtins/vsnprintf-chk.c compilation,  -O3 -fomit-frame-pointer -funroll-all-loops -finline-functions 
UNRESOLVED: gcc.c-torture/execute/builtins/vsnprintf-chk.c execution,  -O3 -fomit-frame-pointer -funroll-all-loops -finline-functions 
FAIL: gcc.c-torture/execute/builtins/vsnprintf-chk.c compilation,  -O3 -g 
UNRESOLVED: gcc.c-torture/execute/builtins/vsnprintf-chk.c execution,  -O3 -g 
FAIL: gcc.c-torture/execute/builtins/vsnprintf-chk.c compilation,  -Os 
UNRESOLVED: gcc.c-torture/execute/builtins/vsnprintf-chk.c execution,  -Os 
FAIL: gcc.c-torture/execute/builtins/vsprintf-chk.c compilation,  -O0 
UNRESOLVED: gcc.c-torture/execute/builtins/vsprintf-chk.c execution,  -O0 
FAIL: gcc.c-torture/execute/builtins/vsprintf-chk.c compilation,  -O1  (internal compiler error)
UNRESOLVED: gcc.c-torture/execute/builtins/vsprintf-chk.c execution,  -O1 
FAIL: gcc.c-torture/execute/builtins/vsprintf-chk.c compilation,  -O2 
UNRESOLVED: gcc.c-torture/execute/builtins/vsprintf-chk.c execution,  -O2 
FAIL: gcc.c-torture/execute/builtins/vsprintf-chk.c compilation,  -O3 -fomit-frame-pointer 
UNRESOLVED: gcc.c-torture/execute/builtins/vsprintf-chk.c execution,  -O3 -fomit-frame-pointer 
FAIL: gcc.c-torture/execute/builtins/vsprintf-chk.c compilation,  -O3 -fomit-frame-pointer -funroll-loops 
UNRESOLVED: gcc.c-torture/execute/builtins/vsprintf-chk.c execution,  -O3 -fomit-frame-pointer -funroll-loops 
FAIL: gcc.c-torture/execute/builtins/vsprintf-chk.c compilation,  -O3 -fomit-frame-pointer -funroll-all-loops -finline-functions 
UNRESOLVED: gcc.c-torture/execute/builtins/vsprintf-chk.c execution,  -O3 -fomit-frame-pointer -funroll-all-loops -finline-functions 
FAIL: gcc.c-torture/execute/builtins/vsprintf-chk.c compilation,  -O3 -g 
UNRESOLVED: gcc.c-torture/execute/builtins/vsprintf-chk.c execution,  -O3 -g 
FAIL: gcc.c-torture/execute/builtins/vsprintf-chk.c compilation,  -Os 
UNRESOLVED: gcc.c-torture/execute/builtins/vsprintf-chk.c execution,  -Os 
FAIL: gcc.c-torture/execute/20010122-1.c execution,  -O1 
FAIL: gcc.c-torture/execute/20010122-1.c execution,  -O2 
FAIL: gcc.c-torture/execute/20010122-1.c execution,  -O3 -g 
FAIL: gcc.c-torture/execute/20010122-1.c execution,  -Os 
ERROR: tcl error sourcing /n/11/mstein/svn/trunk/gcc/testsuite/gcc.c-torture/execute/execute.exp.
ERROR: simulate binary /home/mstein/sim/trunk/avr/build/gcc/testsuite/gcc/20040831-1.x1 with atmega128 configuration
ERROR: tcl error sourcing /n/11/mstein/svn/trunk/gcc/testsuite/gcc.c-torture/execute/ieee/ieee.exp.
ERROR: simulate binary /home/mstein/sim/trunk/avr/build/gcc/testsuite/gcc/20010114-2.x1 with atmega128 configuration
ERROR: tcl error sourcing /n/11/mstein/svn/trunk/gcc/testsuite/gcc.dg/compat/compat.exp.
ERROR: simulate binary ./gcc-dg-compat-fnptr-by-value-1-01 with atmega128 configuration
WARNING: Could not compile gcc.dg/compat/struct-layout-1 generator
ERROR: tcl error sourcing /n/11/mstein/svn/trunk/gcc/testsuite/gcc.dg/cpp/cpp.exp.
ERROR: simulate binary ./19990407-1.exe with atmega128 configuration
ERROR: tcl error sourcing /n/11/mstein/svn/trunk/gcc/testsuite/gcc.dg/cpp/trad/trad.exp.
ERROR: simulate binary ./builtins.exe with atmega128 configuration
ERROR: tcl error sourcing /n/11/mstein/svn/trunk/gcc/testsuite/gcc.dg/debug/debug.exp.
ERROR: simulate binary ./20020220-1.exe with atmega128 configuration
ERROR: tcl error sourcing /n/11/mstein/svn/trunk/gcc/testsuite/gcc.dg/dg.exp.
ERROR: simulate binary ./20000108-1.exe with atmega128 configuration
ERROR: tcl error sourcing /n/11/mstein/svn/trunk/gcc/testsuite/gcc.dg/matrix/matrix.exp.
ERROR: simulate binary ./matrix-1.exe with atmega128 configuration
ERROR: tcl error sourcing /n/11/mstein/svn/trunk/gcc/testsuite/gcc.dg/special/special.exp.
ERROR: simulate binary ./alias-2.exe with atmega128 configuration
FAIL: gcc.dg/struct/wo_prof_array_field.c execution test
FAIL: gcc.dg/struct/wo_prof_array_field.c scan-ipa-dump ipa_struct_reorg "Number of structures to transform is 1"
FAIL: gcc.dg/struct/wo_prof_array_through_pointer.c execution test
XPASS: gcc.dg/struct/wo_prof_array_through_pointer.c scan-ipa-dump ipa_struct_reorg "Number of structures to transform is 1"
FAIL: gcc.dg/struct/wo_prof_escape_arg_to_local.c execution test
FAIL: gcc.dg/struct/wo_prof_escape_return.c execution test
FAIL: gcc.dg/struct/wo_prof_escape_str_init.c execution test
FAIL: gcc.dg/struct/wo_prof_escape_substr_array.c execution test
FAIL: gcc.dg/struct/wo_prof_escape_substr_pointer.c execution test
FAIL: gcc.dg/struct/wo_prof_escape_substr_value.c execution test
FAIL: gcc.dg/struct/wo_prof_global_array.c execution test
FAIL: gcc.dg/struct/wo_prof_global_array.c scan-ipa-dump ipa_struct_reorg "Number of structures to transform is 1"
FAIL: gcc.dg/struct/wo_prof_global_var.c execution test
FAIL: gcc.dg/struct/wo_prof_global_var.c scan-ipa-dump ipa_struct_reorg "Number of structures to transform is 1"
FAIL: gcc.dg/struct/wo_prof_local_array.c execution test
FAIL: gcc.dg/struct/wo_prof_local_array.c scan-ipa-dump ipa_struct_reorg "Number of structures to transform is 1"
FAIL: gcc.dg/struct/wo_prof_local_var.c execution test
FAIL: gcc.dg/struct/wo_prof_local_var.c scan-ipa-dump ipa_struct_reorg "Number of structures to transform is 1"
FAIL: gcc.dg/struct/wo_prof_malloc_size_var.c execution test
FAIL: gcc.dg/struct/wo_prof_malloc_size_var.c scan-ipa-dump ipa_struct_reorg "Number of structures to transform is 1"
FAIL: gcc.dg/struct/wo_prof_mult_field_peeling.c execution test
FAIL: gcc.dg/struct/wo_prof_single_str_global.c execution test
FAIL: gcc.dg/struct/wo_prof_single_str_global.c scan-ipa-dump ipa_struct_reorg "Number of structures to transform is 1"
FAIL: gcc.dg/struct/wo_prof_single_str_local.c execution test
FAIL: gcc.dg/struct/wo_prof_single_str_local.c scan-ipa-dump ipa_struct_reorg "No structures to transform"
FAIL: gcc.dg/struct/wo_prof_single_str_pointer.c execution test
XPASS: gcc.dg/struct/wo_prof_single_str_pointer.c scan-ipa-dump ipa_struct_reorg "Number of structures to transform is 1"
FAIL: gcc.dg/struct/wo_prof_two_strs.c execution test
FAIL: gcc.dg/struct/wo_prof_two_strs.c scan-ipa-dump ipa_struct_reorg "Number of structures to transform is 2"
FAIL: gcc.dg/struct/w_prof_global_array.c compilation,  -O3 -fwhole-program -combine -fipa-type-escape -fprofile-generate
UNRESOLVED: gcc.dg/struct/w_prof_global_array.c execution,    -O3 -fwhole-program -combine -fipa-type-escape -fprofile-generate
UNRESOLVED: gcc.dg/struct/w_prof_global_array.c compilation,  -O3 -fwhole-program -combine -fipa-type-escape -fprofile-use -fipa-struct-reorg -fdump-ipa-all
UNRESOLVED: gcc.dg/struct/w_prof_global_array.c execution,    -O3 -fwhole-program -combine -fipa-type-escape -fprofile-use -fipa-struct-reorg -fdump-ipa-all
FAIL: gcc.dg/struct/w_prof_global_var.c compilation,  -O3 -fwhole-program -combine -fipa-type-escape -fprofile-generate
UNRESOLVED: gcc.dg/struct/w_prof_global_var.c execution,    -O3 -fwhole-program -combine -fipa-type-escape -fprofile-generate
UNRESOLVED: gcc.dg/struct/w_prof_global_var.c compilation,  -O3 -fwhole-program -combine -fipa-type-escape -fprofile-use -fipa-struct-reorg -fdump-ipa-all
UNRESOLVED: gcc.dg/struct/w_prof_global_var.c execution,    -O3 -fwhole-program -combine -fipa-type-escape -fprofile-use -fipa-struct-reorg -fdump-ipa-all
FAIL: gcc.dg/struct/w_prof_local_array.c compilation,  -O3 -fwhole-program -combine -fipa-type-escape -fprofile-generate
UNRESOLVED: gcc.dg/struct/w_prof_local_array.c execution,    -O3 -fwhole-program -combine -fipa-type-escape -fprofile-generate
UNRESOLVED: gcc.dg/struct/w_prof_local_array.c compilation,  -O3 -fwhole-program -combine -fipa-type-escape -fprofile-use -fipa-struct-reorg -fdump-ipa-all
UNRESOLVED: gcc.dg/struct/w_prof_local_array.c execution,    -O3 -fwhole-program -combine -fipa-type-escape -fprofile-use -fipa-struct-reorg -fdump-ipa-all
FAIL: gcc.dg/struct/w_prof_local_var.c compilation,  -O3 -fwhole-program -combine -fipa-type-escape -fprofile-generate
UNRESOLVED: gcc.dg/struct/w_prof_local_var.c execution,    -O3 -fwhole-program -combine -fipa-type-escape -fprofile-generate
UNRESOLVED: gcc.dg/struct/w_prof_local_var.c compilation,  -O3 -fwhole-program -combine -fipa-type-escape -fprofile-use -fipa-struct-reorg -fdump-ipa-all
UNRESOLVED: gcc.dg/struct/w_prof_local_var.c execution,    -O3 -fwhole-program -combine -fipa-type-escape -fprofile-use -fipa-struct-reorg -fdump-ipa-all
FAIL: gcc.dg/struct/w_prof_single_str_global.c compilation,  -O3 -fwhole-program -combine -fipa-type-escape -fprofile-generate
UNRESOLVED: gcc.dg/struct/w_prof_single_str_global.c execution,    -O3 -fwhole-program -combine -fipa-type-escape -fprofile-generate
UNRESOLVED: gcc.dg/struct/w_prof_single_str_global.c compilation,  -O3 -fwhole-program -combine -fipa-type-escape -fprofile-use -fipa-struct-reorg -fdump-ipa-all
UNRESOLVED: gcc.dg/struct/w_prof_single_str_global.c execution,    -O3 -fwhole-program -combine -fipa-type-escape -fprofile-use -fipa-struct-reorg -fdump-ipa-all
FAIL: gcc.dg/struct/w_prof_two_strs.c compilation,  -O3 -fwhole-program -combine -fipa-type-escape -fprofile-generate
UNRESOLVED: gcc.dg/struct/w_prof_two_strs.c execution,    -O3 -fwhole-program -combine -fipa-type-escape -fprofile-generate
UNRESOLVED: gcc.dg/struct/w_prof_two_strs.c compilation,  -O3 -fwhole-program -combine -fipa-type-escape -fprofile-use -fipa-struct-reorg -fdump-ipa-all
UNRESOLVED: gcc.dg/struct/w_prof_two_strs.c execution,    -O3 -fwhole-program -combine -fipa-type-escape -fprofile-use -fipa-struct-reorg -fdump-ipa-all
FAIL: gcc.dg/struct/w_ratio_cold_str.c compilation,  -O3 -fwhole-program -combine -fipa-type-escape -fprofile-generate
UNRESOLVED: gcc.dg/struct/w_ratio_cold_str.c execution,    -O3 -fwhole-program -combine -fipa-type-escape -fprofile-generate
UNRESOLVED: gcc.dg/struct/w_ratio_cold_str.c compilation,  -O3 -fwhole-program -combine -fipa-type-escape -fprofile-use -fipa-struct-reorg -fdump-ipa-all --param struct-reorg-cold-struct-ratio=30
UNRESOLVED: gcc.dg/struct/w_ratio_cold_str.c execution,    -O3 -fwhole-program -combine -fipa-type-escape -fprofile-use -fipa-struct-reorg -fdump-ipa-all --param struct-reorg-cold-struct-ratio=30
FAIL: gcc.dg/torture/builtin-convert-1.c  -O0  (test for excess errors)
FAIL: gcc.dg/torture/builtin-convert-1.c  -O1  (test for excess errors)
FAIL: gcc.dg/torture/builtin-convert-1.c  -O2  (test for excess errors)
FAIL: gcc.dg/torture/builtin-convert-1.c  -O3 -fomit-frame-pointer  (test for excess errors)
FAIL: gcc.dg/torture/builtin-convert-1.c  -O3 -g  (test for excess errors)
FAIL: gcc.dg/torture/builtin-convert-1.c  -Os  (test for excess errors)
FAIL: gcc.dg/torture/builtin-convert-2.c  -O0  (test for excess errors)
FAIL: gcc.dg/torture/builtin-convert-2.c  -O1  (test for excess errors)
FAIL: gcc.dg/torture/builtin-convert-2.c  -O2  (test for excess errors)
FAIL: gcc.dg/torture/builtin-convert-2.c  -O3 -fomit-frame-pointer  (test for excess errors)
FAIL: gcc.dg/torture/builtin-convert-2.c  -O3 -g  (test for excess errors)
FAIL: gcc.dg/torture/builtin-convert-2.c  -Os  (test for excess errors)
FAIL: gcc.dg/torture/builtin-convert-3.c  -O0  (test for excess errors)
FAIL: gcc.dg/torture/builtin-convert-3.c  -O1  (test for excess errors)
FAIL: gcc.dg/torture/builtin-convert-3.c  -O2  (test for excess errors)
FAIL: gcc.dg/torture/builtin-convert-3.c  -O3 -fomit-frame-pointer  (test for excess errors)
FAIL: gcc.dg/torture/builtin-convert-3.c  -O3 -g  (test for excess errors)
FAIL: gcc.dg/torture/builtin-convert-3.c  -Os  (test for excess errors)
FAIL: gcc.dg/torture/builtin-convert-4.c  -O0  (test for excess errors)
FAIL: gcc.dg/torture/builtin-convert-4.c  -O1  (test for excess errors)
FAIL: gcc.dg/torture/builtin-convert-4.c  -O2  (test for excess errors)
FAIL: gcc.dg/torture/builtin-convert-4.c  -O3 -fomit-frame-pointer  (test for excess errors)
FAIL: gcc.dg/torture/builtin-convert-4.c  -O3 -fomit-frame-pointer -funroll-loops  (test for excess errors)
FAIL: gcc.dg/torture/builtin-convert-4.c  -O3 -fomit-frame-pointer -funroll-all-loops -finline-functions  (test for excess errors)
FAIL: gcc.dg/torture/builtin-convert-4.c  -O3 -g  (test for excess errors)
FAIL: gcc.dg/torture/builtin-convert-4.c  -Os  (test for excess errors)
FAIL: gcc.dg/torture/builtin-frexp-1.c  -O0  (test for excess errors)
FAIL: gcc.dg/torture/builtin-frexp-1.c  -O1  (test for excess errors)
FAIL: gcc.dg/torture/builtin-frexp-1.c  -O2  (test for excess errors)
FAIL: gcc.dg/torture/builtin-frexp-1.c  -O3 -fomit-frame-pointer  (test for excess errors)
FAIL: gcc.dg/torture/builtin-frexp-1.c  -O3 -fomit-frame-pointer -funroll-loops  (test for excess errors)
FAIL: gcc.dg/torture/builtin-frexp-1.c  -O3 -fomit-frame-pointer -funroll-all-loops -finline-functions  (test for excess errors)
FAIL: gcc.dg/torture/builtin-frexp-1.c  -O3 -g  (test for excess errors)
FAIL: gcc.dg/torture/builtin-frexp-1.c  -Os  (test for excess errors)
FAIL: gcc.dg/torture/builtin-math-2.c  -O0  (test for excess errors)
ERROR: gcc.dg/torture/builtin-math-2.c  -O0 : error executing dg-final: no files matched glob pattern "builtin-math-2.c.[0-9][0-9][0-9]t.original"
UNRESOLVED: gcc.dg/torture/builtin-math-2.c  -O0 : error executing dg-final: no files matched glob pattern "builtin-math-2.c.[0-9][0-9][0-9]t.original"
FAIL: gcc.dg/torture/builtin-math-2.c  -O1  (test for excess errors)
ERROR: gcc.dg/torture/builtin-math-2.c  -O1 : error executing dg-final: no files matched glob pattern "builtin-math-2.c.[0-9][0-9][0-9]t.original"
UNRESOLVED: gcc.dg/torture/builtin-math-2.c  -O1 : error executing dg-final: no files matched glob pattern "builtin-math-2.c.[0-9][0-9][0-9]t.original"
FAIL: gcc.dg/torture/builtin-math-2.c  -O2  (test for excess errors)
ERROR: gcc.dg/torture/builtin-math-2.c  -O2 : error executing dg-final: no files matched glob pattern "builtin-math-2.c.[0-9][0-9][0-9]t.original"
UNRESOLVED: gcc.dg/torture/builtin-math-2.c  -O2 : error executing dg-final: no files matched glob pattern "builtin-math-2.c.[0-9][0-9][0-9]t.original"
FAIL: gcc.dg/torture/builtin-math-2.c  -O3 -fomit-frame-pointer  (test for excess errors)
ERROR: gcc.dg/torture/builtin-math-2.c  -O3 -fomit-frame-pointer : error executing dg-final: no files matched glob pattern "builtin-math-2.c.[0-9][0-9][0-9]t.original"
UNRESOLVED: gcc.dg/torture/builtin-math-2.c  -O3 -fomit-frame-pointer : error executing dg-final: no files matched glob pattern "builtin-math-2.c.[0-9][0-9][0-9]t.original"
FAIL: gcc.dg/torture/builtin-math-2.c  -O3 -fomit-frame-pointer -funroll-loops  (test for excess errors)
ERROR: gcc.dg/torture/builtin-math-2.c  -O3 -fomit-frame-pointer -funroll-loops : error executing dg-final: no files matched glob pattern "builtin-math-2.c.[0-9][0-9][0-9]t.original"
UNRESOLVED: gcc.dg/torture/builtin-math-2.c  -O3 -fomit-frame-pointer -funroll-loops : error executing dg-final: no files matched glob pattern "builtin-math-2.c.[0-9][0-9][0-9]t.original"
FAIL: gcc.dg/torture/builtin-math-2.c  -O3 -fomit-frame-pointer -funroll-all-loops -finline-functions  (test for excess errors)
ERROR: gcc.dg/torture/builtin-math-2.c  -O3 -fomit-frame-pointer -funroll-all-loops -finline-functions : error executing dg-final: no files matched glob pattern "builtin-math-2.c.[0-9][0-9][0-9]t.original"
UNRESOLVED: gcc.dg/torture/builtin-math-2.c  -O3 -fomit-frame-pointer -funroll-all-loops -finline-functions : error executing dg-final: no files matched glob pattern "builtin-math-2.c.[0-9][0-9][0-9]t.original"
FAIL: gcc.dg/torture/builtin-math-2.c  -O3 -g  (test for excess errors)
ERROR: gcc.dg/torture/builtin-math-2.c  -O3 -g : error executing dg-final: no files matched glob pattern "builtin-math-2.c.[0-9][0-9][0-9]t.original"
UNRESOLVED: gcc.dg/torture/builtin-math-2.c  -O3 -g : error executing dg-final: no files matched glob pattern "builtin-math-2.c.[0-9][0-9][0-9]t.original"
FAIL: gcc.dg/torture/builtin-math-2.c  -Os  (test for excess errors)
ERROR: gcc.dg/torture/builtin-math-2.c  -Os : error executing dg-final: no files matched glob pattern "builtin-math-2.c.[0-9][0-9][0-9]t.original"
UNRESOLVED: gcc.dg/torture/builtin-math-2.c  -Os : error executing dg-final: no files matched glob pattern "builtin-math-2.c.[0-9][0-9][0-9]t.original"
FAIL: gcc.dg/torture/builtin-math-4.c  -O0  (test for excess errors)
FAIL: gcc.dg/torture/builtin-math-4.c  -O1  (test for excess errors)
FAIL: gcc.dg/torture/builtin-math-4.c  -O2  (test for excess errors)
FAIL: gcc.dg/torture/builtin-math-4.c  -O3 -fomit-frame-pointer  (test for excess errors)
FAIL: gcc.dg/torture/builtin-math-4.c  -O3 -fomit-frame-pointer -funroll-loops  (test for excess errors)
FAIL: gcc.dg/torture/builtin-math-4.c  -O3 -fomit-frame-pointer -funroll-all-loops -finline-functions  (test for excess errors)
FAIL: gcc.dg/torture/builtin-math-4.c  -O3 -g  (test for excess errors)
FAIL: gcc.dg/torture/builtin-math-4.c  -Os  (test for excess errors)
FAIL: gcc.dg/torture/builtin-pow-mpfr-1.c  -O0  scan-tree-dump original "pow"
FAIL: gcc.dg/torture/builtin-pow-mpfr-1.c  -O1  scan-tree-dump original "pow"
FAIL: gcc.dg/torture/builtin-pow-mpfr-1.c  -O2  scan-tree-dump original "pow"
FAIL: gcc.dg/torture/builtin-pow-mpfr-1.c  -O3 -fomit-frame-pointer  scan-tree-dump original "pow"
FAIL: gcc.dg/torture/builtin-pow-mpfr-1.c  -O3 -g  scan-tree-dump original "pow"
FAIL: gcc.dg/torture/builtin-pow-mpfr-1.c  -Os  scan-tree-dump original "pow"
FAIL: gcc.dg/torture/builtin-power-1.c  -O0  (test for excess errors)
FAIL: gcc.dg/torture/builtin-power-1.c  -O1  (test for excess errors)
FAIL: gcc.dg/torture/builtin-power-1.c  -O2  (test for excess errors)
FAIL: gcc.dg/torture/builtin-power-1.c  -O3 -fomit-frame-pointer  (test for excess errors)
FAIL: gcc.dg/torture/builtin-power-1.c  -O3 -g  (test for excess errors)
FAIL: gcc.dg/torture/builtin-power-1.c  -Os  (test for excess errors)
FAIL: gcc.dg/torture/nested-fn-1.c  -O0  (internal compiler error)
FAIL: gcc.dg/torture/nested-fn-1.c  -O0  (test for excess errors)
ERROR: gcc.dg/torture/nested-fn-1.c  -O0 : error executing dg-final: couldn't open "nested-fn-1.s": no such file or directory
UNRESOLVED: gcc.dg/torture/nested-fn-1.c  -O0 : error executing dg-final: couldn't open "nested-fn-1.s": no such file or directory
FAIL: gcc.dg/torture/nested-fn-1.c  -O1  (internal compiler error)
FAIL: gcc.dg/torture/nested-fn-1.c  -O1  (test for excess errors)
ERROR: gcc.dg/torture/nested-fn-1.c  -O1 : error executing dg-final: couldn't open "nested-fn-1.s": no such file or directory
UNRESOLVED: gcc.dg/torture/nested-fn-1.c  -O1 : error executing dg-final: couldn't open "nested-fn-1.s": no such file or directory
FAIL: gcc.dg/torture/nested-fn-1.c  -O2  (internal compiler error)
FAIL: gcc.dg/torture/nested-fn-1.c  -O2  (test for excess errors)
ERROR: gcc.dg/torture/nested-fn-1.c  -O2 : error executing dg-final: couldn't open "nested-fn-1.s": no such file or directory
UNRESOLVED: gcc.dg/torture/nested-fn-1.c  -O2 : error executing dg-final: couldn't open "nested-fn-1.s": no such file or directory
FAIL: gcc.dg/torture/nested-fn-1.c  -O3 -fomit-frame-pointer  (internal compiler error)
FAIL: gcc.dg/torture/nested-fn-1.c  -O3 -fomit-frame-pointer  (test for excess errors)
ERROR: gcc.dg/torture/nested-fn-1.c  -O3 -fomit-frame-pointer : error executing dg-final: couldn't open "nested-fn-1.s": no such file or directory
UNRESOLVED: gcc.dg/torture/nested-fn-1.c  -O3 -fomit-frame-pointer : error executing dg-final: couldn't open "nested-fn-1.s": no such file or directory
FAIL: gcc.dg/torture/nested-fn-1.c  -O3 -g  (internal compiler error)
FAIL: gcc.dg/torture/nested-fn-1.c  -O3 -g  (test for excess errors)
ERROR: gcc.dg/torture/nested-fn-1.c  -O3 -g : error executing dg-final: couldn't open "nested-fn-1.s": no such file or directory
UNRESOLVED: gcc.dg/torture/nested-fn-1.c  -O3 -g : error executing dg-final: couldn't open "nested-fn-1.s": no such file or directory
FAIL: gcc.dg/torture/nested-fn-1.c  -Os  (internal compiler error)
FAIL: gcc.dg/torture/nested-fn-1.c  -Os  (test for excess errors)
ERROR: gcc.dg/torture/nested-fn-1.c  -Os : error executing dg-final: couldn't open "nested-fn-1.s": no such file or directory
UNRESOLVED: gcc.dg/torture/nested-fn-1.c  -Os : error executing dg-final: couldn't open "nested-fn-1.s": no such file or directory
FAIL: gcc.dg/torture/pr21817-1.c  -O0  (test for excess errors)
FAIL: gcc.dg/torture/pr21817-1.c  -O1  (test for excess errors)
FAIL: gcc.dg/torture/pr21817-1.c  -O2  (test for excess errors)
FAIL: gcc.dg/torture/pr21817-1.c  -O3 -fomit-frame-pointer  (test for excess errors)
FAIL: gcc.dg/torture/pr21817-1.c  -O3 -fomit-frame-pointer -funroll-loops  (test for excess errors)
FAIL: gcc.dg/torture/pr21817-1.c  -O3 -fomit-frame-pointer -funroll-all-loops -finline-functions  (test for excess errors)
FAIL: gcc.dg/torture/pr21817-1.c  -O3 -g  (test for excess errors)
FAIL: gcc.dg/torture/pr21817-1.c  -Os  (test for excess errors)
FAIL: gcc.dg/torture/pr28268.c  -O0  (test for excess errors)
FAIL: gcc.dg/torture/pr28268.c  -O1  (test for excess errors)
FAIL: gcc.dg/torture/pr28268.c  -O2  (test for excess errors)
FAIL: gcc.dg/torture/pr28268.c  -O3 -fomit-frame-pointer  (test for excess errors)
FAIL: gcc.dg/torture/pr28268.c  -O3 -g  (test for excess errors)
FAIL: gcc.dg/torture/pr28268.c  -Os  (test for excess errors)
FAIL: gcc.dg/torture/pr34174-1.c  -O0  execution test
FAIL: gcc.dg/torture/pr34174-1.c  -O1  execution test
FAIL: gcc.dg/tree-prof/bb-reorg.c compilation,  -fprofile-generate -D_PROFILE_GENERATE
UNRESOLVED: gcc.dg/tree-prof/bb-reorg.c execution,    -fprofile-generate -D_PROFILE_GENERATE
UNRESOLVED: gcc.dg/tree-prof/bb-reorg.c compilation,  -fprofile-use -D_PROFILE_USE
UNRESOLVED: gcc.dg/tree-prof/bb-reorg.c execution,    -fprofile-use -D_PROFILE_USE
FAIL: gcc.dg/tree-prof/indir-call-prof.c compilation,  -fprofile-generate -D_PROFILE_GENERATE (internal compiler error)
UNRESOLVED: gcc.dg/tree-prof/indir-call-prof.c execution,    -fprofile-generate -D_PROFILE_GENERATE
UNRESOLVED: gcc.dg/tree-prof/indir-call-prof.c compilation,  -fprofile-use -D_PROFILE_USE
UNRESOLVED: gcc.dg/tree-prof/indir-call-prof.c execution,    -fprofile-use -D_PROFILE_USE
FAIL: gcc.dg/tree-prof/inliner-1.c compilation,  -fprofile-generate -D_PROFILE_GENERATE
UNRESOLVED: gcc.dg/tree-prof/inliner-1.c execution,    -fprofile-generate -D_PROFILE_GENERATE
UNRESOLVED: gcc.dg/tree-prof/inliner-1.c compilation,  -fprofile-use -D_PROFILE_USE
UNRESOLVED: gcc.dg/tree-prof/inliner-1.c execution,    -fprofile-use -D_PROFILE_USE
FAIL: gcc.dg/tree-prof/stringop-1.c compilation,  -fprofile-generate -D_PROFILE_GENERATE (internal compiler error)
UNRESOLVED: gcc.dg/tree-prof/stringop-1.c execution,    -fprofile-generate -D_PROFILE_GENERATE
UNRESOLVED: gcc.dg/tree-prof/stringop-1.c compilation,  -fprofile-use -D_PROFILE_USE
UNRESOLVED: gcc.dg/tree-prof/stringop-1.c execution,    -fprofile-use -D_PROFILE_USE
FAIL: gcc.dg/tree-prof/stringop-2.c compilation,  -fprofile-generate -D_PROFILE_GENERATE (internal compiler error)
UNRESOLVED: gcc.dg/tree-prof/stringop-2.c execution,    -fprofile-generate -D_PROFILE_GENERATE
UNRESOLVED: gcc.dg/tree-prof/stringop-2.c compilation,  -fprofile-use -D_PROFILE_USE
UNRESOLVED: gcc.dg/tree-prof/stringop-2.c execution,    -fprofile-use -D_PROFILE_USE
FAIL: gcc.dg/tree-prof/tracer-1.c compilation,  -fprofile-generate -D_PROFILE_GENERATE
UNRESOLVED: gcc.dg/tree-prof/tracer-1.c execution,    -fprofile-generate -D_PROFILE_GENERATE
UNRESOLVED: gcc.dg/tree-prof/tracer-1.c compilation,  -fprofile-use -D_PROFILE_USE
UNRESOLVED: gcc.dg/tree-prof/tracer-1.c execution,    -fprofile-use -D_PROFILE_USE
FAIL: gcc.dg/tree-prof/update-cunroll-2.c compilation,  -fprofile-generate -D_PROFILE_GENERATE
UNRESOLVED: gcc.dg/tree-prof/update-cunroll-2.c execution,    -fprofile-generate -D_PROFILE_GENERATE
UNRESOLVED: gcc.dg/tree-prof/update-cunroll-2.c compilation,  -fprofile-use -D_PROFILE_USE
UNRESOLVED: gcc.dg/tree-prof/update-cunroll-2.c execution,    -fprofile-use -D_PROFILE_USE
FAIL: gcc.dg/tree-prof/update-loopch.c compilation,  -fprofile-generate -D_PROFILE_GENERATE
UNRESOLVED: gcc.dg/tree-prof/update-loopch.c execution,    -fprofile-generate -D_PROFILE_GENERATE
UNRESOLVED: gcc.dg/tree-prof/update-loopch.c compilation,  -fprofile-use -D_PROFILE_USE
UNRESOLVED: gcc.dg/tree-prof/update-loopch.c execution,    -fprofile-use -D_PROFILE_USE
FAIL: gcc.dg/tree-prof/update-tailcall.c compilation,  -fprofile-generate -D_PROFILE_GENERATE
UNRESOLVED: gcc.dg/tree-prof/update-tailcall.c execution,    -fprofile-generate -D_PROFILE_GENERATE
UNRESOLVED: gcc.dg/tree-prof/update-tailcall.c compilation,  -fprofile-use -D_PROFILE_USE
UNRESOLVED: gcc.dg/tree-prof/update-tailcall.c execution,    -fprofile-use -D_PROFILE_USE
FAIL: gcc.dg/tree-prof/val-prof-1.c compilation,  -fprofile-generate -D_PROFILE_GENERATE
UNRESOLVED: gcc.dg/tree-prof/val-prof-1.c execution,    -fprofile-generate -D_PROFILE_GENERATE
UNRESOLVED: gcc.dg/tree-prof/val-prof-1.c compilation,  -fprofile-use -D_PROFILE_USE
UNRESOLVED: gcc.dg/tree-prof/val-prof-1.c execution,    -fprofile-use -D_PROFILE_USE
FAIL: gcc.dg/tree-prof/val-prof-2.c compilation,  -fprofile-generate -D_PROFILE_GENERATE (internal compiler error)
UNRESOLVED: gcc.dg/tree-prof/val-prof-2.c execution,    -fprofile-generate -D_PROFILE_GENERATE
UNRESOLVED: gcc.dg/tree-prof/val-prof-2.c compilation,  -fprofile-use -D_PROFILE_USE
UNRESOLVED: gcc.dg/tree-prof/val-prof-2.c execution,    -fprofile-use -D_PROFILE_USE
FAIL: gcc.dg/tree-prof/val-prof-3.c compilation,  -fprofile-generate -D_PROFILE_GENERATE (internal compiler error)
UNRESOLVED: gcc.dg/tree-prof/val-prof-3.c execution,    -fprofile-generate -D_PROFILE_GENERATE
UNRESOLVED: gcc.dg/tree-prof/val-prof-3.c compilation,  -fprofile-use -D_PROFILE_USE
UNRESOLVED: gcc.dg/tree-prof/val-prof-3.c execution,    -fprofile-use -D_PROFILE_USE
FAIL: gcc.dg/tree-prof/val-prof-4.c compilation,  -fprofile-generate -D_PROFILE_GENERATE (internal compiler error)
UNRESOLVED: gcc.dg/tree-prof/val-prof-4.c execution,    -fprofile-generate -D_PROFILE_GENERATE
UNRESOLVED: gcc.dg/tree-prof/val-prof-4.c compilation,  -fprofile-use -D_PROFILE_USE
UNRESOLVED: gcc.dg/tree-prof/val-prof-4.c execution,    -fprofile-use -D_PROFILE_USE
FAIL: gcc.dg/tree-prof/val-prof-5.c compilation,  -fprofile-generate -D_PROFILE_GENERATE
UNRESOLVED: gcc.dg/tree-prof/val-prof-5.c execution,    -fprofile-generate -D_PROFILE_GENERATE
UNRESOLVED: gcc.dg/tree-prof/val-prof-5.c compilation,  -fprofile-use -D_PROFILE_USE
UNRESOLVED: gcc.dg/tree-prof/val-prof-5.c execution,    -fprofile-use -D_PROFILE_USE
FAIL: gcc.dg/tree-prof/val-prof-6.c compilation,  -fprofile-generate -D_PROFILE_GENERATE
UNRESOLVED: gcc.dg/tree-prof/val-prof-6.c execution,    -fprofile-generate -D_PROFILE_GENERATE
UNRESOLVED: gcc.dg/tree-prof/val-prof-6.c compilation,  -fprofile-use -D_PROFILE_USE
UNRESOLVED: gcc.dg/tree-prof/val-prof-6.c execution,    -fprofile-use -D_PROFILE_USE
FAIL: gcc.dg/tree-prof/wcoverage-mismatch.c compilation,  -fprofile-generate -D_PROFILE_GENERATE
UNRESOLVED: gcc.dg/tree-prof/wcoverage-mismatch.c execution,    -fprofile-generate -D_PROFILE_GENERATE
UNRESOLVED: gcc.dg/tree-prof/wcoverage-mismatch.c compilation,  -fprofile-use -D_PROFILE_USE
UNRESOLVED: gcc.dg/tree-prof/wcoverage-mismatch.c execution,    -fprofile-use -D_PROFILE_USE
FAIL: gcc.dg/tree-ssa/20030730-1.c scan-tree-dump-times dom3 "if " 0
FAIL: gcc.dg/tree-ssa/20030730-2.c scan-tree-dump-times dom3 "if " 0
XPASS: gcc.dg/tree-ssa/20040204-1.c scan-tree-dump-times optimized "link_error" 0
FAIL: gcc.dg/tree-ssa/alias-15.c scan-tree-dump salias "SFT.5 created for var m offset 128"
FAIL: gcc.dg/tree-ssa/gen-vect-11.c scan-tree-dump-times vect "vectorized 1 loops" 1
FAIL: gcc.dg/tree-ssa/gen-vect-11a.c scan-tree-dump-times vect "vectorized 1 loops" 1
FAIL: gcc.dg/tree-ssa/gen-vect-2.c scan-tree-dump-times vect "vectorized 1 loops" 1
FAIL: gcc.dg/tree-ssa/gen-vect-25.c scan-tree-dump-times vect "vectorized 2 loops" 1
FAIL: gcc.dg/tree-ssa/gen-vect-26.c scan-tree-dump-times vect "vectorized 1 loops" 1
FAIL: gcc.dg/tree-ssa/gen-vect-26.c scan-tree-dump-times vect "Alignment of access forced using peeling" 1
FAIL: gcc.dg/tree-ssa/gen-vect-28.c scan-tree-dump-times vect "vectorized 1 loops" 1
FAIL: gcc.dg/tree-ssa/gen-vect-28.c scan-tree-dump-times vect "Alignment of access forced using peeling" 1
FAIL: gcc.dg/tree-ssa/gen-vect-32.c scan-tree-dump-times vect "vectorized 1 loops" 1
FAIL: gcc.dg/tree-ssa/ifc-20040816-1.c (test for excess errors)
ERROR: gcc.dg/tree-ssa/ifc-20040816-1.c: error executing dg-final: no files matched glob pattern "ifc-20040816-1.c.[0-9][0-9][0-9]t.ifcvt"
UNRESOLVED: gcc.dg/tree-ssa/ifc-20040816-1.c: error executing dg-final: no files matched glob pattern "ifc-20040816-1.c.[0-9][0-9][0-9]t.ifcvt"
FAIL: gcc.dg/tree-ssa/ifc-20040816-2.c (test for excess errors)
FAIL: gcc.dg/tree-ssa/ifc-20040816-2.c scan-tree-dump-times ifcvt "Applying if-conversion" 1
FAIL: gcc.dg/tree-ssa/loadpre8.c scan-tree-dump-times pre "Eliminated: 1" 1
FAIL: gcc.dg/tree-ssa/pr20701.c scan-tree-dump-times vrp2 "Folding predicate.*to 0" 1
FAIL: gcc.dg/tree-ssa/pr20702.c scan-tree-dump-times vrp1 "Folding predicate" 1
FAIL: gcc.dg/tree-ssa/pr21086.c scan-tree-dump-times vrp1 "Folding predicate " 2
FAIL: gcc.dg/tree-ssa/pr23115.c (test for excess errors)
FAIL: gcc.dg/tree-ssa/pr32540-1.c (test for excess errors)
FAIL: gcc.dg/tree-ssa/pr32540-2.c (test for excess errors)
FAIL: gcc.dg/tree-ssa/pr33920.c (test for excess errors)
FAIL: gcc.dg/tree-ssa/vrp02.c scan-tree-dump-times vrp1 "Folding predicate p_.*to 1" 1
FAIL: gcc.dg/tree-ssa/vrp07.c scan-tree-dump-times vrp1 "Folding predicate p_.*to 0" 1
FAIL: gcc.dg/tree-ssa/vrp07.c scan-tree-dump-times vrp1 "PREDICATE: p_[0-9]" 2
FAIL: gcc.dg/tree-ssa/vrp08.c scan-tree-dump-times vrp1 "Folding predicate p_.*to 1" 1
FAIL: gcc.dg/tree-ssa/vrp08.c scan-tree-dump-times vrp1 "PREDICATE: p_.* ne_expr 0" 1
FAIL: gcc.misc-tests/bprob-1.c compilation,  -fprofile-arcs
UNRESOLVED: gcc.misc-tests/bprob-1.c execution,    -fprofile-arcs
UNRESOLVED: gcc.misc-tests/bprob-1.c compilation,  -fbranch-probabilities
UNRESOLVED: gcc.misc-tests/bprob-1.c execution,    -fbranch-probabilities
FAIL: gcc.misc-tests/bprob-2.c execution: file bprob-2.gcda does not exist,  -fprofile-arcs
UNRESOLVED: gcc.misc-tests/bprob-2.c compilation,  -fbranch-probabilities
UNRESOLVED: gcc.misc-tests/bprob-2.c execution,    -fbranch-probabilities
FAIL: compiler driver --coverage option(s) (linker options)

		=== gcc Summary ===

# of expected passes		20813
# of unexpected failures	382
# of unexpected successes	3
# of expected failures		29
# of unresolved testcases	199
# of untested testcases		46
# of unsupported tests		479
/home/mstein/sim/trunk/avr/build/gcc/xgcc  version 4.3.0 20080214 (experimental) [trunk revision 132323] (GCC) 


Compiler version: 4.3.0 20080214 (experimental) [trunk revision 132323] (GCC) gcc 
Platform: avr-unknown-none
configure flags: --target=avr --prefix=/n/11/mstein/cross-local/avr --enable-languages=c --disable-nls --disable-build-warnings --with-ld=/n/11/mstein/cross-local/avr/bin/avr-ld --with-as=/n/11/mstein/cross-local/avr/bin/avr-as --disable-libssp --with-mpfr=/n/11/mstein/mpfr-2.3.0


Index Nav: [Date Index] [Subject Index] [Author Index] [Thread Index]
Message Nav: [Date Prev] [Date Next] [Thread Prev] [Thread Next]