This is the mail archive of the gcc-testresults@gcc.gnu.org mailing list for the GCC project.


Index Nav: [Date Index] [Subject Index] [Author Index] [Thread Index]
Message Nav: [Date Prev] [Date Next] [Thread Prev] [Thread Next]
Other format: [Raw text]

Results for 4.3.0 20070222 (experimental) testsuite on powerpc-apple-darwin9


Tested after a make install.  Tested on Leopard9A357.

LAST_UPDATED: Thu Feb 22 01:35:27 UTC 2007 (revision 122216)

Native configuration is powerpc-apple-darwin9

		=== g++ tests ===


Running target unix
FAIL: g++.dg/eh/simd-4.C execution test
FAIL: g++.dg/ext/alignof2.C execution test
FAIL: g++.dg/other/first-global.C scan-assembler _GLOBAL__I_foobar
FAIL: g++.dg/other/unused1.C scan-assembler (string|ascii?)z?\\t"class2("|\\\\\\\\000)
FAIL: g++.dg/other/unused1.C scan-assembler (string|ascii?)z?\\t"printer("|\\\\\\\\000)
FAIL: g++.dg/parse/attr-externally-visible-1.C scan-assembler-not bar6
FAIL: g++.dg/rtti/repo1.C (test for excess errors)
FAIL: g++.dg/template/repo1.C (test for excess errors)
FAIL: g++.dg/template/repo3.C (test for excess errors)
FAIL: g++.dg/warn/weak1.C (test for excess errors)
WARNING: g++.dg/warn/weak1.C compilation failed to produce executable
FAIL: g++.dg/gomp/pr29965-2.C (internal compiler error)
FAIL: g++.dg/gomp/pr29965-2.C (test for excess errors)
FAIL: g++.dg/special/conpr-3.C execution test
FAIL: g++.old-deja/g++.pt/instantiate4.C (test for excess errors)
FAIL: g++.old-deja/g++.pt/instantiate6.C (test for excess errors)
FAIL: g++.old-deja/g++.pt/repo1.C (test for excess errors)
FAIL: g++.old-deja/g++.pt/repo2.C (test for excess errors)
FAIL: g++.old-deja/g++.pt/repo3.C (test for excess errors)
FAIL: g++.old-deja/g++.pt/repo4.C (test for excess errors)

		=== g++ Summary ===

# of expected passes		13855
# of unexpected failures	19
# of expected failures		80
# of unsupported tests		132
/Volumes/mrs3/net/gcc-darwinO2/gcc/testsuite/g++/../../g++  version 4.3.0 20070222 (experimental)

		=== gcc tests ===


Running target unix
FAIL: gcc.c-torture/execute/mayalias-2.c compilation,  -O3 -g  (internal compiler error)
UNRESOLVED: gcc.c-torture/execute/mayalias-2.c execution,  -O3 -g 
FAIL: gcc.c-torture/execute/mayalias-3.c compilation,  -O3 -g  (internal compiler error)
UNRESOLVED: gcc.c-torture/execute/mayalias-3.c execution,  -O3 -g 
XPASS: gcc.dg/20020103-1.c scan-assembler-not LC[0-9]
FAIL: gcc.dg/builtins-59.c scan-tree-dump __builtin_cexpi
FAIL: gcc.dg/builtins-59.c scan-tree-dump-not sincos
FAIL: gcc.dg/builtins-61.c scan-tree-dump cexpi
FAIL: gcc.dg/builtins-61.c scan-tree-dump sin
FAIL: gcc.dg/builtins-61.c scan-tree-dump cos
FAIL: gcc.dg/builtins-61.c scan-tree-dump return 0.0
FAIL: gcc.dg/builtins-62.c scan-tree-dump-times cexpi 3
FAIL: gcc.dg/cleanup-10.c execution test
FAIL: gcc.dg/cleanup-11.c execution test
FAIL: gcc.dg/cleanup-8.c execution test
FAIL: gcc.dg/cleanup-9.c execution test
ERROR: gcc.dg/fold-compare-2.c: error executing dg-final: couldn't open "fold-compare-2.c.054t.vrp1 fold-compare-2.c.055t.vrp1": no such file or directory
UNRESOLVED: gcc.dg/fold-compare-2.c: error executing dg-final: couldn't open "fold-compare-2.c.054t.vrp1 fold-compare-2.c.055t.vrp1": no such file or directory
FAIL: gcc.dg/memcpy-1.c scan-tree-dump-times nasty_local 0
FAIL: gcc.dg/gomp/pr29965-2.c (internal compiler error)
FAIL: gcc.dg/gomp/pr29965-2.c (test for excess errors)
FAIL: gcc.dg/tree-ssa/loadpre1.c scan-tree-dump-times Eliminated: 1 1
FAIL: gcc.dg/tree-ssa/loop-19.c scan-tree-dump-times MEM.(base: &|symbol: )a, 2
FAIL: gcc.dg/tree-ssa/loop-19.c scan-tree-dump-times MEM.(base: &|symbol: )c, 2
XPASS: gcc.dg/tree-ssa/update-threading.c scan-tree-dump-times Invalid sum 0
FAIL: gcc.dg/vect/section-anchors-pr27770.c (test for excess errors)
FAIL: gcc.dg/vect/section-anchors-vect-69.c (test for excess errors)
FAIL: gcc.dg/vect/section-anchors-vect-69.c scan-tree-dump-times Alignment of access forced using peeling 4
FAIL: gcc.target/powerpc/parity-1.c scan-assembler popcntb
FAIL: gcc.target/powerpc/popcount-1.c scan-assembler popcntb
FAIL: gcc.target/powerpc/stabs-attrib-vect-darwin.c scan-assembler .stabs.*vi:\\\\(0,16\\\\)=@V

		=== gcc Summary ===

# of expected passes		43760
# of unexpected failures	25
# of unexpected successes	2
# of expected failures		116
# of unresolved testcases	3
# of untested testcases		28
# of unsupported tests		443
/Volumes/mrs3/net/gcc-darwinO2/gcc/xgcc  version 4.3.0 20070222 (experimental)

		=== obj-c++ tests ===


Running target unix
FAIL: obj-c++.dg/gnu-runtime-2.mm (test for excess errors)
FAIL: obj-c++.dg/qual-types-1.mm (internal compiler error)
FAIL: obj-c++.dg/qual-types-1.mm (test for excess errors)
WARNING: obj-c++.dg/qual-types-1.mm compilation failed to produce executable
ERROR: obj-c++.dg/stubify-2.mm: error executing dg-final: couldn't open "stubify-2.mm.08.jump": no such file or directory
UNRESOLVED: obj-c++.dg/stubify-2.mm: error executing dg-final: couldn't open "stubify-2.mm.08.jump": no such file or directory
FAIL: obj-c++.dg/template-1.mm (internal compiler error)
FAIL: obj-c++.dg/template-1.mm (test for excess errors)
WARNING: obj-c++.dg/template-1.mm compilation failed to produce executable
FAIL: obj-c++.dg/template-3.mm (internal compiler error)
FAIL: obj-c++.dg/template-3.mm (test for excess errors)
WARNING: obj-c++.dg/template-3.mm compilation failed to produce executable
FAIL: obj-c++.dg/template-4.mm (internal compiler error)
FAIL: obj-c++.dg/template-4.mm (test for excess errors)
WARNING: obj-c++.dg/template-4.mm compilation failed to produce executable

		=== obj-c++ Summary ===

# of expected passes		459
# of unexpected failures	9
# of unresolved testcases	1
/Volumes/mrs3/net/gcc-darwinO2/gcc/testsuite/obj-c++/../../g++  version 4.3.0 20070222 (experimental)

		=== objc tests ===


Running target unix
FAIL: objc.dg/headers.m (test for excess errors)
FAIL: objc.dg/no-extra-load.m (test for excess errors)
ERROR: objc.dg/no-extra-load.m: error executing dg-final: couldn't open "no-extra-load.s": no such file or directory
UNRESOLVED: objc.dg/no-extra-load.m: error executing dg-final: couldn't open "no-extra-load.s": no such file or directory
FAIL: objc.dg-struct-layout-encoding-1/t001_main.m execution test
FAIL: objc.dg-struct-layout-encoding-1/t005_main.m execution test
FAIL: objc.dg-struct-layout-encoding-1/t009_main.m execution test
FAIL: objc.dg-struct-layout-encoding-1/t010_main.m execution test
FAIL: objc.dg-struct-layout-encoding-1/t013_main.m execution test
FAIL: objc.dg-struct-layout-encoding-1/t014_main.m execution test
FAIL: objc.dg-struct-layout-encoding-1/t016_main.m execution test
FAIL: objc.dg-struct-layout-encoding-1/t017_main.m execution test
FAIL: objc.dg-struct-layout-encoding-1/t018_main.m execution test
FAIL: objc.dg-struct-layout-encoding-1/t019_main.m execution test
FAIL: objc.dg-struct-layout-encoding-1/t020_main.m execution test
FAIL: objc.dg-struct-layout-encoding-1/t021_main.m execution test
FAIL: objc.dg-struct-layout-encoding-1/t023_main.m execution test
FAIL: objc.dg-struct-layout-encoding-1/t024_main.m execution test
FAIL: objc.dg/pch/interface-1.m -O0 -g (test for excess errors)
FAIL: objc.dg/pch/interface-1.m  -O0  (test for excess errors)
FAIL: objc.dg/pch/interface-1.m  -O1  (test for excess errors)
FAIL: objc.dg/pch/interface-1.m  -O2  (test for excess errors)
FAIL: objc.dg/pch/interface-1.m  -O3 -fomit-frame-pointer  (test for excess errors)
FAIL: objc.dg/pch/interface-1.m  -O3 -g  (test for excess errors)
FAIL: objc.dg/pch/interface-1.m  -Os  (test for excess errors)

		=== objc Summary ===

# of expected passes		2983
# of unexpected failures	23
# of expected failures		17
# of unresolved testcases	1
# of untested testcases		7
# of unsupported tests		1
/Volumes/mrs3/net/gcc-darwinO2/gcc/xgcc  version 4.3.0 20070222 (experimental)

		=== libgomp tests ===


Running target unix
FAIL: libgomp.c++/pr30703.C  -O0  (test for excess errors)
WARNING: libgomp.c++/pr30703.C  -O0  compilation failed to produce executable
FAIL: libgomp.c++/pr30703.C  -O1  (test for excess errors)
WARNING: libgomp.c++/pr30703.C  -O1  compilation failed to produce executable
FAIL: libgomp.c++/pr30703.C  -O2  (test for excess errors)
WARNING: libgomp.c++/pr30703.C  -O2  compilation failed to produce executable
FAIL: libgomp.c++/pr30703.C  -O3 -fomit-frame-pointer  (test for excess errors)
WARNING: libgomp.c++/pr30703.C  -O3 -fomit-frame-pointer  compilation failed to produce executable
FAIL: libgomp.c++/pr30703.C  -O3 -fomit-frame-pointer -funroll-loops  (test for excess errors)
WARNING: libgomp.c++/pr30703.C  -O3 -fomit-frame-pointer -funroll-loops  compilation failed to produce executable
FAIL: libgomp.c++/pr30703.C  -O3 -fomit-frame-pointer -funroll-all-loops -finline-functions  (test for excess errors)
WARNING: libgomp.c++/pr30703.C  -O3 -fomit-frame-pointer -funroll-all-loops -finline-functions  compilation failed to produce executable
FAIL: libgomp.c++/pr30703.C  -O3 -g  (test for excess errors)
WARNING: libgomp.c++/pr30703.C  -O3 -g  compilation failed to produce executable
FAIL: libgomp.c++/pr30703.C  -Os  (test for excess errors)
WARNING: libgomp.c++/pr30703.C  -Os  compilation failed to produce executable

		=== libgomp Summary ===

# of expected passes		364
# of unexpected failures	8
# of unsupported tests		55
		=== libstdc++ tests ===


Running target unix
XPASS: 21_strings/basic_string/element_access/char/21674.cc execution test
XPASS: 21_strings/basic_string/element_access/wchar_t/21674.cc execution test
FAIL: 26_numerics/complex/13450.cc execution test
XPASS: 26_numerics/headers/cmath/c99_classification_macros_c.cc (test for excess errors)
FAIL: ext/mt_allocator/deallocate_local_thread-5.cc execution test
FAIL: ext/mt_allocator/deallocate_local_thread-7.cc execution test
FAIL: ext/pb_ds/regression/list_update_data_map_rand.cc (test for excess errors)
WARNING: ext/pb_ds/regression/list_update_data_map_rand.cc compilation failed to produce executable

		=== libstdc++ Summary ===

# of expected passes		3969
# of unexpected failures	4
# of unexpected successes	3
# of expected failures		16
# of unsupported tests		318

Compiler version: 4.3.0 20070222 (experimental) 
Platform: powerpc-apple-darwin9
configure flags: --prefix=/Volumes/mrs3/Packages/gcc-070215 --enable-languages=c,c++,obj-c++,objc --build=powerpc-apple-darwin9 build_alias=powerpc-apple-darwin9 --enable-languages=c,c++,objc,obj-c++ --no-create --no-recursion
BOOT_CFLAGS=-g -O2 -mdynamic-no-pic


Index Nav: [Date Index] [Subject Index] [Author Index] [Thread Index]
Message Nav: [Date Prev] [Date Next] [Thread Prev] [Thread Next]