This is the mail archive of the gcc-testresults@gcc.gnu.org mailing list for the GCC project.


Index Nav: [Date Index] [Subject Index] [Author Index] [Thread Index]
Message Nav: [Date Prev] [Date Next] [Thread Prev] [Thread Next]
Other format: [Raw text]

Results for 4.1.0 20050628 (experimental) testsuite on powerpc64-unknown-linux-gnu


Linux 2.4.21-17.EL ppc64
GNU C Library stable release version 2.3.2
GNU ld version 2.16
GNU assembler 2.16
GNU Make version 3.79.1

DejaGnu:
	Expect version is	5.40.0
	Tcl version is		8.4
	Framework version is	1.4.4

32-bit biarch default32

CVS branch:  mainline

This hardware does not support VMX instructions.

LAST_UPDATED: Tue Jun 28 01:13:18 UTC 2005

Native configuration is powerpc64-unknown-linux-gnu

		=== g++ tests ===


Running target unix/-m32
FAIL: g++.dg/tree-ssa/pr14814.C scan-tree-dump-times &this 0

		=== g++ Summary for unix/-m32 ===

# of expected passes		11168
# of unexpected failures	1
# of expected failures		65
# of unsupported tests		83

Running target unix/-m64
FAIL: g++.dg/tree-ssa/pr14814.C scan-tree-dump-times &this 0

		=== g++ Summary for unix/-m64 ===

# of expected passes		11130
# of unexpected failures	1
# of expected failures		65
# of unsupported tests		86

		=== g++ Summary ===

# of expected passes		22298
# of unexpected failures	2
# of expected failures		130
# of unsupported tests		169
/home/gccbuild/build/nightly/build-gcc-mline/gcc/testsuite/../g++  version 4.1.0 20050628 (experimental)

		=== gcc tests ===


Running target unix/-m32
XPASS: gcc.c-torture/execute/20020720-1.c compilation,  -O1 
UNRESOLVED: gcc.c-torture/execute/20020720-1.c execution,  -O2 
UNRESOLVED: gcc.c-torture/execute/20020720-1.c execution,  -O3 -fomit-frame-pointer 
UNRESOLVED: gcc.c-torture/execute/20020720-1.c execution,  -O3 -g 
UNRESOLVED: gcc.c-torture/execute/20020720-1.c execution,  -Os 
FAIL: gcc.dg/altivec-types-1.c  (test for errors, line 87)
FAIL: gcc.dg/altivec-types-1.c (test for excess errors)
FAIL: gcc.dg/builtin-object-size-1.c (test for excess errors)
WARNING: gcc.dg/builtin-object-size-1.c compilation failed to produce executable
FAIL: gcc.dg/builtin-object-size-2.c (test for excess errors)
WARNING: gcc.dg/builtin-object-size-2.c compilation failed to produce executable
FAIL: gcc.dg/builtin-object-size-3.c (test for excess errors)
WARNING: gcc.dg/builtin-object-size-3.c compilation failed to produce executable
FAIL: gcc.dg/builtin-object-size-4.c (test for excess errors)
WARNING: gcc.dg/builtin-object-size-4.c compilation failed to produce executable
ERROR: gcc.dg/tree-ssa/20030708-1.c: error executing dg-final: no files matched glob pattern "20030708-1.c.t??.dom3"
UNRESOLVED: gcc.dg/tree-ssa/20030708-1.c: error executing dg-final: no files matched glob pattern "20030708-1.c.t??.dom3"
ERROR: gcc.dg/tree-ssa/20030709-1.c: error executing dg-final: no files matched glob pattern "20030709-1.c.t??.optimized"
UNRESOLVED: gcc.dg/tree-ssa/20030709-1.c: error executing dg-final: no files matched glob pattern "20030709-1.c.t??.optimized"
ERROR: gcc.dg/tree-ssa/20030714-1.c: error executing dg-final: no files matched glob pattern "20030714-1.c.t??.dom3"
UNRESOLVED: gcc.dg/tree-ssa/20030714-1.c: error executing dg-final: no files matched glob pattern "20030714-1.c.t??.dom3"
ERROR: gcc.dg/tree-ssa/20030807-1.c: error executing dg-final: no files matched glob pattern "20030807-1.c.t??.dom3"
UNRESOLVED: gcc.dg/tree-ssa/20030807-1.c: error executing dg-final: no files matched glob pattern "20030807-1.c.t??.dom3"
ERROR: gcc.dg/tree-ssa/20030807-5.c: error executing dg-final: no files matched glob pattern "20030807-5.c.t??.dom3"
UNRESOLVED: gcc.dg/tree-ssa/20030807-5.c: error executing dg-final: no files matched glob pattern "20030807-5.c.t??.dom3"
ERROR: gcc.dg/tree-ssa/20030807-8.c: error executing dg-final: no files matched glob pattern "20030807-8.c.t??.dom3"
UNRESOLVED: gcc.dg/tree-ssa/20030807-8.c: error executing dg-final: no files matched glob pattern "20030807-8.c.t??.dom3"
ERROR: gcc.dg/tree-ssa/20030815-1.c: error executing dg-final: no files matched glob pattern "20030815-1.c.t??.dom3"
UNRESOLVED: gcc.dg/tree-ssa/20030815-1.c: error executing dg-final: no files matched glob pattern "20030815-1.c.t??.dom3"
ERROR: gcc.dg/tree-ssa/20030922-2.c: error executing dg-final: no files matched glob pattern "20030922-2.c.t??.dom1"
UNRESOLVED: gcc.dg/tree-ssa/20030922-2.c: error executing dg-final: no files matched glob pattern "20030922-2.c.t??.dom1"
FAIL: gcc.dg/tree-ssa/loop-2.c scan-tree-dump-times iter 0
FAIL: gcc.dg/tree-ssa/loop-4.c scan-tree-dump-times iter 0
XPASS: gcc.dg/vect/vect-67.c scan-tree-dump-times vectorized 1 loops 1
FAIL: gcc.dg/vect/vect-reduc-2char.c scan-tree-dump-times vectorized 3 loops 1

		=== gcc Summary for unix/-m32 ===

# of expected passes		37388
# of unexpected failures	9
# of unexpected successes	2
# of expected failures		98
# of unresolved testcases	12
# of untested testcases		28
# of unsupported tests		452

Running target unix/-m64
UNRESOLVED: gcc.c-torture/execute/20020720-1.c execution,  -O1 
UNRESOLVED: gcc.c-torture/execute/20020720-1.c execution,  -O2 
UNRESOLVED: gcc.c-torture/execute/20020720-1.c execution,  -O3 -fomit-frame-pointer 
UNRESOLVED: gcc.c-torture/execute/20020720-1.c execution,  -O3 -g 
UNRESOLVED: gcc.c-torture/execute/20020720-1.c execution,  -Os 
FAIL: tmpdir-gcc.dg-struct-layout-1/t154 c_compat_y_tst.o compile
UNRESOLVED: tmpdir-gcc.dg-struct-layout-1/t154 c_compat_x_tst.o-c_compat_y_tst.o link 
UNRESOLVED: tmpdir-gcc.dg-struct-layout-1/t154 c_compat_x_tst.o-c_compat_y_tst.o execute 
FAIL: tmpdir-gcc.dg-struct-layout-1/t199 c_compat_y_tst.o compile
UNRESOLVED: tmpdir-gcc.dg-struct-layout-1/t199 c_compat_x_tst.o-c_compat_y_tst.o link 
UNRESOLVED: tmpdir-gcc.dg-struct-layout-1/t199 c_compat_x_tst.o-c_compat_y_tst.o execute 
FAIL: gcc.dg/builtin-object-size-1.c (test for excess errors)
WARNING: gcc.dg/builtin-object-size-1.c compilation failed to produce executable
FAIL: gcc.dg/builtin-object-size-2.c (test for excess errors)
WARNING: gcc.dg/builtin-object-size-2.c compilation failed to produce executable
FAIL: gcc.dg/builtin-object-size-3.c (test for excess errors)
WARNING: gcc.dg/builtin-object-size-3.c compilation failed to produce executable
FAIL: gcc.dg/builtin-object-size-4.c (test for excess errors)
WARNING: gcc.dg/builtin-object-size-4.c compilation failed to produce executable
FAIL: gcc.dg/ppc-and-1.c scan-assembler rlwinm [0-9]+,[0-9]+,0,0,30
FAIL: gcc.dg/rs6000-fpint.c scan-assembler-not stfiwx
ERROR: gcc.dg/tree-ssa/20030708-1.c: error executing dg-final: no files matched glob pattern "20030708-1.c.t??.dom3"
UNRESOLVED: gcc.dg/tree-ssa/20030708-1.c: error executing dg-final: no files matched glob pattern "20030708-1.c.t??.dom3"
ERROR: gcc.dg/tree-ssa/20030709-1.c: error executing dg-final: no files matched glob pattern "20030709-1.c.t??.optimized"
UNRESOLVED: gcc.dg/tree-ssa/20030709-1.c: error executing dg-final: no files matched glob pattern "20030709-1.c.t??.optimized"
ERROR: gcc.dg/tree-ssa/20030714-1.c: error executing dg-final: no files matched glob pattern "20030714-1.c.t??.dom3"
UNRESOLVED: gcc.dg/tree-ssa/20030714-1.c: error executing dg-final: no files matched glob pattern "20030714-1.c.t??.dom3"
ERROR: gcc.dg/tree-ssa/20030807-1.c: error executing dg-final: no files matched glob pattern "20030807-1.c.t??.dom3"
UNRESOLVED: gcc.dg/tree-ssa/20030807-1.c: error executing dg-final: no files matched glob pattern "20030807-1.c.t??.dom3"
ERROR: gcc.dg/tree-ssa/20030807-5.c: error executing dg-final: no files matched glob pattern "20030807-5.c.t??.dom3"
UNRESOLVED: gcc.dg/tree-ssa/20030807-5.c: error executing dg-final: no files matched glob pattern "20030807-5.c.t??.dom3"
ERROR: gcc.dg/tree-ssa/20030807-8.c: error executing dg-final: no files matched glob pattern "20030807-8.c.t??.dom3"
UNRESOLVED: gcc.dg/tree-ssa/20030807-8.c: error executing dg-final: no files matched glob pattern "20030807-8.c.t??.dom3"
ERROR: gcc.dg/tree-ssa/20030815-1.c: error executing dg-final: no files matched glob pattern "20030815-1.c.t??.dom3"
UNRESOLVED: gcc.dg/tree-ssa/20030815-1.c: error executing dg-final: no files matched glob pattern "20030815-1.c.t??.dom3"
ERROR: gcc.dg/tree-ssa/20030922-2.c: error executing dg-final: no files matched glob pattern "20030922-2.c.t??.dom1"
UNRESOLVED: gcc.dg/tree-ssa/20030922-2.c: error executing dg-final: no files matched glob pattern "20030922-2.c.t??.dom1"
FAIL: gcc.dg/tree-ssa/loop-2.c scan-tree-dump-times iter 0
FAIL: gcc.dg/tree-ssa/loop-4.c scan-tree-dump-times iter 0
XPASS: gcc.dg/tree-ssa/sra-2.c scan-tree-dump-times link_error 0
XPASS: gcc.dg/vect/vect-67.c scan-tree-dump-times vectorized 1 loops 1
FAIL: gcc.dg/vect/vect-reduc-2char.c scan-tree-dump-times vectorized 3 loops 1

		=== gcc Summary for unix/-m64 ===

# of expected passes		37390
# of unexpected failures	11
# of unexpected successes	2
# of expected failures		100
# of unresolved testcases	17
# of untested testcases		28
# of unsupported tests		449

		=== gcc Summary ===

# of expected passes		74778
# of unexpected failures	20
# of unexpected successes	4
# of expected failures		198
# of unresolved testcases	29
# of untested testcases		56
# of unsupported tests		901
/home/gccbuild/build/nightly/build-gcc-mline/gcc/xgcc  version 4.1.0 20050628 (experimental)

		=== gfortran tests ===


Running target unix/-m32
FAIL: gfortran.dg/eoshift.f90  -O0  execution test

		=== gfortran Summary for unix/-m32 ===

# of expected passes		7400
# of unexpected failures	1
# of expected failures		17
# of unsupported tests		33

Running target unix/-m64
FAIL: gfortran.dg/f2c_2.f90  -O0  execution test
FAIL: gfortran.dg/f2c_2.f90  -O1  execution test
FAIL: gfortran.dg/f2c_2.f90  -O2  execution test
FAIL: gfortran.dg/f2c_2.f90  -O3 -fomit-frame-pointer  execution test
FAIL: gfortran.dg/f2c_2.f90  -O3 -fomit-frame-pointer -funroll-loops  execution test
FAIL: gfortran.dg/f2c_2.f90  -O3 -fomit-frame-pointer -funroll-all-loops -finline-functions  execution test
FAIL: gfortran.dg/f2c_2.f90  -O3 -g  execution test
FAIL: gfortran.dg/f2c_2.f90  -Os  execution test
FAIL: gfortran.dg/namelist_14.f90  -O0  (test for excess errors)
WARNING: gfortran.dg/namelist_14.f90  -O0  compilation failed to produce executable
FAIL: gfortran.dg/g77/cabs.f  -O0  execution test
FAIL: gfortran.dg/g77/cabs.f  -O1  execution test
FAIL: gfortran.dg/g77/cabs.f  -O2  execution test
FAIL: gfortran.dg/g77/cabs.f  -O3 -fomit-frame-pointer  execution test
FAIL: gfortran.dg/g77/cabs.f  -O3 -fomit-frame-pointer -funroll-loops  execution test
FAIL: gfortran.dg/g77/cabs.f  -O3 -fomit-frame-pointer -funroll-all-loops -finline-functions  execution test
FAIL: gfortran.dg/g77/cabs.f  -O3 -g  execution test
FAIL: gfortran.dg/g77/cabs.f  -Os  execution test
XPASS: gfortran.dg/vect/vect-5.f90  -O  scan-tree-dump-times vectorized 2 loops 1
XPASS: gfortran.dg/vect/vect-5.f90  -O  scan-tree-dump-times Alignment of access forced using peeling 1
XPASS: gfortran.dg/vect/vect-5.f90  -O  scan-tree-dump-times Vectorizing an unaligned access 2
FAIL: gfortran.fortran-torture/execute/intrinsic_abs.f90 execution,  -O0 
FAIL: gfortran.fortran-torture/execute/intrinsic_abs.f90 execution,  -O1 
FAIL: gfortran.fortran-torture/execute/intrinsic_abs.f90 execution,  -O2 
FAIL: gfortran.fortran-torture/execute/intrinsic_abs.f90 execution,  -O3 -fomit-frame-pointer 
FAIL: gfortran.fortran-torture/execute/intrinsic_abs.f90 execution,  -O3 -fomit-frame-pointer -funroll-loops 
FAIL: gfortran.fortran-torture/execute/intrinsic_abs.f90 execution,  -O3 -fomit-frame-pointer -funroll-all-loops -finline-functions 
FAIL: gfortran.fortran-torture/execute/intrinsic_abs.f90 execution,  -O3 -g 
FAIL: gfortran.fortran-torture/execute/intrinsic_abs.f90 execution,  -Os 
FAIL: gfortran.fortran-torture/execute/power.f90 execution,  -O0 
FAIL: gfortran.fortran-torture/execute/power.f90 execution,  -O1 
FAIL: gfortran.fortran-torture/execute/power.f90 execution,  -O2 
FAIL: gfortran.fortran-torture/execute/power.f90 execution,  -O3 -fomit-frame-pointer 
FAIL: gfortran.fortran-torture/execute/power.f90 execution,  -O3 -fomit-frame-pointer -funroll-loops 
FAIL: gfortran.fortran-torture/execute/power.f90 execution,  -O3 -fomit-frame-pointer -funroll-all-loops -finline-functions 
FAIL: gfortran.fortran-torture/execute/power.f90 execution,  -O3 -g 
FAIL: gfortran.fortran-torture/execute/power.f90 execution,  -Os 

		=== gfortran Summary for unix/-m64 ===

# of expected passes		7364
# of unexpected failures	33
# of unexpected successes	3
# of expected failures		17
# of unsupported tests		33

		=== gfortran Summary ===

# of expected passes		14764
# of unexpected failures	34
# of unexpected successes	3
# of expected failures		34
# of unsupported tests		66
/home/gccbuild/build/nightly/build-gcc-mline/gcc/testsuite/../gfortran  version 4.1.0 20050628 (experimental)

		=== obj-c++ tests ===


Running target unix/-m32
FAIL: obj-c++.dg/bitfield-2.mm execution test
FAIL: obj-c++.dg/cxx-ivars-1.mm execution test
FAIL: obj-c++.dg/cxx-ivars-2.mm execution test
FAIL: obj-c++.dg/cxx-scope-1.mm execution test
FAIL: obj-c++.dg/defs.mm execution test
FAIL: obj-c++.dg/encode-4.mm (test for excess errors)
WARNING: obj-c++.dg/encode-4.mm compilation failed to produce executable
FAIL: obj-c++.dg/encode-5.mm (test for excess errors)
WARNING: obj-c++.dg/encode-5.mm compilation failed to produce executable
FAIL: obj-c++.dg/encode-6.mm (test for excess errors)
WARNING: obj-c++.dg/encode-6.mm compilation failed to produce executable
FAIL: obj-c++.dg/encode-8.mm execution test
FAIL: obj-c++.dg/isa-field-1.mm (test for excess errors)
FAIL: obj-c++.dg/lookup-2.mm (test for excess errors)
WARNING: obj-c++.dg/lookup-2.mm compilation failed to produce executable
FAIL: obj-c++.dg/method-10.mm execution test
FAIL: obj-c++.dg/method-17.mm execution test
FAIL: obj-c++.dg/method-19.mm (test for excess errors)
WARNING: obj-c++.dg/method-19.mm compilation failed to produce executable
FAIL: obj-c++.dg/proto-lossage-3.mm execution test
FAIL: obj-c++.dg/proto-qual-1.mm execution test
FAIL: obj-c++.dg/qual-types-1.mm execution test
FAIL: obj-c++.dg/template-1.mm execution test
FAIL: obj-c++.dg/template-4.mm execution test
FAIL: obj-c++.dg/try-catch-2.mm (test for excess errors)
WARNING: obj-c++.dg/try-catch-2.mm compilation failed to produce executable
FAIL: obj-c++.dg/try-catch-9.mm (test for excess errors)
WARNING: obj-c++.dg/try-catch-9.mm compilation failed to produce executable
FAIL: obj-c++.dg/va-meth-1.mm execution test

		=== obj-c++ Summary for unix/-m32 ===

# of expected passes		389
# of unexpected failures	22
# of unsupported tests		11

Running target unix/-m64
FAIL: obj-c++.dg/basic.mm (test for excess errors)
WARNING: obj-c++.dg/basic.mm compilation failed to produce executable
FAIL: obj-c++.dg/bitfield-1.mm (test for excess errors)
WARNING: obj-c++.dg/bitfield-1.mm compilation failed to produce executable
FAIL: obj-c++.dg/bitfield-2.mm (test for excess errors)
WARNING: obj-c++.dg/bitfield-2.mm compilation failed to produce executable
FAIL: obj-c++.dg/bitfield-4.mm (test for excess errors)
WARNING: obj-c++.dg/bitfield-4.mm compilation failed to produce executable
FAIL: obj-c++.dg/comp-types-1.mm (test for excess errors)
FAIL: obj-c++.dg/comp-types-10.mm (test for excess errors)
FAIL: obj-c++.dg/comp-types-11.mm (test for excess errors)
FAIL: obj-c++.dg/comp-types-2.mm (test for excess errors)
FAIL: obj-c++.dg/comp-types-3.mm (test for excess errors)
FAIL: obj-c++.dg/comp-types-4.mm (test for excess errors)
FAIL: obj-c++.dg/comp-types-6.mm (test for excess errors)
FAIL: obj-c++.dg/comp-types-7.mm (test for excess errors)
FAIL: obj-c++.dg/comp-types-8.mm (test for excess errors)
FAIL: obj-c++.dg/comp-types-9.mm (test for excess errors)
FAIL: obj-c++.dg/cxx-ivars-1.mm (test for excess errors)
WARNING: obj-c++.dg/cxx-ivars-1.mm compilation failed to produce executable
FAIL: obj-c++.dg/cxx-ivars-2.mm (test for excess errors)
WARNING: obj-c++.dg/cxx-ivars-2.mm compilation failed to produce executable
FAIL: obj-c++.dg/cxx-scope-1.mm (test for excess errors)
WARNING: obj-c++.dg/cxx-scope-1.mm compilation failed to produce executable
FAIL: obj-c++.dg/defs.mm (test for excess errors)
WARNING: obj-c++.dg/defs.mm compilation failed to produce executable
FAIL: obj-c++.dg/encode-1.mm (test for excess errors)
ERROR: obj-c++.dg/encode-1.mm: error executing dg-final: couldn't open "encode-1.s": no such file or directory
UNRESOLVED: obj-c++.dg/encode-1.mm: error executing dg-final: couldn't open "encode-1.s": no such file or directory
FAIL: obj-c++.dg/encode-3.mm (test for excess errors)
WARNING: obj-c++.dg/encode-3.mm compilation failed to produce executable
FAIL: obj-c++.dg/encode-4.mm (test for excess errors)
WARNING: obj-c++.dg/encode-4.mm compilation failed to produce executable
FAIL: obj-c++.dg/encode-5.mm (test for excess errors)
WARNING: obj-c++.dg/encode-5.mm compilation failed to produce executable
FAIL: obj-c++.dg/encode-6.mm (test for excess errors)
WARNING: obj-c++.dg/encode-6.mm compilation failed to produce executable
FAIL: obj-c++.dg/encode-7.mm (test for excess errors)
FAIL: obj-c++.dg/encode-8.mm (test for excess errors)
WARNING: obj-c++.dg/encode-8.mm compilation failed to produce executable
FAIL: obj-c++.dg/extern-c-1.mm (test for excess errors)
FAIL: obj-c++.dg/isa-field-1.mm (test for excess errors)
FAIL: obj-c++.dg/layout-1.mm (test for excess errors)
FAIL: obj-c++.dg/local-decl-1.mm (test for excess errors)
FAIL: obj-c++.dg/lookup-2.mm (test for excess errors)
WARNING: obj-c++.dg/lookup-2.mm compilation failed to produce executable
FAIL: obj-c++.dg/method-1.mm (test for excess errors)
FAIL: obj-c++.dg/method-10.mm (test for excess errors)
WARNING: obj-c++.dg/method-10.mm compilation failed to produce executable
FAIL: obj-c++.dg/method-11.mm (test for excess errors)
ERROR: obj-c++.dg/method-11.mm: error executing dg-final: couldn't open "method-11.s": no such file or directory
UNRESOLVED: obj-c++.dg/method-11.mm: error executing dg-final: couldn't open "method-11.s": no such file or directory
FAIL: obj-c++.dg/method-13.mm (test for excess errors)
FAIL: obj-c++.dg/method-14.mm (test for excess errors)
FAIL: obj-c++.dg/method-15.mm (test for excess errors)
FAIL: obj-c++.dg/method-17.mm (test for excess errors)
WARNING: obj-c++.dg/method-17.mm compilation failed to produce executable
FAIL: obj-c++.dg/method-18.mm (test for excess errors)
FAIL: obj-c++.dg/method-19.mm (test for excess errors)
WARNING: obj-c++.dg/method-19.mm compilation failed to produce executable
FAIL: obj-c++.dg/method-2.mm (test for excess errors)
FAIL: obj-c++.dg/method-20.mm (test for excess errors)
ERROR: obj-c++.dg/method-20.mm: error executing dg-final: couldn't open "method-20.s": no such file or directory
UNRESOLVED: obj-c++.dg/method-20.mm: error executing dg-final: couldn't open "method-20.s": no such file or directory
FAIL: obj-c++.dg/method-3.mm (test for excess errors)
FAIL: obj-c++.dg/method-4.mm (test for excess errors)
FAIL: obj-c++.dg/method-5.mm (test for excess errors)
FAIL: obj-c++.dg/method-6.mm (test for excess errors)
FAIL: obj-c++.dg/method-9.mm (test for excess errors)
FAIL: obj-c++.dg/no-extra-load.mm (test for excess errors)
ERROR: obj-c++.dg/no-extra-load.mm: error executing dg-final: couldn't open "no-extra-load.s": no such file or directory
UNRESOLVED: obj-c++.dg/no-extra-load.mm: error executing dg-final: couldn't open "no-extra-load.s": no such file or directory
FAIL: obj-c++.dg/pragma-2.mm (test for excess errors)
FAIL: obj-c++.dg/private-2.mm (test for excess errors)
FAIL: obj-c++.dg/proto-lossage-1.mm (test for excess errors)
FAIL: obj-c++.dg/proto-lossage-2.mm (test for excess errors)
FAIL: obj-c++.dg/proto-lossage-3.mm (test for excess errors)
WARNING: obj-c++.dg/proto-lossage-3.mm compilation failed to produce executable
FAIL: obj-c++.dg/proto-qual-1.mm (test for excess errors)
WARNING: obj-c++.dg/proto-qual-1.mm compilation failed to produce executable
FAIL: obj-c++.dg/qual-types-1.mm (test for excess errors)
WARNING: obj-c++.dg/qual-types-1.mm compilation failed to produce executable
FAIL: obj-c++.dg/selector-1.mm (test for excess errors)
ERROR: obj-c++.dg/selector-1.mm: error executing dg-final: couldn't open "selector-1.s": no such file or directory
UNRESOLVED: obj-c++.dg/selector-1.mm: error executing dg-final: couldn't open "selector-1.s": no such file or directory
FAIL: obj-c++.dg/selector-2.mm (test for excess errors)
FAIL: obj-c++.dg/selector-3.mm (test for excess errors)
FAIL: obj-c++.dg/selector-4.mm (test for excess errors)
FAIL: obj-c++.dg/super-class-1.mm (test for excess errors)
FAIL: obj-c++.dg/super-dealloc-1.mm (test for excess errors)
FAIL: obj-c++.dg/super-dealloc-2.mm (test for excess errors)
FAIL: obj-c++.dg/template-1.mm (test for excess errors)
WARNING: obj-c++.dg/template-1.mm compilation failed to produce executable
FAIL: obj-c++.dg/template-3.mm (test for excess errors)
WARNING: obj-c++.dg/template-3.mm compilation failed to produce executable
FAIL: obj-c++.dg/template-4.mm (test for excess errors)
WARNING: obj-c++.dg/template-4.mm compilation failed to produce executable
FAIL: obj-c++.dg/template-5.mm (test for excess errors)
ERROR: obj-c++.dg/template-5.mm: error executing dg-final: couldn't open "template-5.s": no such file or directory
UNRESOLVED: obj-c++.dg/template-5.mm: error executing dg-final: couldn't open "template-5.s": no such file or directory
FAIL: obj-c++.dg/template-6.mm (test for excess errors)
ERROR: obj-c++.dg/template-6.mm: error executing dg-final: couldn't open "template-6.s": no such file or directory
UNRESOLVED: obj-c++.dg/template-6.mm: error executing dg-final: couldn't open "template-6.s": no such file or directory
FAIL: obj-c++.dg/try-catch-1.mm (test for excess errors)
FAIL: obj-c++.dg/try-catch-10.mm (test for excess errors)
FAIL: obj-c++.dg/try-catch-2.mm (test for excess errors)
WARNING: obj-c++.dg/try-catch-2.mm compilation failed to produce executable
FAIL: obj-c++.dg/try-catch-3.mm (test for excess errors)
FAIL: obj-c++.dg/try-catch-4.mm (test for excess errors)
FAIL: obj-c++.dg/try-catch-5.mm (test for excess errors)
FAIL: obj-c++.dg/try-catch-6.mm (test for excess errors)
FAIL: obj-c++.dg/try-catch-7.mm (test for excess errors)
FAIL: obj-c++.dg/try-catch-8.mm (test for excess errors)
FAIL: obj-c++.dg/try-catch-9.mm (test for excess errors)
WARNING: obj-c++.dg/try-catch-9.mm compilation failed to produce executable
FAIL: obj-c++.dg/typedef-alias-1.mm (test for excess errors)
FAIL: obj-c++.dg/va-meth-1.mm (test for excess errors)
WARNING: obj-c++.dg/va-meth-1.mm compilation failed to produce executable

		=== obj-c++ Summary for unix/-m64 ===

# of expected passes		300
# of unexpected failures	78
# of unresolved testcases	7
# of unsupported tests		11

		=== obj-c++ Summary ===

# of expected passes		689
# of unexpected failures	100
# of unresolved testcases	7
# of unsupported tests		22
/home/gccbuild/build/nightly/build-gcc-mline/gcc/testsuite/../g++  version 4.1.0 20050628 (experimental)

		=== objc tests ===


Running target unix/-m32

		=== objc Summary for unix/-m32 ===

# of expected passes		1585
# of unsupported tests		21

Running target unix/-m64

		=== objc Summary for unix/-m64 ===

# of expected passes		1585
# of unsupported tests		21

		=== objc Summary ===

# of expected passes		3170
# of unsupported tests		42
/home/gccbuild/build/nightly/build-gcc-mline/gcc/xgcc  version 4.1.0 20050628 (experimental)

		=== libffi tests ===


Running target unix/-m32

		=== libffi Summary for unix/-m32 ===

# of expected passes		219
# of unsupported tests		2

Running target unix/-m64
FAIL: libffi.call/float3.c execution test

		=== libffi Summary for unix/-m64 ===

# of expected passes		218
# of unexpected failures	1
# of unsupported tests		2

		=== libffi Summary ===

# of expected passes		437
# of unexpected failures	1
# of unsupported tests		4
		=== libjava tests ===


Running target unix/-m32
FAIL: Divide_1 output - source compiled test
FAIL: Divide_1 output - gij test
FAIL: Divide_1 output - bytecode->native test
FAIL: Divide_1 -O3 output - source compiled test
FAIL: Divide_1 output - gij test
FAIL: Divide_1 -O3 output - bytecode->native test

		=== libjava Summary for unix/-m32 ===

# of expected passes		3899
# of unexpected failures	6
# of expected failures		10
# of untested testcases		8

Running target unix/-m64
FAIL: PR16923.c compilation
FAIL: Array_3 -O3 execution - bytecode->native test
FAIL: Divide_1 output - source compiled test
FAIL: Divide_1 output - gij test
FAIL: Divide_1 output - bytecode->native test
FAIL: Divide_1 -O3 output - source compiled test
FAIL: Divide_1 output - gij test
FAIL: Divide_1 -O3 output - bytecode->native test

		=== libjava Summary for unix/-m64 ===

# of expected passes		3895
# of unexpected failures	8
# of expected failures		10
# of untested testcases		9

		=== libjava Summary ===

# of expected passes		7794
# of unexpected failures	14
# of expected failures		20
# of untested testcases		17
		=== libmudflap tests ===


Running target unix/-m32

		=== libmudflap Summary for unix/-m32 ===

# of expected passes		1771

Running target unix/-m64
FAIL: libmudflap.c/fail27-frag.c output pattern test
FAIL: libmudflap.c/fail27-frag.c (-O2) output pattern test
FAIL: libmudflap.c/fail27-frag.c (-O3) output pattern test

		=== libmudflap Summary for unix/-m64 ===

# of expected passes		1768
# of unexpected failures	3

		=== libmudflap Summary ===

# of expected passes		3539
# of unexpected failures	3
		=== libstdc++ tests ===


Running target unix/-m32
FAIL: abi_check
XPASS: 26_numerics/cmath/c99_classification_macros_c.cc (test for excess errors)
XPASS: ext/array_allocator/2.cc execution test

		=== libstdc++ Summary for unix/-m32 ===

# of expected passes		3839
# of unexpected failures	1
# of unexpected successes	2
# of expected failures		13

Running target unix/-m64
FAIL: abi_check
FAIL: 22_locale/messages/members/char/1.cc execution test
FAIL: 22_locale/messages/members/char/2.cc execution test
FAIL: 22_locale/messages/members/char/wrapped_env.cc execution test
FAIL: 22_locale/messages/members/char/wrapped_locale.cc execution test
FAIL: 22_locale/messages_byname/named_equivalence.cc execution test
XPASS: 26_numerics/cmath/c99_classification_macros_c.cc (test for excess errors)
XPASS: 27_io/fpos/14320-1.cc execution test
XPASS: ext/array_allocator/2.cc execution test
FAIL: ext/pb_assoc/example/basic_map.cc (test for excess errors)
FAIL: ext/pb_assoc/example/basic_multimap.cc (test for excess errors)
FAIL: ext/pb_assoc/example/basic_set.cc (test for excess errors)
FAIL: ext/pb_assoc/example/erase_if.cc (test for excess errors)
FAIL: ext/pb_assoc/example/extract_key.cc (test for excess errors)
FAIL: ext/pb_assoc/example/hash_find_neg.cc (test for excess errors)
FAIL: ext/pb_assoc/example/hash_initial_size.cc (test for excess errors)
FAIL: ext/pb_assoc/example/hash_load_set_change.cc (test for excess errors)
FAIL: ext/pb_assoc/example/hash_resize.cc (test for excess errors)
FAIL: ext/pb_assoc/example/hash_shift_mask.cc (test for excess errors)
FAIL: ext/pb_assoc/example/store_hash.cc (test for excess errors)

		=== libstdc++ Summary for unix/-m64 ===

# of expected passes		3820
# of unexpected failures	17
# of unexpected successes	3
# of expected failures		15

		=== libstdc++ Summary ===

# of expected passes		7659
# of unexpected failures	18
# of unexpected successes	5
# of expected failures		28

Compiler version: 4.1.0 20050628 (experimental) 
Platform: powerpc64-unknown-linux-gnu
configure flags: --prefix=/opt/gcc-nightly/mline-20050628 --build=powerpc64-linux --host=powerpc64-linux --target=powerpc64-linux --with-cpu=default32 --with-as=/opt/gcc-nightly/mline-20050628/bin/as --with-ld=/opt/gcc-nightly/mline-20050628/bin/ld --enable-threads=posix --enable-shared --enable-__cxa_atexit --enable-checking --with-mpfr=/opt/gcc-nightly/mline-20050628 --enable-languages=c,c++,f95,java,objc,obj-c++

		=== Test Framework Summary ===

# of expected passes		2486


Index Nav: [Date Index] [Subject Index] [Author Index] [Thread Index]
Message Nav: [Date Prev] [Date Next] [Thread Prev] [Thread Next]