This is the mail archive of the
gcc-help@gcc.gnu.org
mailing list for the GCC project.
Can't build gcc-3.0.2 on hppa1.1-hp-hpux11.11
- To: <gcc-help at gcc dot gnu dot org>
- Subject: Can't build gcc-3.0.2 on hppa1.1-hp-hpux11.11
- From: "Brian Ruppert" <brian at bruppert dot com>
- Date: Sun, 4 Nov 2001 22:06:40 -0600
Trying to build GCC-3.0.2 on a HP-UX system and keep running into a
problem. Using GNU make 3.79, binutils 2.11.2, HP-UX 11i.
Looking at the errors, all the lines with errors seem to refer to
__size_t - that's the only common thing I can figure out.
Any suggestions would be appreciated..
--
/home/brian/gccbuild/gcc/xgcc -B/home/brian/gccbuild/gcc/ -B/opt/gcc-3.0.2/h
ppa1
.1-hp-hpux11.11/bin/ -B/opt/gcc-3.0.2/hppa1.1-hp-hpux11.11/lib/ -isystem
/opt/gc
c-3.0.2/hppa1.1-hp-hpux11.11/include -O2 -DIN_GCC -W -Wall -Wwrite-stri
ngs
-Wstrict-prototypes -Wmissing-prototypes -isystem
/include -fPIC -g1 -DIN_LIB
GCC2 -D__GCC_FLOAT_NOT_NEEDED -I. -I. -I../../gcc-3.0.2/gcc -I../../gcc-3.0
.2/g
cc/. -I../../gcc-3.0.2/gcc/config -I../../gcc-3.0.2/gcc/../include -DUSE_COL
LECT
2 -DL_muldi3 -c ../../gcc-3.0.2/gcc/libgcc2.c -o libgcc/./_muldi3.o
In file included from ../../gcc-3.0.2/gcc/tsystem.h:63,
from ../../gcc-3.0.2/gcc/libgcc2.c:37:
/home/brian/gccbuild/gcc/include/stdio.h:607: parse error before ',' token
/home/brian/gccbuild/gcc/include/stdio.h:608: parse error before ',' token
In file included from ../../gcc-3.0.2/gcc/tsystem.h:76,
from ../../gcc-3.0.2/gcc/libgcc2.c:37:
/home/brian/gccbuild/gcc/include/string.h:263: parse error before ')' token
/home/brian/gccbuild/gcc/include/string.h:315: parse error before ')' token
In file included from ../../gcc-3.0.2/gcc/tsystem.h:80,
from ../../gcc-3.0.2/gcc/libgcc2.c:37:
/home/brian/gccbuild/gcc/include/stdlib.h:293: parse error before ',' token
In file included from /usr/include/sys/resource.h:50,
from /usr/include/sys/wait.h:91,
from /home/brian/gccbuild/gcc/include/stdlib.h:307,
from ../../gcc-3.0.2/gcc/tsystem.h:80,
from ../../gcc-3.0.2/gcc/libgcc2.c:37:
/usr/include/sys/time.h:546: parse error before ',' token
In file included from /usr/include/sys/signal.h:43,
from /usr/include/sys/wait.h:126,
from /home/brian/gccbuild/gcc/include/stdlib.h:307,
from ../../gcc-3.0.2/gcc/tsystem.h:80,
from ../../gcc-3.0.2/gcc/libgcc2.c:37:
/usr/include/sys/newsig.h:68: parse error before "ss_size"
/usr/include/sys/newsig.h:89: parse error before "stack_t"
/usr/include/sys/newsig.h:103: field `uc_subcontext' has incomplete type
/usr/include/sys/newsig.h:105: confused by earlier errors, bailing out
make[2]: *** [libgcc/./_muldi3.o] Error 1
make[2]: Leaving directory `/home/brian/gccbuild/gcc'
make[1]: *** [libgcc.a] Error 2
make[1]: Leaving directory `/home/brian/gccbuild/gcc'
make: *** [all-gcc] Error 2
// Brian Ruppert / brian@bruppert.com