This is the mail archive of the
gcc-bugs@gcc.gnu.org
mailing list for the GCC project.
[Bug other/81927] New: [8 regression] Many, many test case failures starting with r251220
- From: "seurer at gcc dot gnu.org" <gcc-bugzilla at gcc dot gnu dot org>
- To: gcc-bugs at gcc dot gnu dot org
- Date: Tue, 22 Aug 2017 16:10:22 +0000
- Subject: [Bug other/81927] New: [8 regression] Many, many test case failures starting with r251220
- Auto-submitted: auto-generated
https://gcc.gnu.org/bugzilla/show_bug.cgi?id=81927
Bug ID: 81927
Summary: [8 regression] Many, many test case failures starting
with r251220
Product: gcc
Version: 8.0
Status: UNCONFIRMED
Severity: normal
Priority: P3
Component: other
Assignee: unassigned at gcc dot gnu.org
Reporter: seurer at gcc dot gnu.org
Target Milestone: ---
Here's one in detail:
spawn -ignore SIGHUP /home/seurer/gcc/build/gcc-test/gcc/xgcc
-B/home/seurer/gcc/build/gcc-test/gcc/
/home/seurer/gcc/gcc-test/gcc/testsuite/c-c++-common/asan/alloca_big_alignment.c
-B/home/seurer/gcc/build/gcc-test/powerpc64-unknown-linux-gnu/./libsanitizer/
-B/home/seurer/gcc/build/gcc-test/powerpc64-unknown-linux-gnu/./libsanitizer/asan/
-L/home/seurer/gcc/build/gcc-test/powerpc64-unknown-linux-gnu/./libsanitizer/asan/.libs
-fsanitize=address -g
-I/home/seurer/gcc/gcc-test/gcc/testsuite/../../libsanitizer/include
-fno-diagnostics-show-caret -fdiagnostics-color=never -O2 -flto
-fno-use-linker-plugin -flto-partition=none -lm -o ./alloca_big_alignment.exe
/tmp/ccS0sV4idebugobjtem: file not recognized: Bad value
collect2: error: ld returned 1 exit status
lto-wrapper: fatal error: /home/seurer/gcc/build/gcc-test/gcc/xgcc returned 1
exit status
compilation terminated.
collect2: fatal error: lto-wrapper returned 1 exit status
compilation terminated.
compiler exited with status 1
output is:
/tmp/ccS0sV4idebugobjtem: file not recognized: Bad value
collect2: error: ld returned 1 exit status
lto-wrapper: fatal error: /home/seurer/gcc/build/gcc-test/gcc/xgcc returned 1
exit status
compilation terminated.
collect2: fatal error: lto-wrapper returned 1 exit status
compilation terminated.
FAIL: c-c++-common/asan/alloca_big_alignment.c -O2 -flto
-fno-use-linker-plugin -flto-partition=none (test for excess errors)
Excess errors:
/tmp/ccS0sV4idebugobjtem: file not recognized: Bad value
lto-wrapper: fatal error: /home/seurer/gcc/build/gcc-test/gcc/xgcc returned 1
exit status
compilation terminated.
collect2: fatal error: lto-wrapper returned 1 exit status
compilation terminated.
Here's the output of the compilation command with -v:
Reading specs from /home/seurer/gcc/build/gcc-test/gcc/specs
COLLECT_GCC=/home/seurer/gcc/build/gcc-test/gcc/xgcc
COLLECT_LTO_WRAPPER=/home/seurer/gcc/build/gcc-test/gcc/lto-wrapper
Target: powerpc64-unknown-linux-gnu
Configured with: /home/seurer/gcc/gcc-test/configure
--prefix=/home/seurer/gcc/install/gcc-test --enable-languages=c,fortran,c++
--with-cpu=power8 --disable-bootstrap
--with-as=/home/seurer/binutils/install/bin/as
--with-ld=/home/seurer/binutils/install/bin/ld
Thread model: posix
gcc version 8.0.0 20170821 (experimental) [trunk revision 251220] (GCC)
COLLECT_GCC_OPTIONS='-fdiagnostics-color=never' '-v' '-B'
'/home/seurer/gcc/build/gcc-test/gcc/' '-B'
'/home/seurer/gcc/build/gcc-test/powerpc64-unknown-linux-gnu/./libsanitizer/'
'-B'
'/home/seurer/gcc/build/gcc-test/powerpc64-unknown-linux-gnu/./libsanitizer/asan/'
'-L/home/seurer/gcc/build/gcc-test/powerpc64-unknown-linux-gnu/./libsanitizer/asan/.libs'
'-fsanitize=address' '-g' '-I'
'/home/seurer/gcc/gcc-test/gcc/testsuite/../../libsanitizer/include'
'-fno-diagnostics-show-caret' '-O2' '-flto' '-fno-use-linker-plugin'
'-flto-partition=none' '-o' './alloca_big_alignment.exe' '-mcpu=power8'
/home/seurer/gcc/build/gcc-test/gcc/cc1 -quiet -v -I
/home/seurer/gcc/gcc-test/gcc/testsuite/../../libsanitizer/include -iprefix
/home/seurer/gcc/build/gcc-test/gcc/../lib/gcc/powerpc64-unknown-linux-gnu/8.0.0/
-isystem /home/seurer/gcc/build/gcc-test/gcc/include -isystem
/home/seurer/gcc/build/gcc-test/gcc/include-fixed -D__unix__ -D__gnu_linux__
-D__linux__ -Dunix -D__unix -Dlinux -D__linux -Asystem=linux -Asystem=unix
-Asystem=posix
/home/seurer/gcc/gcc-test/gcc/testsuite/c-c++-common/asan/alloca_big_alignment.c
-quiet -dumpbase alloca_big_alignment.c -mcpu=power8 -auxbase
alloca_big_alignment -g -O2 -version -fdiagnostics-color=never
-fsanitize=address -fno-diagnostics-show-caret -flto -fno-use-linker-plugin
-flto-partition=none -o /tmp/ccBq2zds.s
GNU C11 (GCC) version 8.0.0 20170821 (experimental) [trunk revision 251220]
(powerpc64-unknown-linux-gnu)
compiled by GNU C version 7.1.0, GMP version 6.1.0, MPFR version 3.1.4,
MPC version 1.0.3, isl version isl-0.16.1-GMP
GGC heuristics: --param ggc-min-expand=30 --param ggc-min-heapsize=4096
ignoring nonexistent directory
"/home/seurer/gcc/build/gcc-test/gcc/../lib/gcc/powerpc64-unknown-linux-gnu/8.0.0/include"
ignoring nonexistent directory
"/home/seurer/gcc/build/gcc-test/gcc/../lib/gcc/powerpc64-unknown-linux-gnu/8.0.0/include-fixed"
ignoring nonexistent directory
"/home/seurer/gcc/build/gcc-test/gcc/../lib/gcc/powerpc64-unknown-linux-gnu/8.0.0/../../../../powerpc64-unknown-linux-gnu/include"
ignoring nonexistent directory
"/home/seurer/gcc/build/gcc-test/gcc/../lib/gcc/../../lib/gcc/powerpc64-unknown-linux-gnu/8.0.0/include"
ignoring nonexistent directory
"/home/seurer/gcc/build/gcc-test/gcc/../lib/gcc/../../include"
ignoring nonexistent directory
"/home/seurer/gcc/build/gcc-test/gcc/../lib/gcc/../../lib/gcc/powerpc64-unknown-linux-gnu/8.0.0/include-fixed"
ignoring nonexistent directory
"/home/seurer/gcc/build/gcc-test/gcc/../lib/gcc/../../lib/gcc/powerpc64-unknown-linux-gnu/8.0.0/../../../../powerpc64-unknown-linux-gnu/include"
#include "..." search starts here:
#include <...> search starts here:
/home/seurer/gcc/gcc-test/gcc/testsuite/../../libsanitizer/include
/home/seurer/gcc/build/gcc-test/gcc/include
/home/seurer/gcc/build/gcc-test/gcc/include-fixed
/usr/local/include
/usr/include
End of search list.
GNU C11 (GCC) version 8.0.0 20170821 (experimental) [trunk revision 251220]
(powerpc64-unknown-linux-gnu)
compiled by GNU C version 7.1.0, GMP version 6.1.0, MPFR version 3.1.4,
MPC version 1.0.3, isl version isl-0.16.1-GMP
GGC heuristics: --param ggc-min-expand=30 --param ggc-min-heapsize=4096
Compiler executable checksum: 7524150231d0f160f70b2b1e96cd2bd8
COLLECT_GCC_OPTIONS='-fdiagnostics-color=never' '-v' '-B'
'/home/seurer/gcc/build/gcc-test/gcc/' '-B'
'/home/seurer/gcc/build/gcc-test/powerpc64-unknown-linux-gnu/./libsanitizer/'
'-B'
'/home/seurer/gcc/build/gcc-test/powerpc64-unknown-linux-gnu/./libsanitizer/asan/'
'-L/home/seurer/gcc/build/gcc-test/powerpc64-unknown-linux-gnu/./libsanitizer/asan/.libs'
'-fsanitize=address' '-g' '-I'
'/home/seurer/gcc/gcc-test/gcc/testsuite/../../libsanitizer/include'
'-fno-diagnostics-show-caret' '-O2' '-flto' '-fno-use-linker-plugin'
'-flto-partition=none' '-o' './alloca_big_alignment.exe' '-mcpu=power8'
/home/seurer/binutils/install/bin/as -v -I
/home/seurer/gcc/gcc-test/gcc/testsuite/../../libsanitizer/include -a64
-mpower8 -many -mbig -o /tmp/cc7NumzH.o /tmp/ccBq2zds.s
GNU assembler version 2.26.51 (powerpc64-unknown-linux-gnu) using BFD version
(GNU Binutils) 2.26.51.20151113
COMPILER_PATH=/home/seurer/gcc/build/gcc-test/gcc/:/home/seurer/gcc/build/gcc-test/powerpc64-unknown-linux-gnu/./libsanitizer/:/home/seurer/gcc/build/gcc-test/powerpc64-unknown-linux-gnu/./libsanitizer/asan/
LIBRARY_PATH=/home/seurer/gcc/build/gcc-test/gcc/:/home/seurer/gcc/build/gcc-test/powerpc64-unknown-linux-gnu/./libsanitizer/:/home/seurer/gcc/build/gcc-test/powerpc64-unknown-linux-gnu/./libsanitizer/asan/:/lib/../lib64/:/usr/lib/../lib64/:/lib/:/usr/lib/
COLLECT_GCC_OPTIONS='-fdiagnostics-color=never' '-v' '-B'
'/home/seurer/gcc/build/gcc-test/gcc/' '-B'
'/home/seurer/gcc/build/gcc-test/powerpc64-unknown-linux-gnu/./libsanitizer/'
'-B'
'/home/seurer/gcc/build/gcc-test/powerpc64-unknown-linux-gnu/./libsanitizer/asan/'
'-L/home/seurer/gcc/build/gcc-test/powerpc64-unknown-linux-gnu/./libsanitizer/asan/.libs'
'-fsanitize=address' '-g' '-I'
'/home/seurer/gcc/gcc-test/gcc/testsuite/../../libsanitizer/include'
'-fno-diagnostics-show-caret' '-O2' '-flto' '-fno-use-linker-plugin'
'-flto-partition=none' '-o' './alloca_big_alignment.exe' '-mcpu=power8'
/home/seurer/gcc/build/gcc-test/gcc/collect2 -flto --eh-frame-hdr -V -m
elf64ppc -dynamic-linker /lib64/ld64.so.1 -o ./alloca_big_alignment.exe
/lib/../lib64/crt1.o /lib/../lib64/crti.o
/home/seurer/gcc/build/gcc-test/gcc/crtbegin.o
-L/home/seurer/gcc/build/gcc-test/powerpc64-unknown-linux-gnu/./libsanitizer/asan/.libs
-L/home/seurer/gcc/build/gcc-test/gcc
-L/home/seurer/gcc/build/gcc-test/powerpc64-unknown-linux-gnu/./libsanitizer
-L/home/seurer/gcc/build/gcc-test/powerpc64-unknown-linux-gnu/./libsanitizer/asan
-L/lib/../lib64 -L/usr/lib/../lib64
/home/seurer/gcc/build/gcc-test/powerpc64-unknown-linux-gnu/./libsanitizer/asan/libasan_preinit.o
-lasan /tmp/cc7NumzH.o -lm -lgcc --as-needed -lgcc_s --no-as-needed -lc -lgcc
--as-needed -lgcc_s --no-as-needed /home/seurer/gcc/build/gcc-test/gcc/crtend.o
/lib/../lib64/crtn.o
GNU ld (GNU Binutils) 2.26.51.20151113
Supported emulations:
elf64ppc
elf32ppc
elf32ppclinux
elf32ppcsim
/home/seurer/gcc/build/gcc-test/gcc/lto-wrapper /tmp/cc7NumzH.o
/home/seurer/gcc/build/gcc-test/gcc/xgcc @/tmp/cc4CeI1V
Reading specs from /home/seurer/gcc/build/gcc-test/gcc/specs
COLLECT_GCC=/home/seurer/gcc/build/gcc-test/gcc/xgcc
Target: powerpc64-unknown-linux-gnu
Configured with: /home/seurer/gcc/gcc-test/configure
--prefix=/home/seurer/gcc/install/gcc-test --enable-languages=c,fortran,c++
--with-cpu=power8 --disable-bootstrap
--with-as=/home/seurer/binutils/install/bin/as
--with-ld=/home/seurer/binutils/install/bin/ld
Thread model: posix
gcc version 8.0.0 20170821 (experimental) [trunk revision 251220] (GCC)
COLLECT_GCC_OPTIONS='-fdiagnostics-color=never' '-c' '-fno-openmp'
'-fno-openacc' '-mcpu=power8' '-O2' '-v' '-B'
'/home/seurer/gcc/build/gcc-test/gcc/' '-B'
'/home/seurer/gcc/build/gcc-test/powerpc64-unknown-linux-gnu/./libsanitizer/'
'-B'
'/home/seurer/gcc/build/gcc-test/powerpc64-unknown-linux-gnu/./libsanitizer/asan/'
'-L/home/seurer/gcc/build/gcc-test/powerpc64-unknown-linux-gnu/./libsanitizer/asan/.libs'
'-fsanitize=address' '-g' '-fno-diagnostics-show-caret' '-O2'
'-fno-use-linker-plugin' '-flto-partition=none' '-mcpu=power8' '-dumpdir' './'
'-dumpbase' 'alloca_big_alignment.exe' '-o' '/tmp/ccDBtlyG.lto.o'
/home/seurer/gcc/build/gcc-test/gcc/lto1 -quiet -dumpdir ./ -dumpbase
alloca_big_alignment.exe -mcpu=power8 -mcpu=power8 -auxbase-strip
/tmp/ccDBtlyG.lto.o -g -O2 -O2 -version -fdiagnostics-color=never -fno-openmp
-fno-openacc -fsanitize=address -fno-diagnostics-show-caret
-fno-use-linker-plugin -flto-partition=none @/tmp/ccpXuicG -o /tmp/ccZhbOFV.s
GNU GIMPLE (GCC) version 8.0.0 20170821 (experimental) [trunk revision 251220]
(powerpc64-unknown-linux-gnu)
compiled by GNU C version 7.1.0, GMP version 6.1.0, MPFR version 3.1.4,
MPC version 1.0.3, isl version isl-0.16.1-GMP
GGC heuristics: --param ggc-min-expand=30 --param ggc-min-heapsize=4096
GNU GIMPLE (GCC) version 8.0.0 20170821 (experimental) [trunk revision 251220]
(powerpc64-unknown-linux-gnu)
compiled by GNU C version 7.1.0, GMP version 6.1.0, MPFR version 3.1.4,
MPC version 1.0.3, isl version isl-0.16.1-GMP
GGC heuristics: --param ggc-min-expand=30 --param ggc-min-heapsize=4096
COLLECT_GCC_OPTIONS='-fdiagnostics-color=never' '-c' '-fno-openmp'
'-fno-openacc' '-mcpu=power8' '-O2' '-v' '-B'
'/home/seurer/gcc/build/gcc-test/gcc/' '-B'
'/home/seurer/gcc/build/gcc-test/powerpc64-unknown-linux-gnu/./libsanitizer/'
'-B'
'/home/seurer/gcc/build/gcc-test/powerpc64-unknown-linux-gnu/./libsanitizer/asan/'
'-L/home/seurer/gcc/build/gcc-test/powerpc64-unknown-linux-gnu/./libsanitizer/asan/.libs'
'-fsanitize=address' '-g' '-fno-diagnostics-show-caret' '-O2'
'-fno-use-linker-plugin' '-flto-partition=none' '-mcpu=power8' '-dumpdir' './'
'-dumpbase' 'alloca_big_alignment.exe' '-o' '/tmp/ccDBtlyG.lto.o'
/home/seurer/binutils/install/bin/as -v -a64 -mpower8 -many -mbig -o
/tmp/ccDBtlyG.lto.o /tmp/ccZhbOFV.s
GNU assembler version 2.26.51 (powerpc64-unknown-linux-gnu) using BFD version
(GNU Binutils) 2.26.51.20151113
COMPILER_PATH=/home/seurer/gcc/build/gcc-test/gcc/:/home/seurer/gcc/build/gcc-test/powerpc64-unknown-linux-gnu/./libsanitizer/:/home/seurer/gcc/build/gcc-test/powerpc64-unknown-linux-gnu/./libsanitizer/asan/:/home/seurer/gcc/build/gcc-test/gcc/:/home/seurer/gcc/build/gcc-test/powerpc64-unknown-linux-gnu/./libsanitizer/:/home/seurer/gcc/build/gcc-test/powerpc64-unknown-linux-gnu/./libsanitizer/asan/
LIBRARY_PATH=/home/seurer/gcc/build/gcc-test/gcc/:/home/seurer/gcc/build/gcc-test/powerpc64-unknown-linux-gnu/./libsanitizer/:/home/seurer/gcc/build/gcc-test/powerpc64-unknown-linux-gnu/./libsanitizer/asan/:/lib/../lib64/../lib64/:/usr/lib/../lib64/../lib64/:/lib/../lib64/:/usr/lib/../lib64/:/lib/../lib64/:/usr/lib/../lib64/:/home/seurer/gcc/build/gcc-test/gcc/:/home/seurer/gcc/build/gcc-test/powerpc64-unknown-linux-gnu/./libsanitizer/:/home/seurer/gcc/build/gcc-test/powerpc64-unknown-linux-gnu/./libsanitizer/asan/:/lib/../lib64/:/usr/lib/../lib64/:/lib/:/usr/lib/:/lib/:/usr/lib/
COLLECT_GCC_OPTIONS='-fdiagnostics-color=never' '-c' '-fno-openmp'
'-fno-openacc' '-mcpu=power8' '-O2' '-v' '-B'
'/home/seurer/gcc/build/gcc-test/gcc/' '-B'
'/home/seurer/gcc/build/gcc-test/powerpc64-unknown-linux-gnu/./libsanitizer/'
'-B'
'/home/seurer/gcc/build/gcc-test/powerpc64-unknown-linux-gnu/./libsanitizer/asan/'
'-L/home/seurer/gcc/build/gcc-test/powerpc64-unknown-linux-gnu/./libsanitizer/asan/.libs'
'-fsanitize=address' '-g' '-fno-diagnostics-show-caret' '-O2'
'-fno-use-linker-plugin' '-flto-partition=none' '-mcpu=power8' '-dumpdir' './'
'-dumpbase' 'alloca_big_alignment.exe' '-o' '/tmp/ccDBtlyG.lto.o'
/home/seurer/gcc/build/gcc-test/gcc/xgcc -B
/home/seurer/gcc/build/gcc-test/gcc/ -B
/home/seurer/gcc/build/gcc-test/powerpc64-unknown-linux-gnu/./libsanitizer/ -B
/home/seurer/gcc/build/gcc-test/powerpc64-unknown-linux-gnu/./libsanitizer/asan/
-mcpu=power8 -r -nostdlib -o /tmp/cc8OEpzbdebugobj /tmp/ccC8B76qdebugobjtem
/tmp/ccC8B76qdebugobjtem: file not recognized: Bad value
collect2: error: ld returned 1 exit status
lto-wrapper: fatal error: /home/seurer/gcc/build/gcc-test/gcc/xgcc returned 1
exit status
compilation terminated.
collect2: fatal error: lto-wrapper returned 1 exit status
compilation terminated.
Here's the whole list:
Tue Aug 22 11:06:58 CDT 2017
Failures found in new revision r251220: 434, versus failures found in previous
revision r251219: 125
Differences from previous run:
> FAIL: c-c++-common/asan/alloca_big_alignment.c -O2 -flto -fno-use-linker-plugin -flto-partition=none (test for excess errors)
> FAIL: c-c++-common/asan/alloca_big_alignment.c -O2 -flto -fno-use-linker-plugin -flto-partition=none (test for excess errors)
> FAIL: c-c++-common/asan/alloca_big_alignment.c -O2 -flto -fuse-linker-plugin -fno-fat-lto-objects (test for excess errors)
> FAIL: c-c++-common/asan/alloca_big_alignment.c -O2 -flto -fuse-linker-plugin -fno-fat-lto-objects (test for excess errors)
> FAIL: c-c++-common/asan/alloca_detect_custom_size.c -O2 -flto -fno-use-linker-plugin -flto-partition=none (test for excess errors)
> FAIL: c-c++-common/asan/alloca_detect_custom_size.c -O2 -flto -fno-use-linker-plugin -flto-partition=none (test for excess errors)
> FAIL: c-c++-common/asan/alloca_detect_custom_size.c -O2 -flto -fuse-linker-plugin -fno-fat-lto-objects (test for excess errors)
> FAIL: c-c++-common/asan/alloca_detect_custom_size.c -O2 -flto -fuse-linker-plugin -fno-fat-lto-objects (test for excess errors)
> FAIL: c-c++-common/asan/alloca_instruments_all_paddings.c -O2 -flto -fno-use-linker-plugin -flto-partition=none (test for excess errors)
> FAIL: c-c++-common/asan/alloca_instruments_all_paddings.c -O2 -flto -fno-use-linker-plugin -flto-partition=none (test for excess errors)
> FAIL: c-c++-common/asan/alloca_instruments_all_paddings.c -O2 -flto -fuse-linker-plugin -fno-fat-lto-objects (test for excess errors)
> FAIL: c-c++-common/asan/alloca_instruments_all_paddings.c -O2 -flto -fuse-linker-plugin -fno-fat-lto-objects (test for excess errors)
> FAIL: c-c++-common/asan/alloca_loop_unpoisoning.c -O2 -flto -fno-use-linker-plugin -flto-partition=none (test for excess errors)
> FAIL: c-c++-common/asan/alloca_loop_unpoisoning.c -O2 -flto -fno-use-linker-plugin -flto-partition=none (test for excess errors)
> FAIL: c-c++-common/asan/alloca_loop_unpoisoning.c -O2 -flto -fuse-linker-plugin -fno-fat-lto-objects (test for excess errors)
> FAIL: c-c++-common/asan/alloca_loop_unpoisoning.c -O2 -flto -fuse-linker-plugin -fno-fat-lto-objects (test for excess errors)
> FAIL: c-c++-common/asan/alloca_overflow_partial.c -O2 -flto -fno-use-linker-plugin -flto-partition=none (test for excess errors)
> FAIL: c-c++-common/asan/alloca_overflow_partial.c -O2 -flto -fno-use-linker-plugin -flto-partition=none (test for excess errors)
> FAIL: c-c++-common/asan/alloca_overflow_partial.c -O2 -flto -fuse-linker-plugin -fno-fat-lto-objects (test for excess errors)
> FAIL: c-c++-common/asan/alloca_overflow_partial.c -O2 -flto -fuse-linker-plugin -fno-fat-lto-objects (test for excess errors)
> FAIL: c-c++-common/asan/alloca_overflow_right.c -O2 -flto -fno-use-linker-plugin -flto-partition=none (test for excess errors)
> FAIL: c-c++-common/asan/alloca_overflow_right.c -O2 -flto -fno-use-linker-plugin -flto-partition=none (test for excess errors)
> FAIL: c-c++-common/asan/alloca_overflow_right.c -O2 -flto -fuse-linker-plugin -fno-fat-lto-objects (test for excess errors)
> FAIL: c-c++-common/asan/alloca_overflow_right.c -O2 -flto -fuse-linker-plugin -fno-fat-lto-objects (test for excess errors)
> FAIL: c-c++-common/asan/alloca_safe_access.c -O2 -flto -fno-use-linker-plugin -flto-partition=none (test for excess errors)
> FAIL: c-c++-common/asan/alloca_safe_access.c -O2 -flto -fno-use-linker-plugin -flto-partition=none (test for excess errors)
> FAIL: c-c++-common/asan/alloca_safe_access.c -O2 -flto -fuse-linker-plugin -fno-fat-lto-objects (test for excess errors)
> FAIL: c-c++-common/asan/alloca_safe_access.c -O2 -flto -fuse-linker-plugin -fno-fat-lto-objects (test for excess errors)
> FAIL: c-c++-common/asan/alloca_underflow_left.c -O2 -flto -fno-use-linker-plugin -flto-partition=none (test for excess errors)
> FAIL: c-c++-common/asan/alloca_underflow_left.c -O2 -flto -fno-use-linker-plugin -flto-partition=none (test for excess errors)
> FAIL: c-c++-common/asan/alloca_underflow_left.c -O2 -flto -fuse-linker-plugin -fno-fat-lto-objects (test for excess errors)
> FAIL: c-c++-common/asan/alloca_underflow_left.c -O2 -flto -fuse-linker-plugin -fno-fat-lto-objects (test for excess errors)
> FAIL: c-c++-common/asan/asan-interface-1.c -O2 -flto -fno-use-linker-plugin -flto-partition=none (test for excess errors)
> FAIL: c-c++-common/asan/asan-interface-1.c -O2 -flto -fno-use-linker-plugin -flto-partition=none (test for excess errors)
> FAIL: c-c++-common/asan/asan-interface-1.c -O2 -flto -fuse-linker-plugin -fno-fat-lto-objects (test for excess errors)
> FAIL: c-c++-common/asan/asan-interface-1.c -O2 -flto -fuse-linker-plugin -fno-fat-lto-objects (test for excess errors)
> FAIL: c-c++-common/asan/bitfield-1.c -O2 -flto -fno-use-linker-plugin -flto-partition=none (test for excess errors)
> FAIL: c-c++-common/asan/bitfield-1.c -O2 -flto -fno-use-linker-plugin -flto-partition=none (test for excess errors)
> FAIL: c-c++-common/asan/bitfield-1.c -O2 -flto -fuse-linker-plugin -fno-fat-lto-objects (test for excess errors)
> FAIL: c-c++-common/asan/bitfield-1.c -O2 -flto -fuse-linker-plugin -fno-fat-lto-objects (test for excess errors)
> FAIL: c-c++-common/asan/bitfield-2.c -O2 -flto -fno-use-linker-plugin -flto-partition=none (test for excess errors)
> FAIL: c-c++-common/asan/bitfield-2.c -O2 -flto -fno-use-linker-plugin -flto-partition=none (test for excess errors)
> FAIL: c-c++-common/asan/bitfield-2.c -O2 -flto -fuse-linker-plugin -fno-fat-lto-objects (test for excess errors)
> FAIL: c-c++-common/asan/bitfield-2.c -O2 -flto -fuse-linker-plugin -fno-fat-lto-objects (test for excess errors)
> FAIL: c-c++-common/asan/bitfield-3.c -O2 -flto -fno-use-linker-plugin -flto-partition=none (test for excess errors)
> FAIL: c-c++-common/asan/bitfield-3.c -O2 -flto -fno-use-linker-plugin -flto-partition=none (test for excess errors)
> FAIL: c-c++-common/asan/bitfield-3.c -O2 -flto -fuse-linker-plugin -fno-fat-lto-objects (test for excess errors)
> FAIL: c-c++-common/asan/bitfield-3.c -O2 -flto -fuse-linker-plugin -fno-fat-lto-objects (test for excess errors)
> FAIL: c-c++-common/asan/bitfield-4.c -O2 -flto -fno-use-linker-plugin -flto-partition=none (test for excess errors)
> FAIL: c-c++-common/asan/bitfield-4.c -O2 -flto -fno-use-linker-plugin -flto-partition=none (test for excess errors)
> FAIL: c-c++-common/asan/bitfield-4.c -O2 -flto -fuse-linker-plugin -fno-fat-lto-objects (test for excess errors)
> FAIL: c-c++-common/asan/bitfield-4.c -O2 -flto -fuse-linker-plugin -fno-fat-lto-objects (test for excess errors)
> FAIL: c-c++-common/asan/bitfield-5.c -O2 -flto -fno-use-linker-plugin -flto-partition=none (test for excess errors)
> FAIL: c-c++-common/asan/bitfield-5.c -O2 -flto -fno-use-linker-plugin -flto-partition=none (test for excess errors)
> FAIL: c-c++-common/asan/bitfield-5.c -O2 -flto -fuse-linker-plugin -fno-fat-lto-objects (test for excess errors)
> FAIL: c-c++-common/asan/bitfield-5.c -O2 -flto -fuse-linker-plugin -fno-fat-lto-objects (test for excess errors)
> FAIL: c-c++-common/asan/clone-test-1.c -O2 -flto -fno-use-linker-plugin -flto-partition=none (test for excess errors)
> FAIL: c-c++-common/asan/clone-test-1.c -O2 -flto -fno-use-linker-plugin -flto-partition=none (test for excess errors)
> FAIL: c-c++-common/asan/clone-test-1.c -O2 -flto -fuse-linker-plugin -fno-fat-lto-objects (test for excess errors)
> FAIL: c-c++-common/asan/clone-test-1.c -O2 -flto -fuse-linker-plugin -fno-fat-lto-objects (test for excess errors)
> FAIL: c-c++-common/asan/global-overflow-1.c -O2 -flto -fno-use-linker-plugin -flto-partition=none (test for excess errors)
> FAIL: c-c++-common/asan/global-overflow-1.c -O2 -flto -fno-use-linker-plugin -flto-partition=none (test for excess errors)
> FAIL: c-c++-common/asan/global-overflow-1.c -O2 -flto -fuse-linker-plugin -fno-fat-lto-objects (test for excess errors)
> FAIL: c-c++-common/asan/global-overflow-1.c -O2 -flto -fuse-linker-plugin -fno-fat-lto-objects (test for excess errors)
> FAIL: c-c++-common/asan/halt_on_error-1.c -O2 -flto -fno-use-linker-plugin -flto-partition=none (test for excess errors)
> FAIL: c-c++-common/asan/halt_on_error-1.c -O2 -flto -fno-use-linker-plugin -flto-partition=none (test for excess errors)
> FAIL: c-c++-common/asan/halt_on_error-1.c -O2 -flto -fuse-linker-plugin -fno-fat-lto-objects (test for excess errors)
> FAIL: c-c++-common/asan/halt_on_error-1.c -O2 -flto -fuse-linker-plugin -fno-fat-lto-objects (test for excess errors)
> FAIL: c-c++-common/asan/halt_on_error-2.c -O2 -flto -fno-use-linker-plugin -flto-partition=none (test for excess errors)
> FAIL: c-c++-common/asan/halt_on_error-2.c -O2 -flto -fno-use-linker-plugin -flto-partition=none (test for excess errors)
> FAIL: c-c++-common/asan/halt_on_error-2.c -O2 -flto -fuse-linker-plugin -fno-fat-lto-objects (test for excess errors)
> FAIL: c-c++-common/asan/halt_on_error-2.c -O2 -flto -fuse-linker-plugin -fno-fat-lto-objects (test for excess errors)
> FAIL: c-c++-common/asan/heap-overflow-1.c -O2 -flto -fno-use-linker-plugin -flto-partition=none (test for excess errors)
> FAIL: c-c++-common/asan/heap-overflow-1.c -O2 -flto -fno-use-linker-plugin -flto-partition=none (test for excess errors)
> FAIL: c-c++-common/asan/heap-overflow-1.c -O2 -flto -fuse-linker-plugin -fno-fat-lto-objects (test for excess errors)
> FAIL: c-c++-common/asan/heap-overflow-1.c -O2 -flto -fuse-linker-plugin -fno-fat-lto-objects (test for excess errors)
> FAIL: c-c++-common/asan/memcmp-1.c -O2 -flto -fno-use-linker-plugin -flto-partition=none (test for excess errors)
> FAIL: c-c++-common/asan/memcmp-1.c -O2 -flto -fno-use-linker-plugin -flto-partition=none (test for excess errors)
> FAIL: c-c++-common/asan/memcmp-1.c -O2 -flto -fuse-linker-plugin -fno-fat-lto-objects (test for excess errors)
> FAIL: c-c++-common/asan/memcmp-1.c -O2 -flto -fuse-linker-plugin -fno-fat-lto-objects (test for excess errors)
> FAIL: c-c++-common/asan/misalign-1.c -O2 -flto -fno-use-linker-plugin -flto-partition=none (test for excess errors)
> FAIL: c-c++-common/asan/misalign-1.c -O2 -flto -fno-use-linker-plugin -flto-partition=none (test for excess errors)
> FAIL: c-c++-common/asan/misalign-1.c -O2 -flto -fuse-linker-plugin -fno-fat-lto-objects (test for excess errors)
> FAIL: c-c++-common/asan/misalign-1.c -O2 -flto -fuse-linker-plugin -fno-fat-lto-objects (test for excess errors)
> FAIL: c-c++-common/asan/misalign-2.c -O2 -flto -fno-use-linker-plugin -flto-partition=none (test for excess errors)
> FAIL: c-c++-common/asan/misalign-2.c -O2 -flto -fno-use-linker-plugin -flto-partition=none (test for excess errors)
> FAIL: c-c++-common/asan/misalign-2.c -O2 -flto -fuse-linker-plugin -fno-fat-lto-objects (test for excess errors)
> FAIL: c-c++-common/asan/misalign-2.c -O2 -flto -fuse-linker-plugin -fno-fat-lto-objects (test for excess errors)
> FAIL: c-c++-common/asan/null-deref-1.c -O2 -flto -fno-use-linker-plugin -flto-partition=none (test for excess errors)
> FAIL: c-c++-common/asan/null-deref-1.c -O2 -flto -fno-use-linker-plugin -flto-partition=none (test for excess errors)
> FAIL: c-c++-common/asan/null-deref-1.c -O2 -flto -fuse-linker-plugin -fno-fat-lto-objects (test for excess errors)
> FAIL: c-c++-common/asan/null-deref-1.c -O2 -flto -fuse-linker-plugin -fno-fat-lto-objects (test for excess errors)
> FAIL: c-c++-common/asan/pr59063-1.c -O2 -flto -fno-use-linker-plugin -flto-partition=none (test for excess errors)
> FAIL: c-c++-common/asan/pr59063-1.c -O2 -flto -fno-use-linker-plugin -flto-partition=none (test for excess errors)
> FAIL: c-c++-common/asan/pr59063-1.c -O2 -flto -fuse-linker-plugin -fno-fat-lto-objects (test for excess errors)
> FAIL: c-c++-common/asan/pr59063-1.c -O2 -flto -fuse-linker-plugin -fno-fat-lto-objects (test for excess errors)
> FAIL: c-c++-common/asan/pr59063-2.c -O2 -flto -fno-use-linker-plugin -flto-partition=none (test for excess errors)
> FAIL: c-c++-common/asan/pr59063-2.c -O2 -flto -fno-use-linker-plugin -flto-partition=none (test for excess errors)
> FAIL: c-c++-common/asan/pr59063-2.c -O2 -flto -fuse-linker-plugin -fno-fat-lto-objects (test for excess errors)
> FAIL: c-c++-common/asan/pr59063-2.c -O2 -flto -fuse-linker-plugin -fno-fat-lto-objects (test for excess errors)
> FAIL: c-c++-common/asan/pr61530.c -O2 -flto -fno-use-linker-plugin -flto-partition=none (test for excess errors)
> FAIL: c-c++-common/asan/pr61530.c -O2 -flto -fno-use-linker-plugin -flto-partition=none (test for excess errors)
> FAIL: c-c++-common/asan/pr61530.c -O2 -flto -fuse-linker-plugin -fno-fat-lto-objects (test for excess errors)
> FAIL: c-c++-common/asan/pr61530.c -O2 -flto -fuse-linker-plugin -fno-fat-lto-objects (test for excess errors)
> FAIL: c-c++-common/asan/pr62089.c -O2 -flto -fno-use-linker-plugin -flto-partition=none (test for excess errors)
> FAIL: c-c++-common/asan/pr62089.c -O2 -flto -fno-use-linker-plugin -flto-partition=none (test for excess errors)
> FAIL: c-c++-common/asan/pr62089.c -O2 -flto -fuse-linker-plugin -fno-fat-lto-objects (test for excess errors)
> FAIL: c-c++-common/asan/pr62089.c -O2 -flto -fuse-linker-plugin -fno-fat-lto-objects (test for excess errors)
> FAIL: c-c++-common/asan/pr63316.c -O2 -flto -fno-use-linker-plugin -flto-partition=none (test for excess errors)
> FAIL: c-c++-common/asan/pr63316.c -O2 -flto -fno-use-linker-plugin -flto-partition=none (test for excess errors)
> FAIL: c-c++-common/asan/pr63316.c -O2 -flto -fuse-linker-plugin -fno-fat-lto-objects (test for excess errors)
> FAIL: c-c++-common/asan/pr63316.c -O2 -flto -fuse-linker-plugin -fno-fat-lto-objects (test for excess errors)
> FAIL: c-c++-common/asan/pr63888.c -O2 -flto -fno-use-linker-plugin -flto-partition=none (test for excess errors)
> FAIL: c-c++-common/asan/pr63888.c -O2 -flto -fno-use-linker-plugin -flto-partition=none (test for excess errors)
> FAIL: c-c++-common/asan/pr63888.c -O2 -flto -fuse-linker-plugin -fno-fat-lto-objects (test for excess errors)
> FAIL: c-c++-common/asan/pr63888.c -O2 -flto -fuse-linker-plugin -fno-fat-lto-objects (test for excess errors)
> FAIL: c-c++-common/asan/pr64820.c -O2 -flto -fno-use-linker-plugin -flto-partition=none (test for excess errors)
> FAIL: c-c++-common/asan/pr64820.c -O2 -flto -fno-use-linker-plugin -flto-partition=none (test for excess errors)
> FAIL: c-c++-common/asan/pr64820.c -O2 -flto -fuse-linker-plugin -fno-fat-lto-objects (test for excess errors)
> FAIL: c-c++-common/asan/pr64820.c -O2 -flto -fuse-linker-plugin -fno-fat-lto-objects (test for excess errors)
> FAIL: c-c++-common/asan/pr70712.c -O2 -flto -fno-use-linker-plugin -flto-partition=none (test for excess errors)
> FAIL: c-c++-common/asan/pr70712.c -O2 -flto -fno-use-linker-plugin -flto-partition=none (test for excess errors)
> FAIL: c-c++-common/asan/pr70712.c -O2 -flto -fuse-linker-plugin -fno-fat-lto-objects (test for excess errors)
> FAIL: c-c++-common/asan/pr70712.c -O2 -flto -fuse-linker-plugin -fno-fat-lto-objects (test for excess errors)
> FAIL: c-c++-common/asan/pr71480.c -O2 -flto -fno-use-linker-plugin -flto-partition=none (test for excess errors)
> FAIL: c-c++-common/asan/pr71480.c -O2 -flto -fno-use-linker-plugin -flto-partition=none (test for excess errors)
> FAIL: c-c++-common/asan/pr71480.c -O2 -flto -fuse-linker-plugin -fno-fat-lto-objects (test for excess errors)
> FAIL: c-c++-common/asan/pr71480.c -O2 -flto -fuse-linker-plugin -fno-fat-lto-objects (test for excess errors)
> FAIL: c-c++-common/asan/pr79944.c -O2 -flto -fno-use-linker-plugin -flto-partition=none (test for excess errors)
> FAIL: c-c++-common/asan/pr79944.c -O2 -flto -fno-use-linker-plugin -flto-partition=none (test for excess errors)
> FAIL: c-c++-common/asan/pr79944.c -O2 -flto -fuse-linker-plugin -fno-fat-lto-objects (test for excess errors)
> FAIL: c-c++-common/asan/pr79944.c -O2 -flto -fuse-linker-plugin -fno-fat-lto-objects (test for excess errors)
> FAIL: c-c++-common/asan/pr80308.c -O2 -flto -fno-use-linker-plugin -flto-partition=none (test for excess errors)
> FAIL: c-c++-common/asan/pr80308.c -O2 -flto -fno-use-linker-plugin -flto-partition=none (test for excess errors)
> FAIL: c-c++-common/asan/pr80308.c -O2 -flto -fuse-linker-plugin -fno-fat-lto-objects (test for excess errors)
> FAIL: c-c++-common/asan/pr80308.c -O2 -flto -fuse-linker-plugin -fno-fat-lto-objects (test for excess errors)
> FAIL: c-c++-common/asan/sanity-check-pure-c-1.c -O2 -flto -fno-use-linker-plugin -flto-partition=none (test for excess errors)
> FAIL: c-c++-common/asan/sanity-check-pure-c-1.c -O2 -flto -fno-use-linker-plugin -flto-partition=none (test for excess errors)
> FAIL: c-c++-common/asan/sanity-check-pure-c-1.c -O2 -flto -fuse-linker-plugin -fno-fat-lto-objects (test for excess errors)
> FAIL: c-c++-common/asan/sanity-check-pure-c-1.c -O2 -flto -fuse-linker-plugin -fno-fat-lto-objects (test for excess errors)
> FAIL: c-c++-common/asan/sleep-before-dying-1.c -O2 -flto -fno-use-linker-plugin -flto-partition=none (test for excess errors)
> FAIL: c-c++-common/asan/sleep-before-dying-1.c -O2 -flto -fno-use-linker-plugin -flto-partition=none (test for excess errors)
> FAIL: c-c++-common/asan/sleep-before-dying-1.c -O2 -flto -fuse-linker-plugin -fno-fat-lto-objects (test for excess errors)
> FAIL: c-c++-common/asan/sleep-before-dying-1.c -O2 -flto -fuse-linker-plugin -fno-fat-lto-objects (test for excess errors)
> FAIL: c-c++-common/asan/stack-overflow-1.c -O2 -flto -fno-use-linker-plugin -flto-partition=none (test for excess errors)
> FAIL: c-c++-common/asan/stack-overflow-1.c -O2 -flto -fno-use-linker-plugin -flto-partition=none (test for excess errors)
> FAIL: c-c++-common/asan/stack-overflow-1.c -O2 -flto -fuse-linker-plugin -fno-fat-lto-objects (test for excess errors)
> FAIL: c-c++-common/asan/stack-overflow-1.c -O2 -flto -fuse-linker-plugin -fno-fat-lto-objects (test for excess errors)
> FAIL: c-c++-common/asan/strip-path-prefix-1.c -O2 -flto -fno-use-linker-plugin -flto-partition=none (test for excess errors)
> FAIL: c-c++-common/asan/strip-path-prefix-1.c -O2 -flto -fno-use-linker-plugin -flto-partition=none (test for excess errors)
> FAIL: c-c++-common/asan/strip-path-prefix-1.c -O2 -flto -fuse-linker-plugin -fno-fat-lto-objects (test for excess errors)
> FAIL: c-c++-common/asan/strip-path-prefix-1.c -O2 -flto -fuse-linker-plugin -fno-fat-lto-objects (test for excess errors)
> FAIL: c-c++-common/asan/strncpy-overflow-1.c -O2 -flto -fno-use-linker-plugin -flto-partition=none (test for excess errors)
> FAIL: c-c++-common/asan/strncpy-overflow-1.c -O2 -flto -fno-use-linker-plugin -flto-partition=none (test for excess errors)
> FAIL: c-c++-common/asan/strncpy-overflow-1.c -O2 -flto -fuse-linker-plugin -fno-fat-lto-objects (test for excess errors)
> FAIL: c-c++-common/asan/strncpy-overflow-1.c -O2 -flto -fuse-linker-plugin -fno-fat-lto-objects (test for excess errors)
> FAIL: c-c++-common/asan/swapcontext-test-1.c -O2 -flto -fno-use-linker-plugin -flto-partition=none (test for excess errors)
> FAIL: c-c++-common/asan/swapcontext-test-1.c -O2 -flto -fno-use-linker-plugin -flto-partition=none (test for excess errors)
> FAIL: c-c++-common/asan/swapcontext-test-1.c -O2 -flto -fuse-linker-plugin -fno-fat-lto-objects (test for excess errors)
> FAIL: c-c++-common/asan/swapcontext-test-1.c -O2 -flto -fuse-linker-plugin -fno-fat-lto-objects (test for excess errors)
> FAIL: c-c++-common/asan/use-after-free-1.c -O2 -flto -fno-use-linker-plugin -flto-partition=none (test for excess errors)
> FAIL: c-c++-common/asan/use-after-free-1.c -O2 -flto -fno-use-linker-plugin -flto-partition=none (test for excess errors)
> FAIL: c-c++-common/asan/use-after-free-1.c -O2 -flto -fuse-linker-plugin -fno-fat-lto-objects (test for excess errors)
> FAIL: c-c++-common/asan/use-after-free-1.c -O2 -flto -fuse-linker-plugin -fno-fat-lto-objects (test for excess errors)
> FAIL: c-c++-common/asan/use-after-return-1.c -O2 -flto -fno-use-linker-plugin -flto-partition=none (test for excess errors)
> FAIL: c-c++-common/asan/use-after-return-1.c -O2 -flto -fno-use-linker-plugin -flto-partition=none (test for excess errors)
> FAIL: c-c++-common/asan/use-after-return-1.c -O2 -flto -fuse-linker-plugin -fno-fat-lto-objects (test for excess errors)
> FAIL: c-c++-common/asan/use-after-return-1.c -O2 -flto -fuse-linker-plugin -fno-fat-lto-objects (test for excess errors)
> FAIL: g++.dg/asan/deep-tail-call-1.C -O2 -flto -fno-use-linker-plugin -flto-partition=none (test for excess errors)
> FAIL: g++.dg/asan/deep-tail-call-1.C -O2 -flto -fuse-linker-plugin -fno-fat-lto-objects (test for excess errors)
> FAIL: g++.dg/asan/deep-thread-stack-1.C -O2 -flto -fno-use-linker-plugin -flto-partition=none (test for excess errors)
> FAIL: g++.dg/asan/deep-thread-stack-1.C -O2 -flto -fuse-linker-plugin -fno-fat-lto-objects (test for excess errors)
> FAIL: g++.dg/asan/default-options-1.C -O2 -flto -fno-use-linker-plugin -flto-partition=none (test for excess errors)
> FAIL: g++.dg/asan/default-options-1.C -O2 -flto -fuse-linker-plugin -fno-fat-lto-objects (test for excess errors)
> FAIL: g++.dg/asan/function-argument-1.C -O2 -flto -fno-use-linker-plugin -flto-partition=none (test for excess errors)
> FAIL: g++.dg/asan/function-argument-1.C -O2 -flto -fuse-linker-plugin -fno-fat-lto-objects (test for excess errors)
> FAIL: g++.dg/asan/function-argument-2.C -O2 -flto -fno-use-linker-plugin -flto-partition=none (test for excess errors)
> FAIL: g++.dg/asan/function-argument-2.C -O2 -flto -fuse-linker-plugin -fno-fat-lto-objects (test for excess errors)
> FAIL: g++.dg/asan/function-argument-3.C -O2 -flto -fno-use-linker-plugin -flto-partition=none (test for excess errors)
> FAIL: g++.dg/asan/function-argument-3.C -O2 -flto -fuse-linker-plugin -fno-fat-lto-objects (test for excess errors)
> FAIL: g++.dg/asan/interception-failure-test-1.C -O2 -flto -fno-use-linker-plugin -flto-partition=none (test for excess errors)
> FAIL: g++.dg/asan/interception-failure-test-1.C -O2 -flto -fuse-linker-plugin -fno-fat-lto-objects (test for excess errors)
> FAIL: g++.dg/asan/interception-malloc-test-1.C -O2 -flto -fno-use-linker-plugin -flto-partition=none (test for excess errors)
> FAIL: g++.dg/asan/interception-malloc-test-1.C -O2 -flto -fuse-linker-plugin -fno-fat-lto-objects (test for excess errors)
> FAIL: g++.dg/asan/interception-test-1.C -O2 -flto -fno-use-linker-plugin -flto-partition=none (test for excess errors)
> FAIL: g++.dg/asan/interception-test-1.C -O2 -flto -fuse-linker-plugin -fno-fat-lto-objects (test for excess errors)
> FAIL: g++.dg/asan/large-func-test-1.C -O2 -flto -fno-use-linker-plugin -flto-partition=none (test for excess errors)
> FAIL: g++.dg/asan/large-func-test-1.C -O2 -flto -fuse-linker-plugin -fno-fat-lto-objects (test for excess errors)
> FAIL: g++.dg/asan/pr55617.C -O2 -flto -fno-use-linker-plugin -flto-partition=none (test for excess errors)
> FAIL: g++.dg/asan/pr55617.C -O2 -flto -fuse-linker-plugin -fno-fat-lto-objects (test for excess errors)
> FAIL: g++.dg/asan/pr62017.C -O2 -flto -fno-use-linker-plugin -flto-partition=none (test for excess errors)
> FAIL: g++.dg/asan/pr62017.C -O2 -flto -fuse-linker-plugin -fno-fat-lto-objects (test for excess errors)
> FAIL: g++.dg/asan/pr77396-2.C -O2 -flto -fno-use-linker-plugin -flto-partition=none (test for excess errors)
> FAIL: g++.dg/asan/pr77396-2.C -O2 -flto -fuse-linker-plugin -fno-fat-lto-objects (test for excess errors)
> FAIL: g++.dg/asan/pr77396.C -O2 -flto -fno-use-linker-plugin -flto-partition=none (test for excess errors)
> FAIL: g++.dg/asan/pr77396.C -O2 -flto -fuse-linker-plugin -fno-fat-lto-objects (test for excess errors)
> FAIL: g++.dg/asan/pr81021.C -O2 -flto -fno-use-linker-plugin -flto-partition=none (test for excess errors)
> FAIL: g++.dg/asan/pr81021.C -O2 -flto -fuse-linker-plugin -fno-fat-lto-objects (test for excess errors)
> FAIL: g++.dg/asan/use-after-scope-1.C -O2 -flto -fno-use-linker-plugin -flto-partition=none (test for excess errors)
> FAIL: g++.dg/asan/use-after-scope-1.C -O2 -flto -fuse-linker-plugin -fno-fat-lto-objects (test for excess errors)
> FAIL: g++.dg/asan/use-after-scope-2.C -O2 -flto -fno-use-linker-plugin -flto-partition=none (test for excess errors)
> FAIL: g++.dg/asan/use-after-scope-2.C -O2 -flto -fuse-linker-plugin -fno-fat-lto-objects (test for excess errors)
> FAIL: g++.dg/asan/use-after-scope-3.C -O2 -flto -fno-use-linker-plugin -flto-partition=none (test for excess errors)
> FAIL: g++.dg/asan/use-after-scope-3.C -O2 -flto -fuse-linker-plugin -fno-fat-lto-objects (test for excess errors)
> FAIL: g++.dg/asan/use-after-scope-5.C -O2 -flto -fno-use-linker-plugin -flto-partition=none (test for excess errors)
> FAIL: g++.dg/asan/use-after-scope-5.C -O2 -flto -fuse-linker-plugin -fno-fat-lto-objects (test for excess errors)
> FAIL: g++.dg/asan/use-after-scope-types-1.C -O2 -flto -fno-use-linker-plugin -flto-partition=none (test for excess errors)
> FAIL: g++.dg/asan/use-after-scope-types-1.C -O2 -flto -fuse-linker-plugin -fno-fat-lto-objects (test for excess errors)
> FAIL: g++.dg/asan/use-after-scope-types-2.C -O2 -flto -fno-use-linker-plugin -flto-partition=none (test for excess errors)
> FAIL: g++.dg/asan/use-after-scope-types-2.C -O2 -flto -fuse-linker-plugin -fno-fat-lto-objects (test for excess errors)
> FAIL: g++.dg/asan/use-after-scope-types-3.C -O2 -flto -fno-use-linker-plugin -flto-partition=none (test for excess errors)
> FAIL: g++.dg/asan/use-after-scope-types-3.C -O2 -flto -fuse-linker-plugin -fno-fat-lto-objects (test for excess errors)
> FAIL: g++.dg/asan/use-after-scope-types-4.C -O2 -flto -fno-use-linker-plugin -flto-partition=none (test for excess errors)
> FAIL: g++.dg/asan/use-after-scope-types-4.C -O2 -flto -fuse-linker-plugin -fno-fat-lto-objects (test for excess errors)
> FAIL: g++.dg/asan/use-after-scope-types-5.C -O2 -flto -fno-use-linker-plugin -flto-partition=none (test for excess errors)
> FAIL: g++.dg/asan/use-after-scope-types-5.C -O2 -flto -fuse-linker-plugin -fno-fat-lto-objects (test for excess errors)
> FAIL: g++.dg/lto/20101010-4 cp_lto_20101010-4_0.o-cp_lto_20101010-4_0.o link, -std=c++0x -flto -g -r -nostdlib
> FAIL: g++.dg/lto/20101015-2 cp_lto_20101015-2_0.o-cp_lto_20101015-2_0.o link, -g -flto
> FAIL: g++.dg/lto/pr42987 cp_lto_pr42987_0.o-cp_lto_pr42987_1.o link, -flto -flto-partition=none -g
> FAIL: g++.dg/lto/pr42987 cp_lto_pr42987_0.o-cp_lto_pr42987_1.o link, -flto -g
> FAIL: g++.dg/lto/pr48207 cp_lto_pr48207_0.o-cp_lto_pr48207_0.o link, -flto -g
> FAIL: g++.dg/lto/pr48207-2 cp_lto_pr48207-2_0.o-cp_lto_pr48207-2_0.o link, -flto -g
> FAIL: g++.dg/lto/pr48207-3 cp_lto_pr48207-3_0.o-cp_lto_pr48207-3_0.o link, -flto -g
> FAIL: g++.dg/lto/pr48354-1 cp_lto_pr48354-1_0.o-cp_lto_pr48354-1_0.o link, -g -flto
> FAIL: g++.dg/lto/pr48508-1 cp_lto_pr48508-1_0.o-cp_lto_pr48508-1_1.o link, -g -O2 -flto -flto-partition=none
> FAIL: g++.dg/lto/pr51564-1 cp_lto_pr51564-1_0.o-cp_lto_pr51564-1_0.o link, -flto -g
> FAIL: g++.dg/lto/pr51567-1 cp_lto_pr51567-1_0.o-cp_lto_pr51567-1_0.o link, -flto -g
> FAIL: g++.dg/lto/pr51572-2 cp_lto_pr51572-2_0.o-cp_lto_pr51572-2_0.o link, -g -flto
> FAIL: g++.dg/lto/pr51573-1 cp_lto_pr51573-1_0.o-cp_lto_pr51573-1_0.o link, -flto -g
> FAIL: g++.dg/lto/pr51650-1 cp_lto_pr51650-1_0.o-cp_lto_pr51650-1_0.o link, -flto -g
> FAIL: g++.dg/lto/pr51650-2 cp_lto_pr51650-2_0.o-cp_lto_pr51650-2_0.o link, -flto -g
> FAIL: g++.dg/lto/pr51650-3 cp_lto_pr51650-3_0.o-cp_lto_pr51650-3_0.o link, -flto -g
> FAIL: g++.dg/lto/pr52605 cp_lto_pr52605_0.o-cp_lto_pr52605_0.o link, -flto -g
> FAIL: g++.dg/lto/pr53470 cp_lto_pr53470_0.o-cp_lto_pr53470_0.o link, -g -flto
> FAIL: g++.dg/lto/pr65193 cp_lto_pr65193_0.o-cp_lto_pr65193_0.o link, -fPIC -r -nostdlib -flto -O2 -g
> FAIL: g++.dg/lto/pr65316 cp_lto_pr65316_0.o-cp_lto_pr65316_1.o link, -flto -std=c++11 -g2 -fno-lto-odr-type-merging -O2
> FAIL: g++.dg/lto/pr65549 cp_lto_pr65549_0.o-cp_lto_pr65549_0.o link, -std=gnu++14 -flto -g
> FAIL: g++.dg/lto/pr65549 cp_lto_pr65549_0.o-cp_lto_pr65549_0.o link, -std=gnu++14 -flto -g -O2 -fno-inline -flto-partition=max
> FAIL: g++.dg/lto/pr69077 cp_lto_pr69077_0.o-cp_lto_pr69077_1.o link, -O3 -g -flto
> FAIL: g++.dg/lto/pr69137 cp_lto_pr69137_0.o-cp_lto_pr69137_0.o link, -std=c++11 -g -flto
> FAIL: g++.dg/lto/pr79000 cp_lto_pr79000_0.o-cp_lto_pr79000_1.o link, -flto -g
> FAIL: g++.dg/ubsan/pr60569.C -O3 -g (test for excess errors)
> FAIL: gcc.dg/asan/nosanitize-and-inline.c -O2 -flto -fno-use-linker-plugin -flto-partition=none (test for excess errors)
> FAIL: gcc.dg/asan/nosanitize-and-inline.c -O2 -flto -fuse-linker-plugin -fno-fat-lto-objects (test for excess errors)
> FAIL: gcc.dg/asan/pr78541.c -O2 -flto -fno-use-linker-plugin -flto-partition=none (test for excess errors)
> FAIL: gcc.dg/asan/pr78541.c -O2 -flto -fuse-linker-plugin -fno-fat-lto-objects (test for excess errors)
> FAIL: gcc.dg/asan/pr79196.c -O2 -flto -fno-use-linker-plugin -flto-partition=none (test for excess errors)
> FAIL: gcc.dg/asan/pr79196.c -O2 -flto -fuse-linker-plugin -fno-fat-lto-objects (test for excess errors)
> FAIL: gcc.dg/asan/pr80166.c -O2 -flto -fno-use-linker-plugin -flto-partition=none (test for excess errors)
> FAIL: gcc.dg/asan/pr80166.c -O2 -flto -fuse-linker-plugin -fno-fat-lto-objects (test for excess errors)
> FAIL: gcc.dg/asan/pr81186.c -O2 -flto -fno-use-linker-plugin -flto-partition=none (test for excess errors)
> FAIL: gcc.dg/asan/pr81186.c -O2 -flto -fuse-linker-plugin -fno-fat-lto-objects (test for excess errors)
> FAIL: gcc.dg/asan/use-after-scope-1.c -O2 -flto -fno-use-linker-plugin -flto-partition=none (test for excess errors)
> FAIL: gcc.dg/asan/use-after-scope-1.c -O2 -flto -fuse-linker-plugin -fno-fat-lto-objects (test for excess errors)
> FAIL: gcc.dg/asan/use-after-scope-10.c -O2 -flto -fno-use-linker-plugin -flto-partition=none (test for excess errors)
> FAIL: gcc.dg/asan/use-after-scope-10.c -O2 -flto -fuse-linker-plugin -fno-fat-lto-objects (test for excess errors)
> FAIL: gcc.dg/asan/use-after-scope-11.c -O2 -flto -fno-use-linker-plugin -flto-partition=none (test for excess errors)
> FAIL: gcc.dg/asan/use-after-scope-11.c -O2 -flto -fuse-linker-plugin -fno-fat-lto-objects (test for excess errors)
> FAIL: gcc.dg/asan/use-after-scope-2.c -O2 -flto -fno-use-linker-plugin -flto-partition=none (test for excess errors)
> FAIL: gcc.dg/asan/use-after-scope-2.c -O2 -flto -fuse-linker-plugin -fno-fat-lto-objects (test for excess errors)
> FAIL: gcc.dg/asan/use-after-scope-4.c -O2 -flto -fno-use-linker-plugin -flto-partition=none (test for excess errors)
> FAIL: gcc.dg/asan/use-after-scope-4.c -O2 -flto -fuse-linker-plugin -fno-fat-lto-objects (test for excess errors)
> FAIL: gcc.dg/asan/use-after-scope-5.c -O2 -flto -fno-use-linker-plugin -flto-partition=none (test for excess errors)
> FAIL: gcc.dg/asan/use-after-scope-5.c -O2 -flto -fuse-linker-plugin -fno-fat-lto-objects (test for excess errors)
> FAIL: gcc.dg/asan/use-after-scope-6.c -O2 -flto -fno-use-linker-plugin -flto-partition=none (test for excess errors)
> FAIL: gcc.dg/asan/use-after-scope-6.c -O2 -flto -fuse-linker-plugin -fno-fat-lto-objects (test for excess errors)
> FAIL: gcc.dg/asan/use-after-scope-7.c -O2 -flto -fno-use-linker-plugin -flto-partition=none (test for excess errors)
> FAIL: gcc.dg/asan/use-after-scope-7.c -O2 -flto -fuse-linker-plugin -fno-fat-lto-objects (test for excess errors)
> FAIL: gcc.dg/asan/use-after-scope-9.c -O2 -flto -fno-use-linker-plugin -flto-partition=none (test for excess errors)
> FAIL: gcc.dg/asan/use-after-scope-9.c -O2 -flto -fuse-linker-plugin -fno-fat-lto-objects (test for excess errors)
> FAIL: gcc.dg/asan/use-after-scope-switch-1.c -O2 -flto -fno-use-linker-plugin -flto-partition=none (test for excess errors)
> FAIL: gcc.dg/asan/use-after-scope-switch-1.c -O2 -flto -fuse-linker-plugin -fno-fat-lto-objects (test for excess errors)
> FAIL: gcc.dg/asan/use-after-scope-switch-2.c -O2 -flto -fno-use-linker-plugin -flto-partition=none (test for excess errors)
> FAIL: gcc.dg/asan/use-after-scope-switch-2.c -O2 -flto -fuse-linker-plugin -fno-fat-lto-objects (test for excess errors)
> FAIL: gcc.dg/asan/use-after-scope-switch-3.c -O2 -flto -fno-use-linker-plugin -flto-partition=none (test for excess errors)
> FAIL: gcc.dg/asan/use-after-scope-switch-3.c -O2 -flto -fuse-linker-plugin -fno-fat-lto-objects (test for excess errors)
> FAIL: gcc.dg/asan/use-after-scope-switch-4.c -O2 -flto -fno-use-linker-plugin -flto-partition=none (test for excess errors)
> FAIL: gcc.dg/asan/use-after-scope-switch-4.c -O2 -flto -fuse-linker-plugin -fno-fat-lto-objects (test for excess errors)
> FAIL: gcc.dg/debug/pr41893-1.c -gdwarf-2 (test for excess errors)
> FAIL: gcc.dg/debug/pr41893-1.c -gdwarf-2 -O (test for excess errors)
> FAIL: gcc.dg/debug/pr41893-1.c -gdwarf-2 -O3 (test for excess errors)
> FAIL: gcc.dg/debug/pr41893-1.c -gdwarf-2 -g1 (test for excess errors)
> FAIL: gcc.dg/debug/pr41893-1.c -gdwarf-2 -g1 -O (test for excess errors)
> FAIL: gcc.dg/debug/pr41893-1.c -gdwarf-2 -g1 -O3 (test for excess errors)
> FAIL: gcc.dg/debug/pr41893-1.c -gdwarf-2 -g3 (test for excess errors)
> FAIL: gcc.dg/debug/pr41893-1.c -gdwarf-2 -g3 -O (test for excess errors)
> FAIL: gcc.dg/debug/pr41893-1.c -gdwarf-2 -g3 -O3 (test for excess errors)
> FAIL: gcc.dg/lto/20090914-1 c_lto_20090914-1_0.o-c_lto_20090914-1_0.o link, -flto
> FAIL: gcc.dg/lto/20100426 c_lto_20100426_0.o-c_lto_20100426_0.o link, -r -nostdlib -flto -g
> FAIL: gcc.dg/lto/20111207-2 c_lto_20111207-2_0.o-c_lto_20111207-2_0.o link, -g -O -flto
> FAIL: gcc.dg/lto/20111213-1 c_lto_20111213-1_0.o-c_lto_20111213-1_0.o link, -flto -g
> FAIL: gcc.dg/lto/pr51572-1 c_lto_pr51572-1_0.o-c_lto_pr51572-1_0.o link, -flto -g
> FAIL: gcc.dg/lto/pr53470 c_lto_pr53470_0.o-c_lto_pr53470_0.o link, -flto -g
> FAIL: gcc.dg/lto/pr59323 c_lto_pr59323_0.o-c_lto_pr59323_0.o link, -O2 -g -flto
> FAIL: gcc.dg/lto/pr59323-2 c_lto_pr59323-2_0.o-c_lto_pr59323-2_0.o link, -O2 -g -flto
> FAIL: gcc.dg/lto/pr64415 c_lto_pr64415_0.o-c_lto_pr64415_1.o link, -O -flto -fpic
> FAIL: gcc.dg/pr43557-1.c (test for excess errors)
> FAIL: gfortran.dg/lto/20091016-1 f_lto_20091016-1_0.o-f_lto_20091016-1_0.o link, -O -flto -g -fPIC -r -nostdlib
> FAIL: gfortran.dg/lto/20091016-1 f_lto_20091016-1_0.o-f_lto_20091016-1_0.o link, -flto -g -fPIC -r -nostdlib
> FAIL: gfortran.dg/lto/pr41521 f_lto_pr41521_0.o-f_lto_pr41521_1.o link, -g -O -flto -Wno-lto-type-mismatch
> FAIL: gfortran.dg/lto/pr41521 f_lto_pr41521_0.o-f_lto_pr41521_1.o link, -g -flto -Wno-lto-type-mismatch
> FAIL: gfortran.dg/lto/pr46911 f_lto_pr46911_0.o-f_lto_pr46911_0.o link, -O2 -flto -g
> FAIL: gfortran.dg/lto/pr47839 f_lto_pr47839_0.o-f_lto_pr47839_1.o link, -g -flto
> FAIL: gfortran.dg/save_6.f90 -O0 (test for excess errors)
> FAIL: gfortran.dg/save_6.f90 -O1 (test for excess errors)
> FAIL: gfortran.dg/save_6.f90 -O2 (test for excess errors)
> FAIL: gfortran.dg/save_6.f90 -O3 -fomit-frame-pointer -funroll-loops -fpeel-loops -ftracer -finline-functions (test for excess errors)
> FAIL: gfortran.dg/save_6.f90 -O3 -g (test for excess errors)
> FAIL: gfortran.dg/save_6.f90 -Os (test for excess errors)
> FAIL: gfortran.dg/submodule_6.f08 -O3 -g (test for excess errors)
> FAIL: libgomp.c++/pr69393.C (test for excess errors)