gcc-bugs archive
subject index for January, 2012

This is the mail archive of the gcc-bugs@gcc.gnu.org mailing list for the GCC project.

Indexes: [Date Index] [Subject Index] [Author Index] [Thread Index]
Site Nav: [Browse other archives for this mailing list]
[Browse other mailing lists at this site]
Search: Limit to:

helloïi'm a newer hereïjust a âhelloâ ïsorry if i troubled you

WÅochy totalna wysprzedaÅ kryzysowa

[Bug ada/15846] Illegal program not detected, self renames

[Bug ada/23750] Suggest using a more standard soname for libgnat

[Bug ada/29543] Poor code generated for arrays with variable bounds

[Bug ada/39138] Fix Copyright Dates Before 4.5.0 Branch (or sooner)

[Bug ada/41929] 64-bit null_pointer_deref1 gnat.dg test consumes all available memory

[Bug ada/46192] [4.5/4.6/4.7 regression] wrong code for renaming of packed array with address clause

[Bug ada/46192] [4.5/4.6/4.7 regression] wrong code for renaming of volatile packed array with address clause

[Bug ada/46192] renaming of a volatile variable generates wrong code

[Bug ada/49783] GCC must bring ads and adb files after installation

[Bug ada/51483] [4.7 regression] cstand.adb:Register_Float_Type makes invalid assumptions about FP representation

[Bug ada/51775] [4.6/4.7 Regression] FAIL: gnat.dg/pack9.adb scan-tree-dump-not optimized "gnat_rcheck"

[Bug ada/51775] New: [4.7 Regression] FAIL: gnat.dg/pack9.adb scan-tree-dump-not optimized "gnat_rcheck"

[Bug ada/51814] make install -jn generates incorrect installation

[Bug ada/51814] New: only 32-bit ada library is built on 64-bit system

[Bug ada/51814] only 32-bit ada library is built on 64-bit system

[Bug ada/51898] gcc assertion

[Bug ada/51898] New: gcc Failed on Assert

[Bug ada/51940] Ada.Finalization of passed function return value skipped if exception raised in routine

[Bug ada/51940] New: Ada.Finalization of passed function return value skipped if exception raised in routine

[Bug ada/52033] Compiler assertion, apparently due to incomplete type

[Bug ada/52033] New: Compiler assertion, apparently due to incomplete type

[Bug boehm-gc/48299] [4.7 Regression] FAIL: boehm-gc.c/thread_leak_test.c

[Bug bootstrap/12024] i386-elf build references nonexistent crt0.o, libsim.a

[Bug bootstrap/17601] gcc/Makefile.in: Setting up XX_FOR_TARGET does not work

[Bug bootstrap/18035] target "gcc-no-fixedincludes" in Makefile doesn't check for proper return value of sub-make

[Bug bootstrap/23101] Make Bootstrap fails on AIX 5.2 ML6

[Bug bootstrap/23198] AC_PROG_INSTALL (autoconf 2.13) does not detect bad install program

[Bug bootstrap/25511] bootstrap-lean fails

[Bug bootstrap/30775] Bootstrap segmentation faults checking for sqrtl declaration...

[Bug bootstrap/31963] The configure option "--enable-stage1-checking" is undocumented (and incorrectly named)

[Bug bootstrap/32272] make exit because build/genmodes.exe doesn't exist

[Bug bootstrap/32537] Boostrap failure: ICE when compiling gengtype-lex.c

[Bug bootstrap/32719] ICE when compiling c-format.c

[Bug bootstrap/33070] Bootstrap comparison failure between stage2/3 but no objdump differences

[Bug bootstrap/34259] Compile gcc 3.4.6 on tru64 unix v5.1b problem with yacc syntax

[Bug bootstrap/34881] Bootstrap fails on building libstdc++: can't find file for: -lgcc_s.10.4

[Bug bootstrap/36216] [meta-bug] Bootstrap problems on mingw32

[Bug bootstrap/36481] gcc fails to build on Solaris x86 - it forgets the locations of libmpfr

[Bug bootstrap/36545] Type _uleb128_t doesn't defined properly in /gcc/unwind-dw2.c

[Bug bootstrap/36783] Build fails in stagefeedback-bubble make target on IRIX 6.5.30 when compiling insn-attrtab.c

[Bug bootstrap/37308] bootstrap hangs in libstdc++

[Bug bootstrap/37606] builtins.c: 6 * set but not used

[Bug bootstrap/37739] [4.4 Regression] bootstrap broken with core gcc > gcc-4.2.x

[Bug bootstrap/39173] PR37739 (bootstrap failure) applies to 4.3.3

[Bug bootstrap/39572] x86_64-*-openbsd* is not supported yet

[Bug bootstrap/39968] Should plugins use shared library?

[Bug bootstrap/40602] crti.o: No such file

[Bug bootstrap/40650] gcc-4.5-20090702 won't build on OS X 10.5 with GMP/MPFR in-tree

[Bug bootstrap/40706] gcc doesn't compile on centos3 64bit

[Bug bootstrap/40729] Build fails in libstdc++-v3

[Bug bootstrap/42028] Bootstrap fails for mpfr/gmp not in LD_LIBRARY_PATH

[Bug bootstrap/42474] SIGSEGV in linemap_lookup

[Bug bootstrap/42666] xgcc: Internal error: segmentation violation (program cc1)

[Bug bootstrap/42787] Failed to "make all-target"

[Bug bootstrap/42827] error in building libgcc; error: 'BITS_PER_UNIT' undeclared

[Bug bootstrap/43046] gcc fails to build libgcc

[Bug bootstrap/44079] Bootstrap error about elf_getshdrstrndx when configure script does not detect elf_getshdrstrndx

[Bug bootstrap/44173] configure -disable-fixincludes doesn't work

[Bug bootstrap/44642] bootstrap fails to build libgcc when gold is built (at least on Solaris_x86)

[Bug bootstrap/45573] --enable-build-with-cxx failures with ld: crtbegin.o: No such file: No such file or directory

[Bug bootstrap/48231] bootstrapping gcc-4.6.0-RC-20110321 fails for h8300-rtems*

[Bug bootstrap/48556] Gcc 4.6.0 bootstrap fails with in-tree GMP/MPFR/MPC

[Bug bootstrap/49829] [4.7 Regression] --disable-static --enable-shared regression: cannot find -lstdc++

[Bug bootstrap/49907] [4.5/4.6 Regression] lto-plugin -Wall in stage1

[Bug bootstrap/49986] Compilation of cross GCC (Linux -> AIX) fails

[Bug bootstrap/50103] gcc-4.4.6/gcc/config/rs6000/rs6000.md:153: internal compiler error: Segmentation fault

[Bug bootstrap/50229] [4.7 Regression] Can't cross compile for i686-apple-darwin10 from x86_64-redhat_linux

[Bug bootstrap/50237] [4.7 regression] bootstrap comparison failure for libcpp/lex.o

[Bug bootstrap/50245] Compile of cross compiler for M68HC11 fails in libgcc, "internal compiler error: Segmentation fault"

[Bug bootstrap/50461] mpfr.h found in mpfr-3.1.0/src instead of mpfr-3.0.1/. as previously

[Bug bootstrap/50686] [4.7 regression] IRIX 6.5 bootstrap failure: ICE in in lookup_cfa_1, at dwarf2cfi.c:595

[Bug bootstrap/51006] bootstrap fails on NetBSD 5.1

[Bug bootstrap/51072] [4.7 Regression] Build with --disable-bootstrap fails in libitm

[Bug bootstrap/51450] configure's test for -fno-rtti -fno-exceptions broken

[Bug bootstrap/51648] [4.7 Regression] Profiledbootstrap failure on x86_64-linux

[Bug bootstrap/51686] "make install-strip-gcc" didn't install liblto-plugin* files

[Bug bootstrap/51705] [4.7 Regression] FreeBSD uses unsupported C++11 features when __cplusplus == 201103L

[Bug bootstrap/51725] [4.7 regression] segfault in stage 3 when compiling gcc/opts.c for sparc64-linux

[Bug bootstrap/51725] New: [4.7 regression] segfault in stage 3 when compiling gcc/opts.c for sparc64-linux

[Bug bootstrap/51734] [4.7 Regression] Bootstrap fails in libada

[Bug bootstrap/51734] New: [4.7 Regression] Bootstrap fails in libada

[Bug bootstrap/51735] [4.7 regression] stage 3 bootstrap failure compiling tree-ssa-pre.c with r182760

[Bug bootstrap/51735] New: [4.7 regression] stage 3 bootstrap failure compiling tree-ssa-pre.c with r182760

[Bug bootstrap/51742] 4.6.2 v. HP-UX 11.11, PA-RISC: "make bootstrap-lean" fails: "internal compiler error: Segmentation fault" (In function '__fixunssfdi')

[Bug bootstrap/51742] New: 4.6.2 v. HP-UX 11.11, PA-RISC: "make bootstrap-lean" fails: "internal compiler error: Segmentation fault" (In function '__fixunssfdi')

[Bug bootstrap/51787] [4.7 Regression] internal compiler error: in inline_small_functions, at ipa-inline.c:1410

[Bug bootstrap/51787] [4.7.0 Regression] internal compiler error: in inline_small_functions, at ipa-inline.c:1410

[Bug bootstrap/51787] New: [4.7.0 Regression] internal compiler error: in inline_small_functions, at ipa-inline.c:1410

[Bug bootstrap/51796] [4.7 regression] internal compiler error: in distribute_notes, at combine.c:13285 for libgomp/alloc.c on m68k-linux

[Bug bootstrap/51796] New: [4.7 regression] internal compiler error: in distribute_notes, at combine.c:13285 for libgomp/alloc.c on m68k-linux

[Bug bootstrap/51860] [4.7 regression] s390 esa mode bootstrap comparison failure since transactional memory branch merge

[Bug bootstrap/51860] New: [4.7 regression] s390 esa mode bootstrap comparison failure since transactional memory branch

[Bug bootstrap/51872] [4.7 Regression] Shrink-wrapping with -mminimal-toc causes bootstrap failure

[Bug bootstrap/51872] New: [4.7 Regression] Shrink-wrapping with -mminimal-toc causes bootstrap failure

[Bug bootstrap/51935] Configure fails on included mpc/mpfr

[Bug bootstrap/51935] New: Configure fails on included mpc/mpfr

[Bug bootstrap/51969] [4.6 regression] gcc 4.7 unable to build gcc 4.6

[Bug bootstrap/51969] [4.7 regression] gcc 4.7 unable to build gcc 4.6

[Bug bootstrap/51969] New: [4.7 regression] gcc 4.7 unable to build gcc 4.6

[Bug bootstrap/51974] New: GCC fails to bootstrap with --enable-checking=release on opensuse

[Bug bootstrap/51985] [4.7 Regression] Bootstrap failure at revision 183497 on x86_64-apple-darwin10

[Bug bootstrap/51985] [4.7 Regression] Bootstrap failure due to revision 183457

[Bug bootstrap/51985] New: [4.7 Regression] Bootstrap failure at revision 183497 on x86_64-apple-darwin10

[Bug bootstrap/51999] gcc-4.7-20120114 v. AIX 6.1

[Bug bootstrap/51999] New: gcc-4.7-20120114 v. AIX 6.1

[Bug bootstrap/52007] configure: error: installation or configuration problem: C compiler cannot create executables

[Bug bootstrap/52039] gcc/gimplify.o differs

[Bug bootstrap/52039] New: gcc/gimplify.o differs

[Bug bootstrap/52041] [4.7 Regression] Bootstrap failure at revision 183650 with --enable-checking=release

[Bug bootstrap/52041] New: [4.7 Regression] Bootstrap failure at revision 183650 with --enable-checking=release

[Bug bootstrap/52058] [4.7 regression] bootstrap fails on HAVE_cc0: combine.c: 'do_SUBST_LINK' defined but not used

[Bug bootstrap/52058] New: [4.7 regression] bootstrap fails on HAVE_cc0: combine.c: 'do_SUBST_LINK' defined but not used

[Bug c++/12333] [DR 272] Explicit call to MyClass::~MyClass() not allowed

[Bug c++/12577] typeof does not qualify as unqualified-id in certain contexts

[Bug c++/14179] [4.4/4.5/4.6/4.7 Regression] out of memory while parsing array with many initializers

[Bug c++/14258] typename in a using declaration not supported

[Bug c++/15369] "Wrong" line number for static constructor function

[Bug c++/15867] -Wredundant-decls and explicit template specialization

[Bug c++/16093] Bad error messages for missing declarations.

[Bug c++/16168] -Weffc++ item 14 improvements

[Bug c++/16232] Poor diagnostic

[Bug c++/16603] Incorrect enumerator type before enumeration's closing brace

[Bug c++/17729] [4.4/4.5/4.6/4.7 Regression] Duplicate __attribute__((deprecated)) warning

[Bug c++/17805] too liberal operator lookup

[Bug c++/18986] GCC Manual does not specify standard for C++

[Bug c++/19741] suboptimal error message for template functions (as opposed to non-templates)

[Bug c++/20140] template function complains about "char-array initialized from wide string"

[Bug c++/20478] poor parse error diagnostic with missing right paren in vec<flow>())))

[Bug c++/20681] [4.4/4.5/4.6 Regression] wrong "control reaches" warning with switches

[Bug c++/20681] [4.4/4.5/4.6/4.7 Regression] wrong "control reaches" warning with switches

[Bug c++/21120] Empty declaration with typeof accepted

[Bug c++/22395] -Weffc++ shouldn't warn about non-virtual dtor of private subclasses

[Bug c++/2316] g++ fails to overload on language linkage

[Bug c++/23211] using dec in nested class doesn't import name

[Bug c++/23383] builtin array operator new is not marked with malloc attribute

[Bug c++/24163] dependent Base class scope examined during unqualified name lookup in template

[Bug c++/24296] FAIL: g++.dg/abi/rtti1.C scan-assembler-dem-not \ntypeinfo for A[: \t\n]

[Bug c++/25973] [4.4/4.5/4.6/4.7 Regression] Wrong warning: control reaches end of non-void function

[Bug c++/25994] Using declarations and base function overloading

[Bug c++/26256] ignores using declaration

[Bug c++/27775] incorrect "ambiguous" error message with multiple inheritance and nested class.

[Bug c++/29273] error on dynamic_cast<T>(array)

[Bug c++/29615] Class can't be friend of itself?

[Bug c++/29859] reference-compatible is defined too narrowly in [decl.int.ref]

[Bug c++/30195] Using declaration doesn't work in template.

[Bug c++/30539] Accepts invalid explicit specialization declaration

[Bug c++/31843] -Wformat-nonliteral differs between gcc and g++

[Bug c++/31986] conversion-type-id should match in both contexts

[Bug c++/32080] Can goto a function try-block

[Bug c++/35380] ICE with attribute 'aligned' in template parameter

[Bug c++/36797] ICE mangling __is_empty

[Bug c++/37374] "using" shadows declaration

[Bug c++/37465] ctors never override virtual functions

[Bug c++/37677] GCC produces mangled names which can't be demangled

[Bug c++/37798] unaligned memory access with multiple inheritance

[Bug c++/37949] static initialisation through pointer deferred until run time

[Bug c++/38260] vector_size attribute vs specialization

[Bug c++/38543] [C++0x] Cannot specialize variadic template function

[Bug c++/38610] local objects not hidden with -fvisibility=hidden.

[Bug c++/38659] Enhancement in _cpp_save_parameter

[Bug c++/39055] [4.4/4.5/4.6/4.7 regression] ICE with questionable default parameter of a member function

[Bug c++/39055] questionable default parameter of a member function accepted

[Bug c++/39462] check assert() at compile time if possible

[Bug c++/39901] [C++0x] Initializer list not allowed in []

[Bug c++/39970] gcc accepts the . dot operator in template arguments

[Bug c++/39993] exception-specification not checked on extern "C" functions

[Bug c++/40036] Initializer incorrectly reordering arguments

[Bug c++/40127] Fails to identify template function with default args

[Bug c++/41090] [4.4/4.5/4.6/4.7/4.8 Regression] Using static label reference in c++ class constructor produces wrong code

[Bug c++/41233] Templated conversion operator produces symbol name that won't demangle

[Bug c++/41561] [C++0x] warning on a large hex literal

[Bug c++/41596] handling of library-related options by g++spec.c causes a failure when generating pch.

[Bug c++/41847] warning: array subscript is above array bounds

[Bug c++/41933] [c++0x] lambdas and variadic templates don't work together

[Bug c++/43453] Initialization of char array with string literal fails in mem-initializer

[Bug c++/44731] [4.5 Regression] Return value optimization produces inaccurate debug info

[Bug c++/45690] broken debuginfo with dwarf4?

[Bug c++/47226] [C++0x] GCC doesn't expand template parameter pack that appears in a lambda-expression

[Bug c++/47294] definition of function template can be explicitly-qualified with a namespace it isn't a member of

[Bug c++/47302] ICE: same canonical type node for different types char [(A<int>::value ? 1 : 2)] and char [1] with -fabi-version=1

[Bug c++/47304] ICE: SIGSEGV in is_empty_class (class.c:6800) with -fabi-version=1

[Bug c++/47335] [C++0x] "sorry, unimplemented: mangling overload"

[Bug c++/47450] [4.5/4.6/4.7 Regression] Anonymous top-level classes assigned to static members fail.

[Bug c++/47791] finish function is using literal value instead of a #defined one

[Bug c++/48051] sorry, unimplemented: mangling overload

[Bug c++/48075] infinite loop when compiling

[Bug c++/48680] -Weffc++ update description for 2nd and 3rd edition of Scott Meyers

[Bug c++/49855] [4.6/4.7 Regression] internal compiler error: in fold_convert_const_int_from_real

[Bug c++/49976] Cross (Linux->AIX) GCC crashes with Segmentation fault

[Bug c++/50012] [4.5/4.6 Regression] C++ front end misses -Wsign-compare warnings when extraneous parentheses are present

[Bug c++/50012] [4.5/4.6/4.7 Regression] C++ front end misses -Wsign-compare warnings when extraneous parentheses are present

[Bug c++/50080] [C++0x] error: 'template' (as a disambiguator) is only allowed within templates

[Bug c++/50080] [DR 468] error: 'template' (as a disambiguator) is only allowed within templates

[Bug c++/50261] [C++0x] ICE on brace-initialize an array member

[Bug c++/50276] [C++0x] Wrong "used uninitialized in this function" warning

[Bug c++/50370] [C++0x] Multiple declarations with default template arguments accepted

[Bug c++/50855] [C++0x] Name mangling for late return types invoking constructors not implemented

[Bug c++/50998] [C++0x] ICE partial specialization error at cp/pt.c

[Bug c++/51064] False Positive for -Wparentheses

[Bug c++/51066] [C++0x] warning about binding an rvalue-reference to an implicit conversion result

[Bug c++/51092] [C++0x] [4.6 Regression] ICE array std::pair initialization

[Bug c++/51148] [C++0x] Unexpanded template param packs wrongly accepted in friend class declarations

[Bug c++/51151] Invalid -Woverflow warning in C++ frontend

[Bug c++/51199] [C++11][DR 547] gcc forms impossible types derived from function types with cv-qualifier-seq

[Bug c++/51219] ICE with designated initializers

[Bug c++/51223] [4.5/4.6 Regression] ICE with invalid function parameter

[Bug c++/51223] [4.5/4.6/4.7 Regression] ICE with invalid function parameter

[Bug c++/51225] [c++0x] [4.7 Regression] ICE with invalid template parameter

[Bug c++/51226] [c++0x] ICE with opaque enum and invalid template

[Bug c++/51295] [C++11][noexcept] Wrong c'tor exception-specification with non-trivial d'tor

[Bug c++/51312] [C++0x] Wrong interpretation of converted constant expressions (for enumerator initializers)

[Bug c++/51322] [C++11] wrong mangling with argument packs

[Bug c++/51327] [c++0x] [4.7 Regression] ICE with invalid constexpr parameter

[Bug c++/51344] [4.4/4.5/4.6/4.7 regression] cc1plus hangs when compiling

[Bug c++/51344] cc1plus hangs when compiling

[Bug c++/51364] C++ interoperability with ISO-C extension DFP types requires explicit typedefs.

[Bug c++/51370] [4.6/4.7 Regression] ICE with invalid template parameter

[Bug c++/51379] [C++0x] [DR 799] reinterpret_cast is not particularly useful

[Bug c++/51398] [4.7 Regression] ICE with invalid template parameter

[Bug c++/51400] [c++0x] ICE with constexpr and attribute noreturn

[Bug c++/51402] [4.6/4.7 Regression] ICE with invalid template parameter

[Bug c++/51403] [4.7 Regression] ICE with invalid template parameter

[Bug c++/51415] [4.5/4.6/4.7 Regression] Broken diagnostic: 'vec_init_expr' not supported by dump_expr

[Bug c++/51421] [c++0x] ICE with invalid use of auto

[Bug c++/51422] [c++0x] ICE with invalid lambda expression

[Bug c++/51433] constexpr caching leads to incorrect dynamic initialization

[Bug c++/51462] [c++0x] ICE in cx_check_missing_mem_inits

[Bug c++/51541] ICE on ill-formed alias template declarations

[Bug c++/51543] terrible diagnostic for wrong type when expected class or namespace

[Bug c++/51556] Bizarre member template access control errors

[Bug c++/51565] [4.4/4.5/4.6/4.7 Regression] fastcall in array of method pointers: internal compiler error

[Bug c++/51577] dependent name lookup finds operator in global namespace

[Bug c++/51582] [4.6 Regression] ICE when using a class with a matrix of complex numbers in C++0x mode

[Bug c++/51613] [4.4/4.5/4.6/4.7 Regression] Ambiguous function template instantiations as template argument are not rejected

[Bug c++/51614] [4.6/4.7 Regression] ICE with ambiguous base class

[Bug c++/51620] [c++0x] [4.6/4.7 Regression] ICE with private destructor

[Bug c++/51633] [c++0x] [4.6/4.7 Regression] ICE with invalid constexpr constructor

[Bug c++/51640] Misleading error if the type in the catch() is ambiguous

[Bug c++/51641] Lookup finds enclosing class member instead of template parameter

[Bug c++/51666] NSDMI parse fails for template'd intializer

[Bug c++/51669] [4.7 Regression] ICE verify-gimple with openmp

[Bug c++/51675] [C++11][4.7 Regression] Cannot create constexpr unions

[Bug c++/51689] GCC apparently is inconsistent with warning about invalid brace-elision use

[Bug c++/51706] default copy assignment incorrectly deleted

[Bug c++/51710] decltype and SFINAE

[Bug c++/51714] [4.6/4.7 Regression] internal compiler error: Segmentation fault with -std=c++11

[Bug c++/51722] Options "-g3" or "-ggdb3" or "-g3 -gdwarf-2" and other "-g..level3" - internal compiler error

[Bug c++/51723] [C++0x] delegating constructor ICE

[Bug c++/51724] New: no matching function for call; confused by earlier errors, bailing out

[Bug c++/51724] no matching function for call; confused by earlier errors, bailing out

[Bug c++/51731] code generation bug in negative indices in arrays on 64-bit targets

[Bug c++/51731] New: code generation bug in negative indices in arrays on 64-bit targets

[Bug c++/51737] g++ crashes (internal compiler error: Segmentation fault) when compiling quickbook

[Bug c++/51737] New: g++ crashes (internal compiler error: Segmentation fault) when compiling quickbook

[Bug c++/51738] C++11 initializer list does not work correctly with operator[]

[Bug c++/51738] New: C++11 initializer list does not work correctly with operator[]

[Bug c++/51739] g++ cpp compiler crash with -O3

[Bug c++/51739] New: g++ cpp compiler crash with -O3

[Bug c++/51747] New: [C++11] cannot call copy constructor using list-initialization

[Bug c++/51755] -Wconversion generates false warnings when the ternary operator is used

[Bug c++/51755] New: -Wconversion generates false warnings when the ternary operator is used

[Bug c++/51757] friend defined inside class and declared inside main linker error

[Bug c++/51757] New: friend defined inside class and declared inside main linker error

[Bug c++/51759] miscompile writes past end of bitfield

[Bug c++/51759] New: miscompile writes past end of bitfield

[Bug c++/51763] New: SEVERE ERROR: Symbol C_BSTAT

[Bug c++/51763] SEVERE ERROR: Symbol C_BSTAT

[Bug c++/51773] error building libitm/aatree.cc on ARM

[Bug c++/51773] New: error building libitm/aatree.cc on ARM

[Bug c++/51777] Errors message show unsigned long template parameters as signed

[Bug c++/51777] New: Errors message show unsigned long template parameters as signed

[Bug c++/51785] gets not anymore declared

[Bug c++/51785] New: gets not anymore declared

[Bug c++/51786] [c++0x] Invalid declaration with decltype accepted

[Bug c++/51786] New: [c++0x] Invalid declaration with decltype accepted

[Bug c++/51789] New: GCC does not consider SFINAE in template parameter list of template parameter pack

[Bug c++/51804] -Wabi confusion

[Bug c++/51804] New: Wabi false positives

[Bug c++/51804] Wabi false positives

[Bug c++/51805] Invalid list-initialization accepted

[Bug c++/51805] New: Invalid list-initialization accepted

[Bug c++/51810] internal compiler error

[Bug c++/51810] New: internal compiler error

[Bug c++/51812] [4.7 regression] Virtual public inheritance and thunks leads to "undefined reference" in header files.

[Bug c++/51812] [4.7 regression] Virtual public inheritance leads to "undefined reference" in header files.

[Bug c++/51812] New: Virtual public inheritance leads to "undefined reference" in header files.

[Bug c++/51812] Virtual public inheritance leads to "undefined reference" in header files.

[Bug c++/51813] [4.7 Regression] -fvisibility=hidden causes std::codecvt members to be undefined

[Bug c++/51813] New: -fvisibility=hidden causes std::codecvt members to be undefined

[Bug c++/51817] New: [C++11] argument deduction fails when A-type parameter-type-list has additional parameters

[Bug c++/51818] [C++0x] Name mangling error using lambda expressions in GCC47

[Bug c++/51818] New: [C++0x] Name mangling error using lambda expressions in GCC47

[Bug c++/51824] Error during the Compile step while upgrading the Apache from 1.3.34 to 2.0.59

[Bug c++/51824] New: Error during the Compile step while upgrading the Apache from 1.3.34 to 2.0.59

[Bug c++/51826] [4.6 Regression] internal compiler error: in convert_nontype_argument, at cp/pt.c:5408

[Bug c++/51826] New: internal compiler error: in convert_nontype_argument, at cp/pt.c:5408

[Bug c++/51827] [4.7 regression] Error: 'FOO' conflicts with a previous declaration, with PCH/LTO/C++11

[Bug c++/51827] Error: 'FOO' conflicts with a previous declaration, with PCH/LTO/C++11

[Bug c++/51827] New: Error: 'FOO' conflicts with a previous declaration, with PCH/LTO/C++11

[Bug c++/51829] decltype() deduces non-const but only in a template

[Bug c++/51829] New: decltype() deduces non-const but only in a template

[Bug c++/51832] [4.7 regression] Rev.182970 causes LTO link errors (multiple definitions of allocator_traits)

[Bug c++/51832] New: [4.7 regression] Rev.182970 causes LTO link errors (multiple definitions of allocator_traits)

[Bug c++/51833] ICE in tsubst_copy, at cp/pt.c:11333

[Bug c++/51833] New: ICE in tsubst_copy, at cp/pt.c:11333

[Bug c++/51836] New: -Wsequence-point fails when convoluted expressions with multiple side effects are used (C++03)

[Bug c++/51841] iterator weirdness. I couldn't tell you what's going on here

[Bug c++/51841] New: iterator weirdness. I couldn't tell you what's going on here

[Bug c++/51847] New: incorrect primitive array initialization in generic methods

[Bug c++/51851] New: Overriding a function with a parameter of dependent type fails to override.

[Bug c++/51851] Overriding a function with a parameter of dependent type fails to override.

[Bug c++/51852] [regression] [c++11] tree check: expected tree_list, have HÃÃMÃÃÃÃtxÃtsÃ

[Bug c++/51852] New: [regression] [c++11] tree check: expected tree_list, have HÃÃMÃÃÃÃtxÃtsÃ

[Bug c++/51854] [4.4/4.5/4.6 Regression] ICE in mangle.c with literal of complex floating type

[Bug c++/51854] [4.4/4.5/4.6/4.7 Regression] ICE in mangle.c with literal of complex floating type

[Bug c++/51854] ICE in mangle.c with literal of complex floating type

[Bug c++/51854] New: ICE in mangle.c with literal of complex floating type

[Bug c++/51868] [4.6 Regression] Crash when generating the move constructor for a class with a bit field

[Bug c++/51868] [4.7 Regression] Crash when generating the move constructor for a class with a bit field

[Bug c++/51868] New: Crash when generating the move constructor for a class with a bit field

[Bug c++/51878] ICE or OOM with decltype + variadic templates + "indirect" function call

[Bug c++/51878] New: ICE or OOM with decltype + variadic templates + "indirect" function call

[Bug c++/51884] ICE with c++11 thread and templates

[Bug c++/51884] lamba with templates

[Bug c++/51884] New: ICE with c++11 thread and templates

[Bug c++/51885] g++ compiler options -O2 and -O3 modifies program results

[Bug c++/51885] New: g++ compiler options -O2 and -O3 modifies program results

[Bug c++/51886] __alignof__ on uninstantiated template type

[Bug c++/51886] New: __alignof__ on uninstantiated template type

[Bug c++/51888] [C++11]warn comma at end of enumerator list with -pedantic

[Bug c++/51888] New: [C++11]warn comma at end of enumerator list with -pedantic

[Bug c++/51889] [4.7 regression] can't override a using-declaration in a template

[Bug c++/51889] New: [4.7 regression] can't override a using-declaration in a template

[Bug c++/51897] command line option to create a namespace alias

[Bug c++/51897] New: command line option to create a namespace alias

[Bug c++/51908] [C++11] ICE in cp_parser_abort_tentative_parse with decltype and variable template arguments

[Bug c++/51908] ICE in cp_parser_abort_tentative_parse,

[Bug c++/51908] New: ICE in cp_parser_abort_tentative_parse,

[Bug c++/51909] New: for avr device : internal error in linking phase , function call disappearing when assembled and a weird compiling warning

[Bug c++/51910] [4.7 Regression] -frepo linking failure

[Bug c++/51910] New: -frepo linking failure

[Bug c++/51911] New: [C++11] G++ accepts new auto { list }

[Bug c++/51912] New: [C++11] G++ accepts floating point case labels

[Bug c++/51917] [4.7 regression] g++.old-deja/g++.abi/vmihint.C FAILs

[Bug c++/51917] New: [4.7 regression] g++.old-deja/g++.abi/vmihint.C FAILs

[Bug c++/51918] [4.7 regression] g++.old-deja/g++.pt/ptrmem6.C FAILs

[Bug c++/51918] g++.old-deja/g++.pt/ptrmem6.C FAILs in C++11 mode

[Bug c++/51918] New: [4.7 regression] g++.old-deja/g++.pt/ptrmem6.C FAILs

[Bug c++/51922] g++.dg/ext/attrib42.C FAILs

[Bug c++/51922] New: g++.dg/ext/attrib42.C FAILs

[Bug c++/51923] New: cxa_atexit test changed outcome with gld 2.22

[Bug c++/51925] [4.7 Regression] ICE in tsubst

[Bug c++/51925] [4.7 Regression] ICE in tsubst with using and template function

[Bug c++/51925] New: [4.7 Regression] ICE in tsubst

[Bug c++/51927] New: [C++0x] Cannot access non-static members in initializer

[Bug c++/51928] ICE: SIGSEGV in lookup_fnfields_idx_nolazy (search.c:1384) with -fgnu-tm on invalid code

[Bug c++/51930] [4.7 regression] Explicitly instantiated template gets hidden visibility

[Bug c++/51930] Explicitly instantiated template gets hidden visibility

[Bug c++/51930] New: Explicitly instantiated template gets hidden visibility

[Bug c++/51936] New: template function not instantiated

[Bug c++/51936] template function not instantiated

[Bug c++/51951] New: Template function dependent name resolution fails

[Bug c++/51951] Template function dependent name resolution fails

[Bug c++/51962] Compiling with -O3 and using the same input produces a different result

[Bug c++/51962] New: Compiling with -O3 and using the same input produces a different result

[Bug c++/51973] [4.7 regression][C++11] Template parameter deduction fails for overloaded functions when template parameters have defaulted arguments

[Bug c++/51973] New: [regression][C++0x] Template parameter deduction fails for overloaded functions when template parameters have defaulted arguments

[Bug c++/51979] New: variadic templates + lambda capture list = error

[Bug c++/51979] variadic templates + lambda capture list = error

[Bug c++/51989] New: std::deque::iterator recognised as container

[Bug c++/51989] std::deque::iterator recognised as container

[Bug c++/51992] [4.7 Regression] internal compiler error: tree code âtarget_exprâ is not supported in LTO streams

[Bug c++/52003] New: warning about (un)existing return statement in the main function declared 'noreturn'

[Bug c++/52003] warning about (un)existing return statement in the main function declared 'noreturn'

[Bug c++/52008] [C++0x] ICE when adding partial specialization for variadic-templated structure

[Bug c++/52008] New: [C++0x] ICE when adding partial specialization for variadic-templated structure

[Bug c++/52014] [c++0x] g++: Segfault When `decltype` Used in Nested Lambda Function Defined in Class Member Function

[Bug c++/52014] New: [c++0x] g++: Segfault When `decltype` Used in Nested Lambda Function Defined in Class Member Function

[Bug c++/52018] GCC refuses to accept a disambiguation statement

[Bug c++/52018] New: GCC refuses to accept a disambiguation statement

[Bug c++/52026] [c++0x] g++: Constexpr Variable Appears Uninitialized in Lambda

[Bug c++/52026] New: [c++0x] g++: Constexpr Variable Appears Uninitialized in Lambda

[Bug c++/52030] ICE with decltype(make_tuple) is a late return type

[Bug c++/52030] New: ICE with decltype(make_tuple) is a late return type

[Bug c++/52031] G++ crashes when std::size_t is initalized with a float inside a template

[Bug c++/52031] New: G++ crashes when std::size_t is initalized with a float inside a template

[Bug c++/52032] Function and class attributes should optionally take a bool parameter enabling them

[Bug c++/52032] New: Function and class attributes should optionally take a bool parameter enabling them

[Bug c++/52035] internal compiler error: tree code âtemplate_type_parmâ is not supported in LTO streams

[Bug c++/52035] New: internal compiler error: tree code âtemplate_type_parmâ is not supported in LTO streams

[Bug c++/52036] C++11 allows template parameters to have internal linkage

[Bug c++/52036] New: C++11 allows template parameters to have internal linkage

[Bug c++/52043] [4.7 Regression] [C++0x] ICE: SIGSEGV in tsubst_copy (pt.c:12081) with -Wreturn-type

[Bug c++/52043] New: [4.7 Regression] [C++0x] ICE: SIGSEGV in tsubst_copy (pt.c:12081) with -Wreturn-type

[Bug c++/52064] New: template function of template class s;e

[Bug c++/52064] template function of template class s;e

[Bug c++/52065] Declaring template friend function of template class breaks template type inference.

[Bug c++/52065] New: template function of template class s;e

[Bug c++/52067] force sibling call optimization

[Bug c++/52067] New: force sibling call optimization

[Bug c++/52069] ARM: initialization of static member in template struct

[Bug c++/52069] New: ARM: initialization of static member in template struct

[Bug c++/52071] Constructor invocation confused

[Bug c++/52071] New: Constructor invocation confused

[Bug c++/52072] New: Several non-deduced context not recognized

[Bug c++/6057] expression mangling doesn't work for operator new

[Bug c++/6936] member "using" binds wrong

[Bug c/10360] __alignof__(double) answer 8

[Bug c/12245] [4.4/4.5/4.6/4.7 regression] Uses lots of memory when compiling large initialized arrays

[Bug c/23145] struct {int i;} is not compatiable with struct {int i,j}

[Bug c/25733] missed diagnostic about assignment used as truth value.

[Bug c/26732] different argument type not rejected for K&R style function definitions

[Bug c/27719] ICE on invalid function definition

[Bug c/28233] internal compiler error: in make_decl_rtl, at varasm.c:752

[Bug c/29358] Warning issued two times with snprintf

[Bug c/2995] __complex__ int typecasts maybe broken

[Bug c/32455] [4.4/4.5 Regression] ICE with modified va_list, allows declaration of __builtin_*

[Bug c/32511] [4.4/4.5 Regression] GCC rejects inline+weak function

[Bug c/33763] [4.4/4.5/4.6/4.7 Regression] Bogus inlining failed in call to `xxx': redefined extern inline functions are not considered for inlining

[Bug c/37865] gfortran build fails in stage 3 bootstrap with --enable-intermodule

[Bug c/37985] [4.4/4.5/4.6/4.7 Regression] unsigned char shift lacks "statement with no effect" warning

[Bug c/39375] asm with a "=X" output overwrites the output

[Bug c/39438] Can't compile a wrapper around strftime with -Werror=format-nonliteral

[Bug c/42538] ICE on illegal-code: tree check: expected function_decl, have var_decl in start_function, at c-decl.c:7369

[Bug c/42643] "may be used uninitialized" compiled with "-Wall -O"

[Bug c/42885] -fmudflap prevents 'conflicting types' warning

[Bug c/43395] Gcc warns label as local variable

[Bug c/44365] ICE with -fdump-tree-all

[Bug c/45152] LTO breaks C99 inline

[Bug c/48561] [4.4 Regression] internal compiler error: in change_address_1, at emit-rtl.c:1954

[Bug c/48561] internal compiler error: in change_address_1, at emit-rtl.c:1954

[Bug c/49581] [trans-mem] save/restore of thread-local data in nested txns is missing

[Bug c/49934] gcc 4.6.1 messes up code

[Bug c/50236] compiler throws internal compiler error: Segmentation fault

[Bug c/50353] vec_set not used for vector indexing

[Bug c/50720] "deprecated" doesn't work as expected for functions returning pointer

[Bug c/51294] spurious warning from -Wconversion in C and C++ in conditional expressions

[Bug c/51542] bootstrap failure due to uninitialized variable use in c-parser

[Bug c/51676] -Wsuggest-attribute={pure,const} should give line number of declaration, not definition

[Bug c/51730] [4.7 Regression] autoconf 2.60 through 2.67 stdbool.h check fails with GCC 4.7

[Bug c/51730] New: [4.7 Regression] autoconf 2.60 through 2.67 stdbool.h check fails with GCC 4.7

[Bug c/51740] New: warning "is used uninitialized in this function" is missing if the variable initialized later

[Bug c/51740] warning "is used uninitialized in this function" is missing if the variable initialized later

[Bug c/51741] complicatet brakets wont compile

[Bug c/51741] New: complicatet brakets wont compile

[Bug c/51821] [4.5/4.6/4.7 Regression] 64bit > 32bit conversion produces incorrect results with optimizations

[Bug c/51821] New: 64bit > 32bit conversion produces incorrect results with optimizations

[Bug c/51831] New: internal compiler error: in simplify_subreg, at simplify-rtx.c:5375

[Bug c/51834] -Wsequence-point fails when convoluted expressions with multiple side effects are used

[Bug c/51834] New: -Wsequence-point fails when convoluted expressions with multiple side effects are used

[Bug c/51838] New: Inefficient add of 128 bit quantity represented as 64 bit tuple to 128 bit integer.

[Bug c/51839] New: GCC not generating adc instruction for canonical multi-precision add sequence

[Bug c/51840] asm goto enhancement request

[Bug c/51846] Compiled programs suffer from infinite recursion when using -finstrument-functions with optimizations

[Bug c/51846] New: Compiled programs suffer from infinite recursion when using -finstrument-functions with optimizations

[Bug c/51849] -Wc99-compat would be considered useful

[Bug c/51849] New: -Wc99-compat would be considered useful

[Bug c/51853] MPFR assertion failure with Python: p >= 2 && p <= ((mpfr_prec_t)((mpfr_uprec_t)(~(mpfr_uprec_t)0)>>1))

[Bug c/51853] New: MPFR assertion failure with Python: p >= 2 && p <= ((mpfr_prec_t)((mpfr_uprec_t)(~(mpfr_uprec_t)0)>>1))

[Bug c/51862] New: Over optimization for assignments to char[] defined inner than used

[Bug c/51862] Over optimization for assignments to char[] defined inner than used

[Bug c/51883] Build warning unknown conversion type in gimplify.c

[Bug c/51883] New: Build warning unknown conversion type in gimplify.c

[Bug c/51894] Fail to warn on likely precedence error in conditional

[Bug c/51894] New: Fail to warn on likely precedence error in conditional

[Bug c/51896] New: Should gcc warn if a variable initializer inside a switch statement is never used?

[Bug c/51896] Should gcc warn if a variable initializer inside a switch statement is never used?

[Bug c/51900] New: [4.6 Regression] const variable initialization always zero

[Bug c/51905] New: ICE at sysklogd compilation for powerpc-linux-gnuspe with -O3

[Bug c/51949] New: expand_call: seg fault

[Bug c/51952] New: Wish: -Wextra should warn on result of integer division being assigned to a float

[Bug c/51955] _mm_setzero_si128 intrinsic causes segfault without -O

[Bug c/51955] New: _mm_setzero_si128 intri causes segfault without -O

[Bug c/51971] New: unclear/unverified restrictions on attribute((const|pure))

[Bug c/51971] unclear/unverified restrictions on attribute((const|pure))

[Bug c/51983] New: Wrong line number in an uninitialized variable warning

[Bug c/51983] Wrong line number in an uninitialized variable warning

[Bug c/52007] New: configure: error: installation or configuration problem: C compiler cannot create executables

[Bug c/52017] New: internal compiler error: Segmentation fault in compiling Perl Tk on Cygwin

[Bug c/52023] [C11] _Alignof (double) yields wrong value on x86

[Bug c/52023] New: _Alignof (double) yields wrong value on x86

[Bug c/52050] -Wdeclaration-after-statement does not warn on declaration in for loop initialiser

[Bug c/52050] New: -Wdeclaration-after-statement does not warn on declaration in for loop initialiser

[Bug c/52050] Want an option to warn about a declaration inside a for/while/if statements.

[Bug c/52056] Code optimization sensitive to trivial changes

[Bug c/52056] New: Code optimization sensitive to trivial changes

[Bug c/52057] dropping "const" in assignment gives only a warning

[Bug c/52057] New: dropping "const" in assignment gives only a warning

[Bug c/52073] New: ICE: vector VEC(vec_void_p,base) index domain error, in vinfo_for_stmt at tree-vectorizer.h:620

[Bug c/8081] ICE with variably sized types returned from nested functions

[Bug classpath/39747] Installation documentation should suggest building libgmp as PIC for building with libjava

[Bug debug/10499] Debug information for some C++ headers is missing classes (template specific?)

[Bug debug/15810] DWARF2 does not emit 64 bit offsets when in 64 bit mode

[Bug debug/18112] -feliminate-dwarf2-dups produces debug entries in wrong scope

[Bug debug/19251] gstabs emits wrong entry for "unsigned int/long" types on powerpc

[Bug debug/24801] -d option changes debug information

[Bug debug/24943] [hppa64] Bad dwarf output using non-preserved base register

[Bug debug/28547] Large compile time regression with -g

[Bug debug/45682] missing namespace parent die when using -gdwarf-4

[Bug debug/49532] Dwarf Error: wrong version in compilation unit header (is 1024, should be 2, 3, or 4) [in module D:\mingw.tests\l.dll]

[Bug debug/49951] [4.5/4.6/4.7 Regression] Debug stepping behavior regarding g++ Class destructor has changed for the worse starting at gcc 4.5.0

[Bug debug/50203] ICE: in output_loc_list, at dwarf2out.c:8188 with --param max-vartrack-expr-depth=140

[Bug debug/51471] [4.7 Regression] gcc.c-torture/execute/20040811-1.c and gcc.c-torture/execute/vla-dealloc-1.c fails at -O3 -g on mips64-linux-gnu

[Bug debug/51570] [4.7 Regression] FAIL: gcc.dg/guality/pr45003-[23].c

[Bug debug/51650] [4.7 regression] LTO ICE in dwarf2out_finish, at dwarf2out.c:22501 while building libxul

[Bug debug/51695] [4.7 Regression] ICE while compiling argyllcms package

[Bug debug/51695] NOTE_INSN_VAR_LOCATION notes are sometimes too large

[Bug debug/51746] [4.7 Regression] Segfault in cselib_preserved_value_p

[Bug debug/51746] New: Segfault in cselib_preserved_value_p

[Bug debug/51746] Segfault in cselib_preserved_value_p

[Bug debug/51762] [4.7 Regression] ICE in maybe_record_trace_start, at dwarf2cfi.c:2231

[Bug debug/51762] New: [4.7 Regression] ICE in maybe_record_trace_start, at dwarf2cfi.c:2231

[Bug debug/51873] New: stringstream is opaque with g++

[Bug debug/51873] stringstream is opaque with g++

[Bug debug/51902] lexical_blocks inside inlined_subroutines generate duplicate debug_ranges

[Bug debug/51902] New: lexical_blocks inside inlined_subroutines generate duplicate debug_ranges

[Bug debug/51950] [4.6/4.7 Regression] fdebug-types-section regression for member pointers

[Bug debug/51950] New: [4.6 Regression] fdebug-types-section regression for member pointers

[Bug debug/52001] [4.7 reegression] Huge compile-time regression with var-tracking

[Bug debug/52001] [4.7 Regression] Huge compile-time regression with var-tracking

[Bug debug/52001] New: [4.7 reegression] Huge compile-time regression with var-tracking

[Bug debug/52027] [4.7 Regression] ICE: SIGSEGV in set_cur_line_info_table (dwarf2out.c:20428) with -O -freorder-blocks-and-partition -fno-reorder-functions -fprofile-use

[Bug debug/52048] [4.7 Regression] -fcompare-debug failure with -O2 -fcompare-debug -fnon-call-exceptions -fno-tree-dominator-opts

[Bug debug/7853] gcc reports multiple symbol definitions on the wrong line

[Bug debug/8108] Problem in the code generator for C and the linker is extremelly slow

[Bug driver/19353] Faulty handling of (some) user specified specs

[Bug driver/23351] *cpp specs file options are sometimes ignored

[Bug driver/25179] precedence of -fpie over -fpic

[Bug driver/36272] Please add support for google-breakpad or build own system.

[Bug driver/36485] gcc driver incorrectly assumes existence of $(prefix)/usr/lib

[Bug driver/47249] [4.4/4.5/4.6 Regression] ICE in common_handle_option, at opts.c:1695 with unknown option passed to cc1

[Bug driver/47249] [4.4/4.5/4.6/4.7 Regression] ICE in common_handle_option, at opts.c:1695 with unknown option passed to cc1

[Bug driver/48306] [4.4/4.5/4.6 Regression] presence of gcc subdir with . in PATH causes breakdown

[Bug driver/48306] [4.4/4.5/4.6/4.7 Regression] presence of gcc subdir with . in PATH causes breakdown

[Bug driver/51844] [4.7 regression] configuring with --with-gxx-include-dir=<absolute path> adds a relative (non-existing) C++ include dir

[Bug driver/51844] New: [4.7 regression] configuring with --with-gxx-include-dir=<absolute path> adds a relative (non-existing) C++ include dir

[Bug driver/51857] gcc -flto ignores -B

[Bug driver/51857] New: gcc -flto ignores -B

[Bug fortran/22210] gfc_conv_array_initializer weirdness

[Bug fortran/35161] [F2008] allow procedures with same binding label (invalid in F2003)

[Bug fortran/35476] Accepts invalid: USE/host association of generics with same specifics

[Bug fortran/38813] ICE with C_LOC(array)

[Bug fortran/40963] ICE segfault - c_loc with derived type component as argument

[Bug fortran/41227] COMMON block, BIND(C) and LTO interoperability issues

[Bug fortran/41600] [OOP] SELECT TYPE with associate-name => exp: Arrays not supported

[Bug fortran/41823] gcc/fortran/trans-openmp.c: possible null pointer dereference

[Bug fortran/41951] [OOP] Not diagnosing ambiguous operators (TB vs. INTERFACE)

[Bug fortran/42418] PROCEDURE: Rejects interface which is both specific and generic procedure

[Bug fortran/42693] Missing gcc-internal-format on messages from gfc_arith_error

[Bug fortran/42934] Bogus variable_check

[Bug fortran/42954] [4.4/4.5/4.6/4.7 regression] TARGET_*_CPP_BUILTINS issues with gfortran

[Bug fortran/43366] [OOP][F2008] Intrinsic assign to polymorphic variable

[Bug fortran/43412] [OOP] BT_CLASS does not does not set array spec

[Bug fortran/45521] Fortran 2008: GENERIC resolution with ALLOCATABLE/POINTER and PROCEDURE

[Bug fortran/46262] [OOP] tree check: expected function_type or method_type, have pointer_type

[Bug fortran/46321] [OOP] Polymorphic deallocation

[Bug fortran/46328] [OOP] type-bound operator call with non-trivial polymorphic operand

[Bug fortran/46356] [OOP] Erroneous procedure/intent error and ICE for class dummy argument

[Bug fortran/47399] [OOP] ICE with TBP of a PARAMETER

[Bug fortran/47545] ICE: in gfc_get_derived_type, at fortran/trans-types.c:2145

[Bug fortran/48351] [OOP] Realloc on assignment fails if parent component is CLASS

[Bug fortran/48426] [patch] Quad precision promotion

[Bug fortran/48705] [OOP] ALLOCATE with non-trivial SOURCE

[Bug fortran/48858] Incorrect error for same binding label on two generic interface specifics

[Bug fortran/48946] [OOP] Deferred Overloaded Assignment

[Bug fortran/49050] ICE with deferred character length derived type component

[Bug fortran/49110] Deferred-length character result triggers (false positive) error for pure procedures

[Bug fortran/49693] Spurious "unused-variable" warnings for COMMON block module variables.

[Bug fortran/50362] ICE on x86 architecture with -O2 or higher

[Bug fortran/50410] [4.6/4.7 Regression] ICE in record_reference

[Bug fortran/50536] an input item shall not appear as the do-variable of any io-implied-do

[Bug fortran/50556] cannot save namelist group name

[Bug fortran/50981] [4.4/4.5/4.6 Regression] Wrong-code for scalarizing ELEMENTAL call with absent OPTIONAL argument

[Bug fortran/50981] [4.4/4.5/4.6/4.7 Regression] Wrong-code for scalarizing ELEMENTAL call with absent OPTIONAL argument

[Bug fortran/51052] [OOP] Internal compiler error in gfc_conv_component

[Bug fortran/51056] [4.7 Regression][OOP] Bogus "Unused module variable '__vtab_domain_Domain_container'"

[Bug fortran/51075] ICE with deferred-length character pointer component in derived types

[Bug fortran/51197] [4.7 Regression] Backtrace information less useful

[Bug fortran/51334] [OOP] ICE with type-bound operator: tree check: expected record_type or union_type or qual_union_type, have function_type in gfc_conv_component_ref, at fortran/trans-expr.c:556

[Bug fortran/51418] Fortran format sp,f0.0 output wrong with NaN and 0.0

[Bug fortran/51502] [4.6/4.7 Regression] Potentially wrong code generation due to wrong implict_pure check

[Bug fortran/51520] [4.6 Regression] ICE in gfortran 4.6.2, x86_64

[Bug fortran/51522] ICE in gfortran 4.6.2, x86_64

[Bug fortran/51529] [OOP] gfortran.dg/class_to_type_1.f03 is miscompiled: Uninitialized variable used

[Bug fortran/51550] ICE in gfc_get_derived_type, at fortran/trans-types.c:2401

[Bug fortran/51569] documentation on sign intrinsic

[Bug fortran/51578] [4.3/4.4/4.5/4.6/4.7 Regression] Import of same symbol via different modules and renaming

[Bug fortran/51616] [4.7 Regression] gfortran.dg/quad_2.f90 fails on hppa*-*-hpux*

[Bug fortran/51634] [OOP] ICE with polymorphic operators

[Bug fortran/51638] gfortran optimization breaks a single variable used as both input and output for subroutine call

[Bug fortran/51652] Allocate with type-spec and source-expr: check whether length type-parameter is the same is lacking

[Bug fortran/51682] Coarray ICEs when compiling with -fdefault-integer-8

[Bug fortran/51727] New: Changing module files

[Bug fortran/51733] [OOP] No allocate on assign for class objects with allocatable components.

[Bug fortran/51733] New: [OOP] No allocate on assign for class objects with allocatable components.

[Bug fortran/51736] generic fortran procedures with allocatable/pointer argument

[Bug fortran/51736] New: generic fortran procedures with allocatable/pointer argument

[Bug fortran/51754] [OOP] ICE on valid with class arrays

[Bug fortran/51754] New: [OOP] ICE on valid with class arrays

[Bug fortran/51758] ICE with optional arguments of elemental procedures

[Bug fortran/51758] New: ICE with optional arguments of elemental procedures

[Bug fortran/51779] gcc 4.6.2 build fails on Mac OS X Lion w/Xcode 4.2, with gfortran erorr

[Bug fortran/51779] New: gcc 4.6.2 build fails on Mac OS X Lion w/Xcode 4.2, with gfortran erorr

[Bug fortran/51788] New: Unstable gfc_verify_binding_labels check for a binding label which collides with a global entity

[Bug fortran/51788] Unstable gfc_verify_binding_labels check for a binding label which collides with a global entity

[Bug fortran/51790] New: Broken ambiguity check when combining generic with nongeneric procedures

[Bug fortran/51791] [OOP] Failure to resolve typebound function call with base object in parentheses.

[Bug fortran/51791] New: [OOP] Failure to resolve typebound function call with base object in parentheses.

[Bug fortran/51792] [4.7 regression] fortran bootstrap failure: no previous prototype for 'resolve_typebound_function'

[Bug fortran/51792] New: [4.7 regression] fortran bootstrap failure: no previous prototype for 'resolve_typebound_function'

[Bug fortran/51800] [4.6/4.7 Regression] Error: Automatic array 'dummy' at (1) cannot have an initializer

[Bug fortran/51800] New: Error: Automatic array 'dummy' at (1) cannot have an initializer

[Bug fortran/51802] New: Duplicate mangling for OOP symbols

[Bug fortran/51808] Improve handling of ISO_C_BINDING binding names

[Bug fortran/51808] New: Improve handling of ISO_C_BINDING binding names

[Bug fortran/51809] [4.7 Regression][OOP] ICE (segfault) depending on USE statements order

[Bug fortran/51809] New: [4.7 Regression] ICE (use statements order)

[Bug fortran/51815] confusing substring syntax with array section for character coarray

[Bug fortran/51815] New: confusing substring syntax with array section for character coarray

[Bug fortran/51816] [4.7 Regression] Wrong error when use..., only : operator() twice

[Bug fortran/51816] New: [4.7 Regression] Wrong error when use..., only : operator() twice

[Bug fortran/51820] New: [doc] underscoring documentation incorrect

[Bug fortran/51825] Fortran runtime error: Cannot match namelist object name

[Bug fortran/51825] New: Fortran runtime error: Cannot match namelist object name

[Bug fortran/51828] libgfortran build warnings

[Bug fortran/51828] New: libgfortran build warnings

[Bug fortran/51842] fortran fails if ssize_t is 32-bit on 64-bit host

[Bug fortran/51842] New: fortran fails if ssize_t is 32-bit on 64-bit host

[Bug fortran/51864] [OOP] ALLOCATE with polymorphic array constructor as SOURCE=

[Bug fortran/51864] New: [OOP] ALLOCATE with polymorphic array constructor as SOURCE=

[Bug fortran/51869] New: Realloc on assignment wrongly assumes that MALLOC returnes '\0'-set memory

[Bug fortran/51869] Realloc on assignment wrongly assumes that MALLOC returnes '\0'-set memory

[Bug fortran/51870] [OOP] ICE with ALLOCATE and SOURCE-expr function returning BT_CLASS

[Bug fortran/51870] New: [OOP] ICE with ALLOCATE and SOURCE-expr function returning BT_CLASS

[Bug fortran/51899] [4.7 Regression] libgfortran's chmod.c fails to build on MinGW

[Bug fortran/51899] New: [4.7 Regression] libgfortran's chmod.c fails to build on MinGW

[Bug fortran/51904] [4.6/4.7 Regression] ICE on SIZE function evaluation

[Bug fortran/51904] New: Internal Compiler Error on size function evaluation

[Bug fortran/51913] [4.6/4.7 Regression][OOP] bug when submitting a class pointer to a subroutine

[Bug fortran/51913] New: bug when submitting a class pointer to a subroutine

[Bug fortran/51943] [OOP] ICE in conv_function_val

[Bug fortran/51943] New: the compile declares an internal error when compiling a fortran 2003 source file

[Bug fortran/51943] the compile declares an internal error when compiling a fortran 2003 source file

[Bug fortran/51944] file compiles properly on IBM xlf compiler and cary compiler

[Bug fortran/51944] New: file compiles properly on IBM xlf compiler and cary compiler

[Bug fortran/51945] New: Diagnose wrong default initialization of DTs in a DT declaration

[Bug fortran/51946] file compiles properly on IBM xlf compiler and cary compiler

[Bug fortran/51946] file compiles properly on IBM xlf compiler and Cray compiler

[Bug fortran/51946] New: file compiles properly on IBM xlf compiler and cary compiler

[Bug fortran/51947] [OOP]Polymorphic coarrays: Bogus errors for dummy arguments

[Bug fortran/51947] New: [OOP]Polymorphic coarrays: Bogus errors for dummy arguments

[Bug fortran/51948] [4.6/4.7 Regression][OOP] Rejects valid: Function result value in MOVE_ALLOC, nested in SELECT TYPE

[Bug fortran/51948] New: [OOP] Rejects valid: Polymorphic arguments in MOVE_ALLOC

[Bug fortran/51953] [F2008] Allow multiple allocate-objects in ALLOCATE with SOURCE=

[Bug fortran/51953] New: [F2008] Allow multiple allocate-objects in ALLOCATE with SOURCE=

[Bug fortran/51958] [4.7 Regression] -ffrontend-optimize generates wrong code

[Bug fortran/51958] New: [4.7 Regression] -ffrontend-optimize generates wrong code

[Bug fortran/51961] New: [OOP] ALLOCATE with MOLD= rejects if source-expr has a different rank

[Bug fortran/51966] [4.6/4.7 Regression] ICE in gfc_conv_array_constructor_expr

[Bug fortran/51966] internal compiler error

[Bug fortran/51966] New: internal compiler error

[Bug fortran/51970] [OOP] gimplification failed for polymorphic MOVE_ALLOC

[Bug fortran/51970] gimplification failed for an avatar of pr51948

[Bug fortran/51970] New: gimplification failed for an avatar of pr51948

[Bug fortran/51972] [OOP] ALLOCATE misses memset/calloc, causing segfault

[Bug fortran/51972] [OOP] Wrong code as _copy does not honor CLASS components

[Bug fortran/51972] New: [OOP] ALLOCATE misses memset/calloc, causing segfault

[Bug fortran/51976] [F2003] Support deferred-length character components of derived types (allocatable string length)

[Bug fortran/51976] New: [F2003] Support deferred-length character components of derived types (allocatable string length)

[Bug fortran/51977] [OOP] MOVE_ALLOC: Bogus "must have the same rank 0/1" for same-rank arrays

[Bug fortran/51977] New: [OOP] MOVE_ALLOC: Bogus "must have the same rank 0/1" for same-rank arrays

[Bug fortran/51991] New: Wrong error message with variables named "SAVE*"

[Bug fortran/51991] Wrong error message with variables named "SAVE*"

[Bug fortran/51993] Erroneous type component initialization leads to internal compiler error

[Bug fortran/51993] New: Erroneous type component initialization leads to internal compiler error

[Bug fortran/51995] [OOP] Polymorphic class fails at runtime

[Bug fortran/51995] New: Polymorphic class fails at runtime

[Bug fortran/51995] Polymorphic class fails at runtime

[Bug fortran/52010] [OOP] Intrinsic assignment of a CLASS to a TYPE

[Bug fortran/52010] Intrinsic assignment involving CLASS/TYPE

[Bug fortran/52010] New: Intrinsic assignment involving CLASS/TYPE

[Bug fortran/52012] [4.6/4.7 Regression] Wrong-code with realloc on assignment

[Bug fortran/52012] [4.6/4.7 Regression] Wrong-code with realloc on assignment and RESHAPE w/ ORDER=

[Bug fortran/52012] [4.6/4.7 Regression] Wrong-code with RESHAPE

[Bug fortran/52012] New: [4.6/4.7 Regression] Wrong-code with RESHAPE

[Bug fortran/52012] Wrong-code with realloc on assignment and RESHAPE w/ ORDER=

[Bug fortran/52013] [OOP] Polymorphism and coarrays: Support as class container

[Bug fortran/52013] New: [OOP] Polymorphism and coarrays: Support as class container

[Bug fortran/52016] [OOP] Polymorphism and elemental: missing diagnostic

[Bug fortran/52016] New: [OOP] Polymorphism and elemental: missing diagnostic

[Bug fortran/52021] FAIL: gfortran.dg/typebound_proc_25.f90 -O (internal compiler error)

[Bug fortran/52021] New: FAIL: gfortran.dg/typebound_proc_25.f90 -O (internal compiler error)

[Bug fortran/52022] [4.5/4.6/4.7 Regression] Wrong-code with procedures passed as actual argument

[Bug fortran/52022] New: [4.5/4.6/4.7 Regression] Wrong-code with procedures passed as actual argument

[Bug fortran/52024] [OOP] GENERIC operator cannot be resolved

[Bug fortran/52024] New: [OOP] GENERIC operator cannot be resolved

[Bug fortran/52029] [OOP] _copy should be PURE

[Bug fortran/52029] New: [OOP] _copy should be PURE

[Bug fortran/52038] [4.7 regression] fortran bootstrap failure: no previous prototype for 'symbol_as'

[Bug fortran/52038] New: [4.7 regression] fortran bootstrap failure: no previous prototype for 'symbol_as'

[Bug fortran/52044] [OOP] Invalid memory access with ALLOCATE, default initializer and polymorphic array components

[Bug fortran/52044] New: [OOP] Invalid memory access with ALLOCATE, default initializer and polymorphic array components

[Bug fortran/52052] New: [Coarray] Properly handle coarray components of derived types

[Bug fortran/52053] New: SUM intrinsic is wrong for very large arrays

[Bug fortran/52053] SUM intrinsic is wrong for very large arrays

[Bug fortran/52059] [4.7 Regression] ICE in gfc_conv_variable

[Bug fortran/52059] New: [4.7 Regression] ICE in gfc_conv_variable

[Bug fortran/52062] [4.6 regression] public generic name, specific functions of private types

[Bug fortran/52062] [4.6.2 regression] public generic name, specific functions of private types

[Bug fortran/52062] New: [4.6.2 regression] public generic name, specific functions of private types

[Bug fortran/52063] internal compiler error: in gfc_conv_variable, at fortran/trans-expr.c:1080

[Bug fortran/52063] New: internal compiler error: in gfc_conv_variable, at fortran/trans-expr.c:1080

[Bug fortran/52075] New: OpenMP atomic update failing if -fbounds-check specified

[Bug gcov-profile/26313] arm-elf-gcc with gcov option do not work

[Bug gcov-profile/38292] [4.4/4.5/4.6/4.7 Regression] corrupted profile info with -O[23] -fprofile-use

[Bug gcov-profile/49484] gcov crash if two(or more) forks happen at the same time

[Bug gcov-profile/50127] [4.7 regression] g++.dg/tree-prof/partition2.C FAILs on several targets

[Bug gcov-profile/51715] [4.7 Regression] FAIL: gcc.misc-tests/gcov-13.c execution test

[Bug gcov-profile/51717] [4.7 Regression] FAIL: gcc.misc-tests/gcov-14.c (test for excess errors)

[Bug gcov-profile/51807] Fail to generate .gcno file when use libtool to compile la library

[Bug gcov-profile/51807] New: Fail to generate .gcno file when use libtool to compile la library

[Bug gcov-profile/51975] ICE in gcc in convert_move, at expr.c:326 with fprofile-use when source changes from fprofile-generate

[Bug gcov-profile/51975] New: ICE in gcc in convert_move, at expr.c:326 with fprofile-use when source changes from fprofile-generate

[Bug go/47656] libgo.so has writable executable stack

[Bug go/48501] 64bit-out.go, select5-out.go, tmp.go compilation times out

[Bug go/50656] Several Go tests with unrecognized test line

[Bug go/51598] Missing dependency on net/net.lo causes bootstrap failure

[Bug go/51874] Many libgo testsuite failures on Solaris, IRIX

[Bug go/51874] New: Many libgo testsuite failures on Solaris, IRIX

[Bug inline-asm/20468] LABEL already defined in inline-asm

[Bug inline-asm/51863] invlpg with -masm=intel generates memory operand size error in assembly stage

[Bug inline-asm/51863] New: invlpg with -masm=intel generates memory operand size error in assembly stage

[Bug inline-asm/7916] [3.2/3.3/3.4 regression] ICE in instantiate_virtual_register_1

[Bug java/16200] gcj generates dependencies on the full contents of the extensions directory

[Bug java/18433] gcj compiling resources from a file list doesn't work (ICE)

[Bug java/19325] Invoking gcj -C on a list of source files consumes insane amount of memory

[Bug java/20735] gcj writes bogus source filenames for inner classes read from .class files

[Bug java/21016] Indirect dispatch code generated when using -findirect-dispatch has wrong line numbers

[Bug java/21855] array bounds checking elimination

[Bug java/24698] [4.4/4.5/4.6/4.7 regression] SIGABRT when using ResourceBundle.getBundle with a nonexistant key

[Bug java/41356] Circular dependencies between jars cause errors: jars order shouldn't matter

[Bug java/47456] internal compiler error: Segmentation fault while using jna

[Bug java/48515] [4.6] GCJ fails to compile jni.cc because of reflection errors on i686-w64-mingw32 target

[Bug libfortran/36755] Avoid fork/exec in chmod intrinsic

[Bug libfortran/50105] [4.6/4.7 Regression] I/O with g6.5 - wrong number of "**" shown

[Bug libfortran/51803] gfortran getcwd at startup

[Bug libfortran/51803] New: gfortran getcwd at startup

[Bug libfortran/51899] [4.7 Regression] libgfortran's chmod.c fails to build on MinGW

[Bug libgcj/19003] Potential problems in libjava system calls with gc-boehm

[Bug libgcj/20223] libjava testsuite does not fully support multilibs

[Bug libgcj/21217] "Argument list too long" when guilding gcj

[Bug libgcj/21267] [win32] Non-English File Names processed incorrectly

[Bug libgcj/21524] Cancelling a TimerTask puts Timer binary heap in inconsistent state

[Bug libgcj/21754] ./libtool: /mingw/bin/ar: Invalid argument

[Bug libgcj/22341] Interix: gcj out of virtual mem during libgcj make

[Bug libgcj/22344] Interix: "copying ..." when making libgcj takes too long

[Bug libgcj/23216] IncompatibleClassChangeError when Using Java-Gnome

[Bug libgcj/23686] path embbeded using -rpath is ignored when handling System.loadLibrary()

[Bug libgcj/23800] Exception in thread "main" java.lang.NullPointerException at java.lang.Object.getClass()

[Bug libgcj/23856] Modification Time Incorrectly Set From Extension Entry

[Bug libgcj/50057] [4.7 regression] misalignment of java_exception_header resulted in throwable to be null

[Bug libgcj/50057] [4.7 regression] SIGSEGV in natObject.cc:58

[Bug libgcj/50831] [4.7 regression] __gcc_register_frame must throw error when failed to load dll

[Bug libgcj/50895] Build failure in jni.cc

[Bug libgcj/51498] [4.7 regression] temporary hack to make dejagnu work in libjava

[Bug libgcj/51498] make dejagnu work in libjava testsuite with cross-build

[Bug libgcj/51500] [4.7 regression] 106 unexpected libjava testsuite failures with mingw32

[Bug libgcj/51901] [4.7 regression] java.security.Security.getProperty throws ExceptionInInitializerError

[Bug libgcj/51901] java.security.Security.getProperty throws ExceptionInInitializerError

[Bug libgcj/51901] New: [4.7 regression] java.security.Security.getProperty throws ExceptionInInitializerError

[Bug libgomp/39217] g++4.3.3 OpenMP (aka omp) for loop hangs

[Bug libgomp/39399] libgomp testsuite failures due to lack of linkind with libpthread

[Bug libgomp/43706] scheduling two threads on one core leads to starvation

[Bug libitm/51173] XFAIL: libitm.c++/static_ctor.C

[Bug libitm/51822] libitm.c++/eh-1.C FAILs

[Bug libitm/51830] FAIL: libitm.c/mem(cpy|set)-1.c execution test

[Bug libitm/51855] improve calculation of stack bottom in libitm's undolog

[Bug libitm/51855] New: improve calculation of stack bottom in libitm's undolog

[Bug libitm/52042] libitm.c/clone-1.c (all darwin) and libitm.c/stackundo.c (darwin 11) execution tests fail with -fpie

[Bug libitm/52042] libitm.c/clone-1.c and libitm.c/stackundo.c execution tests are not pie compatible

[Bug libitm/52042] New: libitm.c/clone-1.c and libitm.c/stackundo.c execution tests are not pie compatible

[Bug libmudflap/20696] all libmudflap tests fail on mips{,el}-linux

[Bug libmudflap/30994] App using Qt lib aborts immediately during startup

[Bug libmudflap/40778] [4.5/4.6 Regression] Mudflap instrumentation missing in cloned function.

[Bug libmudflap/40778] [4.5/4.6/4.7 Regression] Mudflap instrumentation missing in cloned function.

[Bug libmudflap/49843] 64-bit libmudflap.c++/pass55-frag.cxx FAILs at -O

[Bug libmudflap/51858] New: Some malloc'd inside libc is not being tracked

[Bug libobjc/23215] libobjc doesn't work on windows.

[Bug libobjc/51749] Including <algorithm> pollute global namespace

[Bug libobjc/51749] Including <algorithm> pollutes global namespace

[Bug libobjc/51891] class_copyIvarList crashes on empty ivars

[Bug libobjc/51891] New: class_copyIvarList crashes on empty ivars

[Bug libobjc/51892] +initialize is not being called when calling class method via new runtime

[Bug libobjc/51892] New: +initialize is not being called when calling class method via new runtime

[Bug libstdc++/19212] /tmp/ccbY7YyA.s:6435: Error: attempt to get value of unresolved symbol `__s:V151'

[Bug libstdc++/21405] Can't give symbol versions to templates

[Bug libstdc++/21609] array_allocator vs rebind & templated constructor

[Bug libstdc++/33394] Add test case for Thread race segfault in std::string::append with -O and -s

[Bug libstdc++/39796] cin/cout/cerr constructors should run at high priority when possible

[Bug libstdc++/40278] -std=c++0x is error, but -std=gnu++0x is OK!

[Bug libstdc++/48340] Several wchar_t tests FAIL on IRIX 6.5

[Bug libstdc++/49204] [C++0x] remaining issues in <future>

[Bug libstdc++/49386] #undef min/max is dependent on order if #include

[Bug libstdc++/50196] [C++0x] std::thread not available under macos

[Bug libstdc++/50982] AIX libstdc++ GTHREADS incompatibility

[Bug libstdc++/51018] Test failures on NetBSD

[Bug libstdc++/51296] Several 30_threads tests FAIL on Tru64 UNIX

[Bug libstdc++/51504] Data race hunting instructions in manual do not work

[Bug libstdc++/51636] Thread-safeness of new and delete operators

[Bug libstdc++/51649] pretty printers don't handle std::__7:: namespace

[Bug libstdc++/51673] undefined references / libstdc++-7.dll

[Bug libstdc++/51749] Including <algorithm> pollute global namespace

[Bug libstdc++/51749] Including <algorithm> pollutes global namespace

[Bug libstdc++/51749] New: Including <algorithm> pollute global namespace

[Bug libstdc++/51772] --enable-clocale=generic makes unsafe assumptions about ctype_base::mask

[Bug libstdc++/51772] New: --enable-clocale=generic makes unsafe assumptions about ctype_base::mask

[Bug libstdc++/51785] gets not anymore declared

[Bug libstdc++/51795] linear_congruential_engine doesn't work correctly

[Bug libstdc++/51795] New: linear_congruential_engine doesn't work correctly

[Bug libstdc++/51798] [4.7 regression] libstdc++ atomicity performance regression due to __sync_fetch_and_add

[Bug libstdc++/51798] New: [4.7 regression] libstdc++ atomicity performance regression due to __sync_fetch_and_add

[Bug libstdc++/51811] New: [C++0x] Incorrect incrementation/decrementation of atomic pointers

[Bug libstdc++/51813] [4.7 Regression] -fvisibility=hidden causes std::codecvt members to be undefined

[Bug libstdc++/51823] [DR 198] reverse iterator returns uninitialized values

[Bug libstdc++/51823] New: reverse iterator instantiated with POD type returns uninitialized values + work around

[Bug libstdc++/51823] reverse iterator instantiated with POD type returns uninitialized values + work around

[Bug libstdc++/51845] [4.7 regression] 23_containers/unordered_multimap/erase/24061-multimap.cc segfault

[Bug libstdc++/51845] New: [4.6 regression] 23_containers/unordered_multimap/erase/24061-multimap.cc segfault

[Bug libstdc++/51850] debug mode for std::array and tr1::array

[Bug libstdc++/51850] New: debug mode for std::array and tr1::array

[Bug libstdc++/51866] [c++0x][4.7 Regression] unordered_multiset compares moved-out values

[Bug libstdc++/51866] [c++0x][4.7 Regression] unordered_set compares moved-out values

[Bug libstdc++/51866] New: [c++0x][4.7 Regression] unordered_set compares moved-out values

[Bug libstdc++/51881] istream_iterator copy leads to incorrect value read

[Bug libstdc++/51881] New: istream_iterator copy leads to incorrect value read

[Bug libstdc++/51906] New: thread lock test failures on darwin11 under Xcode 4.2

[Bug libstdc++/51906] thread lock test failures on darwin11 under Xcode 4.2

[Bug libstdc++/51932] Cannot use std::errno with <cerrno>

[Bug libstdc++/51932] New: Cannot use std::errno with <cerrno>

[Bug libstdc++/51956] [patch] improve shared_ptr and weak_ptr pretty-printers for gdb

[Bug libstdc++/51956] New: [patch] improve shared_ptr and weak_ptr pretty-printers for gdb

[Bug libstdc++/51960] Missing move-assignment operator in raw_storage_iterator

[Bug libstdc++/51960] New: Missing move-assignment operator in raw_storage_iterator

[Bug libstdc++/51965] New: Redundant move constructions in heap algorithms

[Bug libstdc++/51965] Redundant move constructions in heap algorithms

[Bug libstdc++/51967] FAIL: libstdc++-prettyprinters/48362.cc

[Bug libstdc++/51967] New: FAIL: libstdc++-prettyprinters/48362.cc

[Bug libstdc++/51981] Missing uninitialized_move() implementation?

[Bug libstdc++/51981] New: Missing uninitialized_move() implementation?

[Bug libstdc++/52002] [4.7 Regression] Bootstrap fails at revision 183520 in stage1

[Bug libstdc++/52002] New: [4.7 Regression] Bootstrap fails at revision 183520 in stage1

[Bug libstdc++/52015] New: std::to_string does not work under MinGW

[Bug libstdc++/52015] std::to_string does not work under MinGW

[Bug libstdc++/52040] New: TR1 is not accessible using compiler flags alone

[Bug libstdc++/52040] TR1 is not accessible using compiler flags alone

[Bug libstdc++/52068] New: libc++98.a and libc++11.a are installed

[Bug lto/41576] LTO complains about mismatches in common sections

[Bug lto/44378] lto1: internal compiler error: in cgraph_mark_functions_to_output, at cgraphunit.c:1168

[Bug lto/44390] LTO strips out symbols that are actually needed

[Bug lto/44398] lto1: internal compiler error: Segmentation fault

[Bug lto/44965] lto option code breaks file format with each added option

[Bug lto/45089] -Os -g -fwhopr dwarf2out ICE

[Bug lto/47891] GCC 4.6/4.7 LTO not worked reliable on Windows target

[Bug lto/49677] GCC 4.6.0 LTO files not compatible with GCC 4.6.1

[Bug lto/50490] ICE when compiling libglib2.0 with LTO, tree code 'optimization_node' is not supported in LTO streams

[Bug lto/50616] lto1.exe: internal compiler error: invalid resolution in the resolution file

[Bug lto/50679] [meta-bug] Linux kernel LTO tracking bug

[Bug lto/51224] ICE with local struct and -flto

[Bug lto/51280] ICE when lto1 does not have -fgnu-tm and object file uses TM

[Bug lto/51635] LTO should not merge (type) decls with different locations

[Bug lto/51642] Weak variable reference triggers ICE with -flto option

[Bug lto/51663] LTO does not reclaim comdat-local statics

[Bug lto/51698] [trans-mem] TM runtime and application with LTO

[Bug lto/51744] Erroneous warning: memset used with constant zero length parameter

[Bug lto/51744] New: Erroneous warning: memset used with constant zero length parameter

[Bug lto/51765] New: Testsuite ICEs with -flto

[Bug lto/51765] Testsuite ICEs with -flto

[Bug lto/51774] [4.7 Regression] FAIL: gcc.dg/lto/trans-mem-* c_lto_trans-mem-1_0.o-c_lto_trans-mem-1_1.o link, -flto -fgnu-tm

[Bug lto/51806] -flto ignores -Werror

[Bug lto/51806] New: -flto ignores -Werror

[Bug lto/51859] Linker option effects not reflected in symbol resolution file

[Bug lto/51859] New: wrapped symbols (wrap linker option) do not link

[Bug lto/51887] New: wrapped function with LTO - multiple prevailing defs

[Bug lto/51887] wrapped function with LTO - multiple prevailing defs

[Bug lto/51916] FAIL: gcc.dg/lto/trans-mem-3 c_lto_trans-mem-3_0.o-c_lto_trans-mem-3_1.o link, -flto (internal compiler error)

[Bug lto/51916] New: FAIL: gcc.dg/lto/trans-mem-3 c_lto_trans-mem-3_0.o-c_lto_trans-mem-3_1.o link, -flto (internal compiler error)

[Bug lto/51992] New: internal compiler error: tree code âtarget_exprâ is not supported in LTO streams

[Bug lto/51997] LTO does not inline available builtin implementations

[Bug lto/51997] New: LTO does not inline available builtin implementations

[Bug middle-end/14842] Another way of expanding a switch statement

[Bug middle-end/16458] PowerPC - redundant compare

[Bug middle-end/19774] VLA's vs SjLj EH unwind

[Bug middle-end/20675] Small targets without 64 bit long long support are can't bootstrap GCC.

[Bug middle-end/21067] Excessive optimization of floating point expression

[Bug middle-end/21111] IA-64 NaT consumption faults due to uninitialized register reads

[Bug middle-end/21161] "clobbered by longjmp" warning ignores the data flow

[Bug middle-end/21305] flag_delete_null_pointer_checks is target specific

[Bug middle-end/21374] [4.4/4.5/4.6/4.7 regression] ICE with nested function

[Bug middle-end/22141] [4.4/4.5/4.6/4.7 Regression] Missing optimization when storing structures

[Bug middle-end/22485] pointer +- integer is never NULL

[Bug middle-end/23756] Missed optimization for PIC code with internal visibility

[Bug middle-end/24201] Potential problems with HOT_TEXT_SECTION_NAME

[Bug middle-end/24332] asm label declaration may be missing aliasing info

[Bug middle-end/24573] g++: Internal error message while building openh323

[Bug middle-end/24944] Size of type not multiple of its alignment.

[Bug middle-end/25530] (unsigned / 2)*2 is not changed into unsigned &~1

[Bug middle-end/25622] undefined reference to `_gfortran_st_set_nml_var_dim'

[Bug middle-end/28685] Multiple comparisons are not simplified

[Bug middle-end/28779] internal compiler error: in cgraph_estimate_size_after_inlining, at ipa-inline.c:106

[Bug middle-end/28831] [4.4/4.5/4.6/4.7 Regression] Aggregate copy not elided when using a return value as a pass-by-value parameter

[Bug middle-end/31192] functions with __attribute__((externally_visible)) becomes static if "-O -fwhole-program"

[Bug middle-end/32003] Undocumened -fdump-tree options

[Bug middle-end/323] optimized code gives strange floating point results

[Bug middle-end/32412] Passing struct as parameter breaks SRA for stack-allocated struct inside called function

[Bug middle-end/33966] Revision 129625 caused 11% slowdown on 200.sixtrack

[Bug middle-end/34803] wrong code for dereferencing type-punned pointer

[Bug middle-end/35260] ICE in ipa-type-escape.c with -fipa-struct-reorg -fipa-type-escape

[Bug middle-end/35676] internal compiler error: in expand_mult, at expmed.c:3225

[Bug middle-end/36687] g++ can not compile dbcheck.cpp of MythTV

[Bug middle-end/37107] Incorrect code generated after function inlining

[Bug middle-end/38219] gcc.dg/tree-ssa/vrp47.c fails on powerpc

[Bug middle-end/38671] [4.4/4.5/4.6/4.7 Regression] selecting one IV instead of three

[Bug middle-end/38777] gcc optimize flag causes different program behavior

[Bug middle-end/38944] internal compiler error: Segmentation fault

[Bug middle-end/38999] [4.4/4.5/4.6 Regression] Extra overflow warning in 32-bit HWI compiler

[Bug middle-end/38999] [4.4/4.5/4.6/4.7 Regression] Extra overflow warning in 32-bit HWI compiler

[Bug middle-end/39246] FAIL: gcc.dg/uninit-13.c

[Bug middle-end/39275] -funroll-loop fails

[Bug middle-end/39456] Functions/variables of a file in different named sections

[Bug middle-end/39809] emit-rtl.c:608(-> gen_rtx_REG): warning: array subscript is above array bounds

[Bug middle-end/39820] errors while compiling libc and the kernel

[Bug middle-end/39838] [4.4/4.5/4.6/4.7 regression] unoptimal code for two simple loops

[Bug middle-end/40060] [4.5/4.6/4.7 Regression] casts loose alignment info

[Bug middle-end/40135] using alias-set zero for union accesses necessary because of RTL alias oracle

[Bug middle-end/40379] Extremely long compiling time of gcc optimization mode

[Bug middle-end/40386] wrong code generation for several SPEC CPU2000 benchmarks (lucas, mgrid, face, applu, apsi) with -O1 -fno-ira-share-spill-slots

[Bug middle-end/41256] ICE with -ftree-parallelize-loops=2 in locator_location at cfglayout.c:517

[Bug middle-end/41895] _Complex return type changes line numbers in diagnostics

[Bug middle-end/42688] gcc 4.3.3 with -O2 thinks a often non-zero expression is always zero

[Bug middle-end/42961] [4.5/4.6 regression] IRA register preferencing bug

[Bug middle-end/44440] [4.6/4.7 regression] ira_initialization and buitins construction taking too much of startup time

[Bug middle-end/44581] [4.5/4.6/4.7 Regression] internal compiler error: in simplify_subreg

[Bug middle-end/44765] gen_rtx_REG can make out-of-bounds access for INVALID_REGNUM

[Bug middle-end/44777] [4.4/4.5/4.6 Regression] ICE: SIGSEGV with -fprofile-use in gcc.c-torture/execute/comp-goto-2.c

[Bug middle-end/44777] [4.4/4.5/4.6/4.7 Regression] ICE: SIGSEGV with -fprofile-use in gcc.c-torture/execute/comp-goto-2.c

[Bug middle-end/45273] [4.4/4.5/4.6/4.7 Regression] The compiler depends on the host double (-fprofile-corection only)

[Bug middle-end/45416] [4.5/4.6 Regression] Code size regression from 4.4 for ARM

[Bug middle-end/45472] [4.5/4.6/4.7 Regression] ICE: in move_op_ascend, at sel-sched.c:6124 with -fselective-scheduling2

[Bug middle-end/45644] [4.6 Regression] 450.soplex in SPEC CPU 2006 is miscompiled

[Bug middle-end/47249] [4.4/4.5/4.6/4.7 Regression] ICE in common_handle_option, at opts.c:1695

[Bug middle-end/47496] HAS_DECL_ASSEMBLER_NAME_P and DECL_ASSEMBLER_NAME has some incosistency

[Bug middle-end/48254] documentation minor

[Bug middle-end/48600] [4.6/4.7 Regression] ICE when using cold attribute

[Bug middle-end/48660] [4.5/4.6 Regression] ARM ICE in expand_expr_real_1

[Bug middle-end/48668] [4.6 regression] COMDAT Group signature not emitted in group

[Bug middle-end/48833] gcc.c-torture/execute/pr34415.c FAILs with -flto -fipa-cp-clone -fno-merge-constants

[Bug middle-end/49801] df_live_verify_transfer_functions fails with to use of CC_REGNUM and checking enabled in rx backend

[Bug middle-end/50040] [4.5/4.6 Regression] missed warning: âx.yâ is used uninitialized in this function

[Bug middle-end/50189] [4.5 Regression] Wrong code error in -O2 [-fstrict-enums] compile, target independent

[Bug middle-end/50199] [4.7 Regression] wrong code with -flto -fno-merge-constants

[Bug middle-end/50200] ICE: SIGSEGV in df_insn_refs_collect (df-scan.c:3405)

[Bug middle-end/50211] ICE: verify_flow_info: Incorrect fallthru 11->12 with -funroll-all-loops --param case-values-threshold=1

[Bug middle-end/50283] [4.7 Regression] FAIL: g++.dg/eh/simd-1.C execution test

[Bug middle-end/50325] [4.7 Regression] 76 new fails with rev. 177691

[Bug middle-end/50384] Returning std::array is not optimal

[Bug middle-end/50643] Suppress cc1: warnings being treated as errors

[Bug middle-end/50913] [4.7 Regression] ICE in scan_tree_for_params_right_scev, at graphite-sese-to-poly.c:633 compiling libgfortran with -floop-interchange -m32

[Bug middle-end/50966] [4.4/4.5/4.6 Regression] Missing 'is used uninitialized' warning (struct pointer dereference)

[Bug middle-end/50971] Only one loop detected when there should be two

[Bug middle-end/51017] GCC 4.6 performance regression (vs. 4.4/4.5)

[Bug middle-end/51019] unclear documentation on -fomit-frame-pointer default for -Os and different platforms

[Bug middle-end/51212] ICE: verify_flow_info failed: BB 3 can not throw but has an EH edge with -fgnu-tm -fnon-call-exceptions and transaction_callable

[Bug middle-end/51252] FAIL: c-c++-common/tm/freq.c (internal compiler error)

[Bug middle-end/51389] GCC uses up to 75GB of virtual memory

[Bug middle-end/51442] volatile bitfields broken on arm

[Bug middle-end/51472] ICE: verify_gimple failed: invalid rhs for gimple memory store with -fgnu-tm --param tm-max-aggregate-size=32

[Bug middle-end/51516] [trans-mem] problem with TM clone aliases

[Bug middle-end/51696] [trans-mem] unsafe indirect function call in struct not properly displayed

[Bug middle-end/51728] [4.7 Regression]: libstdc++ 25_algorithms/count_if/1.cc, 25_algorithms/partition_point/1.cc, 25_algorithms/search/1.cc SEGV ICE

[Bug middle-end/51750] [4.7 Regression] FAIL: 25_algorithms/heap/moveable*.cc execution test

[Bug middle-end/51750] New: [4.7 Regression] FAIL: 25_algorithms/heap/moveable*.cc execution test

[Bug middle-end/51752] New: trans-mem: publication safety violated

[Bug middle-end/51752] trans-mem: publication safety violated

[Bug middle-end/51761] [4.7 Regression] ICE in verify_gimple_stmt, at tree-cfg.c:4241

[Bug middle-end/51761] New: [4.7 Regression] ICE in verify_gimple_stmt, at tree-cfg.c:4241

[Bug middle-end/51764] mudflap does not work with LTO

[Bug middle-end/51764] New: mudflap does not work with LTO

[Bug middle-end/51766] [4.7 regression] sync_fetch_and_xxx atomicity

[Bug middle-end/51766] New: [4.7 regression] sync_fetch_and_xxx atomicity

[Bug middle-end/51768] [4.5/4.6 Regression] ICE with invalid asm goto

[Bug middle-end/51768] [4.5/4.6/4.7 Regression] ICE with invalid asm goto

[Bug middle-end/51768] New: [4.5/4.6/4.7 Regression] ICE with invalid asm goto

[Bug middle-end/51769] bootstrap fails when using -O2 -funswitch-loops -floop-flatten

[Bug middle-end/51769] New: bootstrap fails when using -O2 -funswitch-loops -floop-flatten

[Bug middle-end/51770] dump gimple lineno when dumping bb

[Bug middle-end/51770] New: dump gimple lineno when dumping bb

[Bug middle-end/51778] New: ICE during bootstrap when adding -ftree-loop-if-convert-stores to boo

[Bug middle-end/51784] [4.7 Regression] FAIL: gcc.dg/tree-prof/pr44777.c execution, -fprofile-generate -D_PROFILE_GENERATE

[Bug middle-end/51784] New: [4.7 Regression] FAIL: gcc.dg/tree-prof/pr44777.c execution, -fprofile-generate -D_PROFILE_GENERATE

[Bug middle-end/51794] New: ICE (segfault) with -O -fmodulo-sched

[Bug middle-end/51837] New: Use of result from 64*64->128 bit multiply via __uint128_t not optimized

[Bug middle-end/51848] GCC is not able to vectorize when a constant value is also added to the sum of array expression inside a loop.

[Bug middle-end/51848] New: GCC is not able to vectorize when a constant value is also added to the sum of array expression inside a loop.

[Bug middle-end/51867] GCC generates inconsistent code for same sources calling builtin calls, like sqrtf

[Bug middle-end/51867] New: GCC generates inconsistent code for same sources calling builtin calls, like sqrtf

[Bug middle-end/51871] [4.7 Regression] FAIL: gcc.c-torture/execute/20010122-1.c execution

[Bug middle-end/51871] New: [4.7 Regression] FAIL: gcc.c-torture/execute/20010122-1.c execution

[Bug middle-end/51893] New: Wrong subword index computation in store_bit_field_1 on BIG_ENDIAN targets

[Bug middle-end/51893] Wrong subword index computation in store_bit_field_1 on BIG_ENDIAN targets

[Bug middle-end/51895] [4.7 Regression] ICE in simplify_subreg

[Bug middle-end/51895] New: [4.7 Regression] ICE in simplify_subreg

[Bug middle-end/51926] libstdc++ iterator store bigendian bitfield related

[Bug middle-end/51926] New: libstdc++ iterator store bigendian bitfield related

[Bug middle-end/51928] New: ICE: SIGSEGV in lookup_fnfields_idx_nolazy (search.c:1384) with -fgnu-tm on invalid code

[Bug middle-end/51929] New: ICE: verify_cgraph_node failed with -O2 -fno-guess-branch-probability -fipa-cp-clone --param ipa-cp-eval-threshold=0 --param max-inline-insns-single=1

[Bug middle-end/51939] [4.7 Regression] ICE: in compute_affine_dependence, at tree-data-ref.c:4103 with -fcheck-data-deps

[Bug middle-end/51939] New: ICE: in compute_affine_dependence, at tree-data-ref.c:4103

[Bug middle-end/51949] [4.7 Regression] expand_call: seg fault

[Bug middle-end/51949] [4.7 Regression] expand_call: seg fault caused by IPA split

[Bug middle-end/51959] [4.7 Regression] ICE in set_mem_alias_set, at emit-rtl.c:1884

[Bug middle-end/51982] New: Shrink-wrapping opportunity

[Bug middle-end/51982] Shrink-wrapping opportunity

[Bug middle-end/51984] ICE: SIGSEGV with -O2 -fgraphite-identity

[Bug middle-end/51984] New: ICE: SIGSEGV with -O2 -fgraphite-identity

[Bug middle-end/51986] [4.7 regression] uninitialized variable warning regression prevents bootstrap

[Bug middle-end/51986] New: [4.7 regression] uninitialized variable warning regression prevents bootstrap

[Bug middle-end/51994] [4.6/4.7 Regression] git-1.7.8.3 miscompiled due to negative bitpos from get_inner_reference

[Bug middle-end/51998] compiler hangs on self-recursive alias attribute

[Bug middle-end/51998] New: compiler hangs on self-recursive alias attribute

[Bug middle-end/52027] [4.7 Regression] ICE: SIGSEGV in set_cur_line_info_table (dwarf2out.c:20428) with -O -freorder-blocks-and-partition -fno-reorder-functions -fprofile-use

[Bug middle-end/52027] New: [4.7 Regression] ICE: SIGSEGV in set_cur_line_info_table (dwarf2out.c:20428) with -O -freorder-blocks-and-partition -fno-reorder-functions -fprofile-use

[Bug middle-end/52045] [4.7 Regression] ICE: in execute_todo, at passes.c:1748 with -O3 -ftracer -fno-tree-ccp -fno-tree-copy-prop -fno-tree-dce and stpcpy_chk()

[Bug middle-end/52045] New: [4.7 Regression] ICE: in execute_todo, at passes.c:1748 with -O3 -ftracer -fno-tree-ccp -fno-tree-copy-prop -fno-tree-dce and stpcpy_chk()

[Bug middle-end/52046] [4.7 Regression] ICE: verify_gimple failed: invalid operands in ternary operation with -O -fexceptions -fnon-call-exceptions -ftree-vectorize

[Bug middle-end/52046] New: [4.7 Regression] ICE: verify_gimple failed: invalid operands in ternary operation with -O -fexceptions -fnon-call-exceptions -ftree-vectorize

[Bug middle-end/52047] New: [trans-mem] ICE: SIGSEGV in execute_tm_mark (trans-mem.c:2270) with -O -fgnu-tm -fprefetch-loop-arrays

[Bug middle-end/52048] [4.7 Regression] -fcompare-debug failure with -O2 -fcompare-debug -fnon-call-exceptions -fno-tree-dominator-opts

[Bug middle-end/52048] New: [4.7 Regression] -fcompare-debug failure with -O2 -fcompare-debug -fnon-call-exceptions -fno-tree-dominator-opts

[Bug middle-end/52056] Code optimization sensitive to trivial changes

[Bug middle-end/52066] IRA and reginfo initialization too expensive

[Bug middle-end/52066] New: IRA and reginfo initialization too expensive

[Bug middle-end/8081] ICE with variably sized types and nested functions

[Bug other/19815] Documentation change - GCC Internals MODES_TIEABLE_P

[Bug other/22368] [meta-bug] mis-match types in GCC

[Bug other/26692] Build configure misses valid ld in hidden test

[Bug other/27043] building Ada rts does not find 'as'

[Bug other/31352] gcc -v --help doesn't notice when front-ends documentation differs for same option

[Bug other/31778] genattrtab.c doesn't record filename

[Bug other/32263] Document the required versions of glibc and binutils

[Bug other/34687] as crashed

[Bug other/40708] libpthread not linked

[Bug other/42792] cc1-dummy link fails with missing tree_ and rtl_ functions

[Bug other/43752] main manual should mention more explicitly other manuals

[Bug other/44476] tclStrToD.c takes very long to compile (forever?)

[Bug other/46489] tree optimizer and frontend files use target macros

[Bug other/46542] GCC 4.7 pending patches meta-bug

[Bug other/47733] psignal (int, const? char*) in libiberty/strsignal.h

[Bug other/47869] fatal error: build/gencondmd.c: No such file or directory

[Bug other/50639] -flto=jobserver broken on large LTO build

[Bug other/50925] [4.7 Regression][avr] ICE at spill_failure, at reload1.c:2118

[Bug other/51011] FAIL: gcc.dg/atomic-generic.c (test for excess errors)

[Bug other/51124] libitm failures

[Bug other/51163] gcc.dg/tm/alias-1.c failure

[Bug other/51164] gcc.dg/tm/alias-2.c failure

[Bug other/51165] gcc.dg/tm/memopt-3.c failure

[Bug other/51166] gcc.dg/tm/memopt-4.c failure

[Bug other/51167] gcc.dg/tm/memopt-5.c failure

[Bug other/51168] gcc.dg/tm/memopt-7.c failure

[Bug other/51171] XFAIL: libitm.c/reentrant.c execution test

[Bug other/51173] XFAIL: libitm.c++/static_ctor.C

[Bug other/51678] 'make pdf' is broken in libiberty

[Bug other/51679] spurious parenthesis for -fassociative-math in manual and man page

[Bug other/51732] New: typo in man gcc: "runt-time check"

[Bug other/51822] New: libitm.c++/eh-1.C FAILs

[Bug other/51830] New: FAIL: libitm.c/mem(cpy|set)-1.c execution test

[Bug other/51937] [meta-bug] GCC 4.8 pending patches

[Bug other/51937] New: [meta-bug] GCC 4.8 pending patches

[Bug pch/39618] trunk revision 145459 - The configure of libstdc++-v3 hangs while checking for PCH support

[Bug pch/51722] [4.7 Regression] Options "-g3" or "-ggdb3" or "-g3 -gdwarf-2" and other "-g..level3" - internal compiler error

[Bug preprocessor/21521] -finput-charset -save-temps converts characters twice

[Bug preprocessor/28435] -MMD vs not found system header (included from a system header)

[Bug preprocessor/33919] __BASE_FILE__ does not expand correctly when included from the command line

[Bug preprocessor/37215] ICE on 'gcc -E -dM -fpreprocessed - < /dev/null'

[Bug preprocessor/46784] Internal compiler error with cairo In function `_cairo_bo_sweep_line_compare_edges'

[Bug preprocessor/47499] cpp will not process stdio.h

[Bug preprocessor/47549] -save-temps and -finput-charset= causing 'cc1.exe: error: failure to convert gbk to UTF-8'

[Bug preprocessor/47823] #pragma once is documented in a weird spot

[Bug preprocessor/51067] cpp.texi Line Control node not mentioning #, trailing integers

[Bug preprocessor/51745] New: Strange symbol appears when using commandline definition without "="

[Bug preprocessor/51745] Strange symbol appears when using commandline definition without "="

[Bug preprocessor/51776] fixincludes hacks around a C++ deficiency

[Bug preprocessor/51776] New: fixincludes hacks around a C++ deficiency

[Bug regression/51728] New: [4.7 Regression]: libstdc++ 25_algorithms/count_if/1.cc, 25_algorithms/partition_point/1.cc, 25_algorithms/search/1.cc SEGV ICE

[Bug regression/51963] FAIL: g++.dg/torture/pr51344.C

[Bug regression/51963] New: FAIL: g++.dg/torture/pr51344.C

[Bug regression/51996] New: ICE in extract_insn gcc.dg/pr48335-5.c

[Bug regression/52020] ICE in immed_double_const, at emit-rtl.c:544

[Bug regression/52020] New: ICE in immed_double_const, at emit-rtl.c:544

[Bug rtl-optimization/20367] alias analysis doesn't take into account that variables that haven't their address taken can't alias arbitrary MEMs

[Bug rtl-optimization/21991] missed-optimization setcc boolean compare

[Bug rtl-optimization/23168] [OOM] GCC 4.0.1 OOM's while compiling VBA (works with 3.4.x)

[Bug rtl-optimization/23650] Scheduler does not handle zero_extract correctly

[Bug rtl-optimization/23810] missed 64-bit shift+mask optimizations on 32-bit arch

[Bug rtl-optimization/24194] emit_input_reload_insns secondary reload handling is unsafe

[Bug rtl-optimization/31889] compiler misses opportunity to combine multiple identical function return paths

[Bug rtl-optimization/32283] [4.4/4.5/4.6 Regression] Missed induction variable optimization

[Bug rtl-optimization/34283] Non-optimal reload register used

[Bug rtl-optimization/36758] [4.4/4.5/4.6 Regression] addition moved out of the loop when used with an argument

[Bug rtl-optimization/37451] Extra addition for doloop in some cases

[Bug rtl-optimization/37782] [4.4 regression] Stage2 ada compiler miscompiled

[Bug rtl-optimization/38644] [4.4/4.5/4.6 Regression] Optimization flag -O1 -fschedule-insns2 causes wrong code

[Bug rtl-optimization/40761] IRA memory hog for insanely nested loops

[Bug rtl-optimization/40987] Wrong optimization with if-conversion

[Bug rtl-optimization/42502] [4.4/4.5 Regression] Poor register allocation in very simple code

[Bug rtl-optimization/44174] [4.4/4.5/4.6 Regression] can't find a register in class 'CLOBBERED_REGS' while reloading 'asm'

[Bug rtl-optimization/45434] x86 missed optimization: use high register (ah, bh, ch, dh) when available to make comparisons

[Bug rtl-optimization/45678] [4.4/4.5 Regression] crash on vector code with -m32 -msse

[Bug rtl-optimization/47477] [4.6/4.7/4.8 regression] Sub-optimal mov at end of method

[Bug rtl-optimization/47698] CMOV accessing volatile memory with read side effect

[Bug rtl-optimization/48133] [4.5/4.6/4.7 Regression] ICE: in get_loop_body, at cfgloop.c:831 with -O -funroll-loops -fthread-jumps -fno-tree-ch

[Bug rtl-optimization/48374] ICE: in single_succ_edge, at basic-block.h:562 with -fselective-scheduling2 and __builtin_unreachable()

[Bug rtl-optimization/48496] [4.7 Regression] 'asm' operand requires impossible reload in libffi/src/ia64/ffi.c

[Bug rtl-optimization/48813] [4.4/4.5/4.6 Regression] Segfault with backward branch inside dead loop body

[Bug rtl-optimization/49710] [4.7 Regression] segfault

[Bug rtl-optimization/49720] Infinite recursion compiling gold binary_test.cc testcase

[Bug rtl-optimization/49847] [4.6/4.7 Regression] m68k gcj-4.6 NULL deref in fold_rtx (prev_insn_cc0 == NULL)

[Bug rtl-optimization/49847] [4.7 Regression] NULL deref in fold_rtx (prev_insn_cc0 == NULL)

[Bug rtl-optimization/49857] Put constant switch-tables into flash

[Bug rtl-optimization/49936] [4.7 Regression] IRA handles CANNOT_CHANGE_MODE_CLASS poorly, + spills to memory on 4.7

[Bug rtl-optimization/49936] IRA handles CANNOT_CHANGE_MODE_CLASS poorly, + spills to memory on 4.7

[Bug rtl-optimization/50110] Endian reversal when adding extzv instruction

[Bug rtl-optimization/50176] [4.7 Regression] 4.7 generates spill-fill dealing with char->int conversion

[Bug rtl-optimization/50176] [4.7/4.8 Regression] 4.7 generates spill-fill dealing with char->int conversion

[Bug rtl-optimization/50339] suboptimal register allocation for abs(__int128_t)

[Bug rtl-optimization/50380] [4.6 only] cc1 hangs eating 100% CPU

[Bug rtl-optimization/50557] [4.7 Regression] Register pressure increase after reassociation (x86, 32 bits)

[Bug rtl-optimization/50588] gcc produce incorrect inlined code with -march=athlon -O2

[Bug rtl-optimization/51040] ICE: RTL check: access of elt 1 of 'not' with last elt 0 in gen_rtx_fmt_ee_stat, at ./genrtl.h:33 with __atomic_nand_fetch()

[Bug rtl-optimization/51069] [4.7 Regression] ICE in verify_loop_structure, at cfgloop.c:1559

[Bug rtl-optimization/51187] miscompilation of genrecog.c at -O2 for --target=avr

[Bug rtl-optimization/51271] [4.7 Regression] ICE in in maybe_record_trace_start, at dwarf2cfi.c:2244

[Bug rtl-optimization/51353] GCC incorrectly optimizes away assignment to return address

[Bug rtl-optimization/51366] [cygwin] ICE in maybe_record_trace_start, at dwarf2cfi.c:2244

[Bug rtl-optimization/51374] [avr] insn combine reorders volatile memory accesses

[Bug rtl-optimization/51447] [4.4/4.5/4.6/4.7 Regression] global register variable definition incorrectly removed as dead code

[Bug rtl-optimization/51505] [4.5/4.6 Regression] ICE: in form_sum, at reload.c:5349 with -O --param max-cse-insns=1

[Bug rtl-optimization/51505] [4.5/4.6/4.7 Regression] ICE: in form_sum, at reload.c:5349 with -O --param max-cse-insns=1

[Bug rtl-optimization/51767] [4.5/4.6 Regression] ICE with degenerated asm goto

[Bug rtl-optimization/51767] [4.5/4.6/4.7 Regression] ICE with degenerated asm goto

[Bug rtl-optimization/51767] New: [4.5/4.6/4.7 Regression] ICE with degenerated asm goto

[Bug rtl-optimization/51771] New: trans-mem: abnormal edges get lost or corrupted

[Bug rtl-optimization/51771] trans-mem: abnormal edges get lost or corrupted

[Bug rtl-optimization/51774] [4.7 Regression] FAIL: gcc.dg/lto/trans-mem-* c_lto_trans-mem-1_0.o-c_lto_trans-mem-1_1.o link, -flto -fgnu-tm

[Bug rtl-optimization/51774] New: [4.7 Regression] FAIL: gcc.dg/lto/trans-mem-* c_lto_trans-mem-1_0.o-c_lto_trans-mem-1_1.o link, -flto -fgnu-tm

[Bug rtl-optimization/51821] [4.5/4.6/4.7 Regression] 64bit > 32bit conversion produces incorrect results with optimizations

[Bug rtl-optimization/51856] [4.7 Regression] ICE in reload_cse_simplify_operands

[Bug rtl-optimization/51856] New: [4.7 Regression] ICE in reload_cse_simplify_operands

[Bug rtl-optimization/51924] [4.7 Regression] wrong code with -O -free -fno-rename-registers -ftree-vectorize -funroll-loops

[Bug rtl-optimization/51924] [4.7 regression] wrong code with -O -free -fno-rename-registers -ftree-vectorize -funroll-loops

[Bug rtl-optimization/51924] New: [4.7 Regression] wrong code with -O -free -fno-rename-registers -ftree-vectorize -funroll-loops

[Bug rtl-optimization/51933] [4.7 regression] wrong code due to -free

[Bug rtl-optimization/51933] [4.7 Regression] Wrong-code due to -free

[Bug rtl-optimization/51933] New: [4.7 Regression] Wrong-code due to -free

[Bug rtl-optimization/51938] missed optimization: 2 comparisons

[Bug rtl-optimization/51954] __int128_t (and long long on x86) negation can be optimized

[Bug rtl-optimization/51954] New: __int128_t negation can be optimized

[Bug rtl-optimization/51978] ext-elim-1.c ICE on powerpc64

[Bug rtl-optimization/51978] New: ext-elim-1.c ICE on powerpc64

[Bug rtl-optimization/52000] cross-jumping drops MEM attributes even when it makes no changes to the code

[Bug rtl-optimization/52000] New: cross-jumping drops MEM attributes even when it makes no changes to the code

[Bug rtl-optimization/52004] bad asm generated with -O2 -finline-functions (and maybe -ftracer)

[Bug rtl-optimization/52004] New: bad asm generated with -O2 -finline-functions (and maybe -ftracer)

[Bug rtl-optimization/52025] caller-saves triggers a frame without need

[Bug rtl-optimization/52025] New: caller-saves triggers a frame without need

[Bug rtl-optimization/52051] [4.7 regression] invalid stack-cleanup occured with -O flag

[Bug rtl-optimization/52051] New: [4.7 regression] invalid stack-cleanup occured with -O flag

[Bug rtl-optimization/52060] Incorrect mask/and (ARM "bic") instruction generated for shifted expression parameter, triggered by -O2 -finline-functions

[Bug rtl-optimization/52060] New: Incorrect mask/and (ARM "bic") instruction generated for shifted expression parameter, triggered by -O2 -finline-functions

[Bug target/10901] non-local goto's don't work on darwin

[Bug target/14698] Error in "print_reg" prohibits compilation of cross-compiler components

[Bug target/14733] [HPUX cross-ppc] Problem building gcc - array too large ?

[Bug target/14743] -msdata=eabi does not produce r2/r13 relative access

[Bug target/15087] IA64: Wrong alignment for structure > 8 byte

[Bug target/15533] Missed move to partial register

[Bug target/16150] libstdc++ testsuite failures on pa64 (GNU linker)

[Bug target/17280] -mrelax and -O cause .uses directives in assembler to refer to non-existent local labels

[Bug target/17306] function_vector attribute in H8300H/H8S

[Bug target/18024] IOT/Abort trap (core dumped) on AIX with -pthread

[Bug target/18649] terminate called after throwing - IOT/Abort trap (core dumped)

[Bug target/19520] protected function pointer doesn't work right

[Bug target/19799] sibcall-3.c and sibcall-4.c xfailed on hppa64-*-hpux*

[Bug target/20819] Enable -mlong-call for IA64 to use brl.call

[Bug target/21307] internal compiler error: in change_address_1, at emit-rtl.c:1768

[Bug target/21530] libstdc++ not supported on h8

[Bug target/21530] libstdc++ not supported on this target

[Bug target/22006] New IRIX 6.5 testsuite failures with gas: .space repeat count is zero, ignored

[Bug target/22473] FAIL: gcc.c-torture/execute/conversion.c execution -O[012]

[Bug target/23231] cross compiling fails for mips-sgi-irix6.5

[Bug target/23525] inefficient parameter passing on x86

[Bug target/23605] memset() Optimization on x86-32 bit

[Bug target/24000] wrong constants allocation for altivec data type on PPC little-endian

[Bug target/24085] internal compiler error: Segmentation fault

[Bug target/24419] ix86 prologue clobbers memory when it shouldn't

[Bug target/24842] testsuite failure: gcc.dg/attr-weakref-1.c execution test

[Bug target/25126] -msoft-float does not work, no soft-float mutlilib

[Bug target/25160] ICE in print_operand if using -mfloat-gprs w/ non-854x -mcpu option

[Bug target/25249] inconsistent code for template function calls

[Bug target/25295] unused register saved in function prolog

[Bug target/25372] Aligned args on IA64

[Bug target/26219] longjmp dosn't work

[Bug target/26894] On a 64 bit system the generated crosscompiler generates invalid assembly

[Bug target/27308] Compiler generates incorrect code when calling a function with the result of an inline function as parameter

[Bug target/27855] [4.4/4.5/4.7 regression] reassociation causes the RA to be confused

[Bug target/28314] cpp: x86/powerpc inconsistency for the __linux macro

[Bug target/29256] [4.4/4.5/4.6/4.7 regression] loop performance regression

[Bug target/29421] gcc.dg/tree-ssa/ivopts-2.c scan-tree-dump-not \n candidates .*,.*,.*\n[^\n]*\nFinal cost fails

[Bug target/29775] redundant movzbl

[Bug target/30497] compiling binutils 2.17 on aix fails with gcc 4.1.1

[Bug target/30826] alignment error

[Bug target/31394] cos() returns wrong value unless -O0 is used

[Bug target/32192] Assembler errors compiling g++

[Bug target/32347] ICE on gcc/testsuite/gcc-dg/vmx/ops.c

[Bug target/32657] libjava/classpath/external/jsr166/java/util/concurrent/atomic/AtomicLong.java fails to compile

[Bug target/33123] internal compiler error: in decode_addr_const ( arm-linux-gcc 3.4.6)

[Bug target/33517] bit field cause an internal compiler error: in schedule_region

[Bug target/34434] internal compiler error: in insert_save, at caller-save.c:725

[Bug target/34484] libgcc should check if feclearexcept (and others) available for BID support on uclibc

[Bug target/35079] [arm] ICE (segfault) with gfortran -O3 -funroll-loops

[Bug target/35080] __thread generators a.out that creates segmentation fault

[Bug target/35495] Error in compiling 64 bit on AIX 5.1 for C++.

[Bug target/36622] 4.3.1 failed to compile gcse.c file.

[Bug target/37651] __sync_bool_compare_and_swap creates wrong code with -fPIC

[Bug target/37750] a lot of crashes with tree optimizations on mingw

[Bug target/38134] [4.4/4.5/4.6/4.7 Regression] speed regression with many loop invariants

[Bug target/38306] [4.4/4.5/4.6/4.7 Regression] 15% slowdown w.r.t. 4.3 of computational kernel on some architectures

[Bug target/38384] shared link/execute fails for cross gcc from linux to target hppa64-hp-hpux11.00

[Bug target/38630] Is this a bug in gcc 2.95.3 ( m/c SunOS 5.7 sun4u sparc SUNW,Ultra-80 )

[Bug target/39102] gcc generating multiple stack stores in optimised code

[Bug target/39383] .size is incorrect for initialized fexible array member

[Bug target/39469] Calculated values replaced with constants even if the constants cost more than the calculations

[Bug target/40030] vector float * vector float + vector float should produce only vmaddfp

[Bug target/40419] __attribute__((mips16)) is broken on trunk.

[Bug target/40454] [4.4/4.5/4.6/4.7 regression] zlib is about 20% slower when compiled with GCC 4.4.1

[Bug target/40677] flag -mmultiple is ignored

[Bug target/40735] [4.4/4.5/4.6/4.7 Regression] memory hog compiling big functions with -fPIE

[Bug target/40735] memory hog compiling big functions with -fPIE

[Bug target/40918] uncaught_exception() returns wrong (inverted) value if some exception have crossed a DLL boundary before

[Bug target/41524] gcc generates invalid instructions when used with -m32 -fprofile-generate

[Bug target/41916] psignal() declaration needs const char*

[Bug target/42240] [4.3/4.4 Regression] wrong epilogue on naked function

[Bug target/42523] Detection of main() as an entry point when given -ffreestanding

[Bug target/42536] [4.4/4.5/4.6/4.7 regression] ICE in spill_failure, at reload1.c:2141

[Bug target/42818] Static C++ linking breakage "undefined reference to ___real__Znwj" and others in libcygwin.a(_cygwin_crt0_common.o)

[Bug target/43102] ARM V6 (Cortex-M1) Unable to jump from assembly to C code while debuging.

[Bug target/43311] missed 'movw' optimization.

[Bug target/43745] [avr] g++ puts VTABLES in SRAM

[Bug target/43814] gcc failed to inline memcpy

[Bug target/44581] [4.5/4.6/4.7 Regression] internal compiler error: in simplify_subreg

[Bug target/45094] [arm] wrong instructions for dword move in some cases

[Bug target/45616] internal compiler error: in note_invalid_constants, at config/arm/arm.c:11243

[Bug target/45771] Source operands for conditional moves

[Bug target/45996] -falign-functions=X does not work

[Bug target/46057] Most stackalign tests fail on hppa-hpux

[Bug target/46788] unsigned int possible treated as signed in a union/struct

[Bug target/47333] [4.6 regression] g++.dg/lto/20091219 FAILs on Solaris 2 with SUN as

[Bug target/47333] [4.6/4.7 regression] g++.dg/lto/20091219 FAILs on Solaris 2 with SUN as

[Bug target/47548] [regression] m32c-rtems ICEt in change_address_1, at emit-rtl.c:1933

[Bug target/47852] crash with g++ -lpthread on irix

[Bug target/48308] [4.6/4.7 Regression] crosscompiling to arm fails with assembler: can't resolve '.LC4' {.rodata.str1.1 section} - '.LPIC4' {*UND* section}

[Bug target/48634] Missed optimization for use of __builtin_ctzll() and __builtin_clzll

[Bug target/48743] -march=native mis-detects AMD K6-2+ / K6-3 as Athlon - compiled C fails with "illegal instruction"

[Bug target/48754] FAIL: gcc.dg/binop-xor(1|3).c scan-tree-dump-times optimized "<bb[^>]*>" *

[Bug target/48941] [arm gcc] NEON: Stack pointer operations performed even tho stack is not accessed at all in function.

[Bug target/48949] [4.6/4.7 Regression] gcc-4.6.0 regression with complex.h on i386-pc-solaris2.10

[Bug target/49030] ICE in get_arm_condition_code, at config/arm/arm.c:17180

[Bug target/49257] -mfpmath=sse generates x87 instructions on 32 bits OS

[Bug target/49448] arm-tab-linux-gnu-eabi enableds big endian when it should not

[Bug target/49826] [4.7 Regression] Symbols are not decorated with attribute stdcall and -mrtd

[Bug target/49857] Put constant switch-tables into flash

[Bug target/49865] [4.7 Regression] Unnecessary reload causes small bloat

[Bug target/49868] Implement named address space to place/access data in flash memory

[Bug target/50077] FAIL: gcc.target/i386/pr49866.c (test for excess errors) on x86_64-apple-darwin10

[Bug target/50090] ARM EABI symbols in libgcc.a have default visibility

[Bug target/50182] Performance degradation from gcc 4.1 (x86_64)

[Bug target/50313] ARM: PIC code references a non-existant label

[Bug target/50494] gcc.dg/vect/vect-reduc-2char.c fails spuriously on ppc with -flto

[Bug target/50572] unstable performance on Atom due to loop alignment

[Bug target/50616] lto1.exe: internal compiler error: invalid resolution in the resolution file

[Bug target/50766] Binutils 2.22.51 rejects bmi2 pext operation with memory operands

[Bug target/50813] gcc.dg/torture/vshuf-{v4di,v8si}.c fail on AVX target

[Bug target/50887] [avr] Support ACCUMULATE_OUTGOING_ARGS

[Bug target/50946] ICE on armhf with webkitgtk+

[Bug target/51002] SP_H register is used even on targets that do not have it (eg attiny26)

[Bug target/51093] GCC 4.4.3 build fails with 'OPTION_ISA_AES' as undefined

[Bug target/51106] [4.5/4.6 Regression] ICE in move_insn, at haifa-sched.c:2314

[Bug target/51106] [4.5/4.6/4.7 Regression] ICE in move_insn, at haifa-sched.c:2314

[Bug target/51178] FAIL: g++.dg/lookup/builtin5.C scan-assembler _ZSt5atanhd

[Bug target/51192] h8300 ICE building libgcov.c in int_mode_for_mode

[Bug target/51330] Compiling issue that seems specific to i586 with gcc 4.6

[Bug target/51345] [avr] Devices with 8-bit SP need their own multilib(s)

[Bug target/51381] Internal compiler error for arm target

[Bug target/51659] [4.7 regression] ICE in function output_move_double

[Bug target/51659] ICE in function output_move_double

[Bug target/51681] [4.7 Regression]: ICE in gcc.dg/torture/vshuf-v2si.c on ia64

[Bug target/51685] FAIL: gcc.dg/tm/pr51472.c (internal compiler error) on ppc*-*-*, s390*-*-*, spu-*-*

[Bug target/51687] gcc is killed when compiling med-3.0.4

[Bug target/51709] armv7 target is not using unaligned access to packed fields sometimes (halfwords, loads?)

[Bug target/51726] LTO and attribute 'selectany'

[Bug target/51726] New: LTO and attribute 'selectany'

[Bug target/51729] dspr2-MULT.c and dspr2-MULTU.c fail for MIPS

[Bug target/51729] New: dspr2-MULT.c and dspr2-MULTU.c fail for MIPS

[Bug target/51743] [ia64] Many gcc.dg/torture/vshuf*.c tests FAIL with -O2 -mbig-endian

[Bug target/51743] New: [ia64] Many gcc.dg/torture/vshuf*.c tests FAIL with -O2 -mbig-endian

[Bug target/51751] COMPLEX16 tests fail in Lapack

[Bug target/51751] New: COMPLEX16 tests fail in Lapack

[Bug target/51753] Many gcc.dg/simultate-thread tests fail on Solaris 10+/x86

[Bug target/51753] New: Many gcc.dg/simultate-thread tests fail on Solaris 10+/x86

[Bug target/51756] New: wrong warning: uninitialized variable put into program memory area

[Bug target/51756] wrong warning: uninitialized variable put into program memory area

[Bug target/51784] [4.7 Regression] FAIL: gcc.dg/tree-prof/pr44777.c execution, -fprofile-generate -D_PROFILE_GENERATE

[Bug target/51784] PIC register not correctly preserved in nested funcs / with non-local goto

[Bug target/51793] New: pragma GCC optimize wrapv leads to invalid code on Solaris

[Bug target/51793] pragma GCC optimize wrapv leads to invalid code on Solaris

[Bug target/51797] Arm backend missed the mls related optimization

[Bug target/51797] New: Arm backend missed the mls related optimization

[Bug target/51819] [4.7 Regression] Neon wrong code generation, Error: unsupported alignment for instruction -- `vst1.32 {d2[0]},[r0:64]'

[Bug target/51819] New: [4.7 Regression ]Neon wrong code generation, Error: unsupported alignment for instruction -- `vst1.32 {d2[0]},[r0:64]'

[Bug target/51821] [4.5/4.6/4.7 Regression] 64bit > 32bit conversion produces incorrect results with optimizations

[Bug target/51831] internal compiler error: in simplify_subreg, at simplify-rtx.c:5375

[Bug target/51835] ARM EABI violation when passing arguments to helper floating functions like __aeabi_d2iz

[Bug target/51835] New: ARM EABI violation when passing arguments to helper floating functions like __aeabi_d2iz

[Bug target/51843] ICE with LTO and attribute `dllimport'

[Bug target/51843] New: ICE with LTO and attribute `dllimport'

[Bug target/51853] MPFR assertion failure with Python: p >= 2 && p <= ((mpfr_prec_t)((mpfr_uprec_t)(~(mpfr_uprec_t)0)>>1))

[Bug target/51861] Incorrect generated code with __builtin_unreachable() on MIPS

[Bug target/51861] New: Incorrect generated code with __builtin_unreachable() on MIPS

[Bug target/51871] FAIL: gcc.c-torture/execute/20010122-1.c execution

[Bug target/51872] [4.7 Regression] Shrink-wrapping with -mminimal-toc causes bootstrap failure

[Bug target/51876] [4.7 regression] Recent extra neon related testsuite regressions on arm-linux-gnueabi

[Bug target/51876] New: [4.7 regression] Recent extra neon related testsuite regressions on arm-linux-gnueabi

[Bug target/51880] New: protected visibility does not link

[Bug target/51880] protected visibility does not link

[Bug target/51882] ICE: in extract_insn, at recog.c:2109 (unrecognizable insn) when building Mesa on ARM

[Bug target/51882] New: ICE: in extract_insn, at recog.c:2109 (unrecognizable insn) when building Mesa on ARM

[Bug target/51900] [4.6 Regression] const variable initialization always zero

[Bug target/51900] [4.6/4.7 Regression] const variable initialization always zero

[Bug target/51907] New: SIGSEGV in _Unwind_GetIP

[Bug target/51907] SIGSEGV in _Unwind_GetIP

[Bug target/51909] for avr device : internal error in linking phase , function call disappearing when assembled and a weird compiling warning

[Bug target/51915] [4.7 Regression] ICE in output_move_double

[Bug target/51915] New: [4.7 Regression] ICE in output_move_double

[Bug target/51920] 64-bit gcc.target/sparc/vec-init-1-vis1.c FAILs

[Bug target/51920] New: 64-bit gcc.target/sparc/vec-init-1-vis1.c FAILs

[Bug target/51921] [4.6/4.7 regression] EH unwinding support is broken

[Bug target/51921] New: [4.7 regression] EH unwinding support is broken on Solaris 11

[Bug target/51931] New: No support for MIPS16 long branches

[Bug target/51931] No support for MIPS16 long branches

[Bug target/51934] FAIL: g++.dg/torture/pr51344.C -O0 (test for excess errors) due to "cdecl attribute ignored" warning

[Bug target/51934] FAIL: g++.dg/torture/pr51344.C -O0 (test for excess errors) on powerpc*-*-*

[Bug target/51934] New: FAIL: g++.dg/torture/pr51344.C -O0 (test for excess errors) on powerpc*-*-*

[Bug target/51942] FAIL: gcc.dg/tree-ssa/vrp47.c scan-tree-dump-times ...

[Bug target/51942] New: FAIL: gcc.dg/tree-ssa/vrp47.c scan-tree-dump-times ...

[Bug target/51955] _mm_setzero_si128 intrinsic causes segfault without -O

[Bug target/51957] [4.7 Regression] ppc64 .debug_loc toc reference

[Bug target/51957] New: [4.7 Regression] ppc64 .debug_loc toc reference

[Bug target/51959] [4.7 Regression] ICE in set_mem_alias_set, at emit-rtl.c:1884

[Bug target/51959] New: [4.7 Regression] ICE in set_mem_alias_set, at emit-rtl.c:1884

[Bug target/51968] gcc trunk (ARM) ICEs in final_scan_insn in final.c:2716, with "could not split insn" error msg

[Bug target/51968] New: gcc trunk (ARM) ICEs in final_scan_insn in final.c:2716, with "could not split insn" error msg

[Bug target/51974] [4.7 Regression] GCC fails to bootstrap with --enable-checking=release on opensuse

[Bug target/51980] ARM - Neon code polluted by useless stores to the stack with vuzpq / vzipq / vtrnq

[Bug target/51980] New: ARM - Neon code polluted by useless stores to the stack with vuzpq / vzipq / vtrnq

[Bug target/51996] ICE in extract_insn gcc.dg/pr48335-5.c

[Bug target/52006] [4.7 Regression] ARM ICE with incorrectly peepholed tls_load_dot_plus_eight

[Bug target/52006] New: [4.7 Regression] ARM ICE on

[Bug target/52017] internal compiler error: Segmentation fault in compiling Perl Tk on Cygwin

[Bug target/52023] _Alignof (double) yields wrong value on x86

[Bug target/52034] __builtin_copysign optimization suboptimal

[Bug target/52049] New: SH Target: Inefficient constant address access

[Bug target/52049] SH Target: Inefficient constant address access

[Bug target/52055] load of 64-bit pointer reads 64 bits even when only 32 are used

[Bug target/52055] New: load of 64-bit pointer reads 64 bits even when only 32 are used

[Bug target/52060] Incorrect mask/and (ARM "bic") instruction generated for shifted expression parameter, triggered by -O2 -finline-functions

[Bug target/52074] New: ICE: RTL flag check: MEM_VOLATILE_P used with unexpected rtx code 'plus' in extract_fixed_bit_field, at expmed.c:1734

[Bug target/7625] gcc pessimized 64-bit % operator on hppa2.0

[Bug target/8026] -fstack-check dumps when throw out of scope with

[Bug testsuite/24128] ICE in libjava.compile/PR6865.java reported as "PASS" in testsuite.

[Bug testsuite/39550] compat tests for flexible array members

[Bug testsuite/47013] FAIL: gcc.dg/sms-*.c scan-rtl-dump-times sms "SMS succeeded" *

[Bug testsuite/50023] FAIL: gcc.dg/graphite/id-pr46845.c (test for excess errors)

[Bug testsuite/50076] FAIL: c-c++-common/cxxbitfields-3.c scan-assembler movl.*, var on x86_64-apple-darwin10

[Bug testsuite/50435] FAIL: gcc.dg/vect/bb-slp-25.c (-flto)? scan-tree-dump-times slp "basic block vectorized using SLP" 1

[Bug testsuite/51057] FAIL: gfortran.dg/quad_2.f90 -O0 execution test on powerpc*-*-*

[Bug testsuite/51603] ERROR: g++.dg/cpp0x/rv-cast[34].C: syntax error in target selector "target c++11"

[Bug testsuite/51655] FAIL: c-c++-common/tm/memcpy-1.c (test for excess errors)

[Bug testsuite/51693] New XPASSes in vectorizer testsuite on powerpc64-suse-linux

[Bug testsuite/51703] FAIL: gfortran.dg/io_real_boz_[345].f90 -O (test for excess errors)

[Bug testsuite/51748] gcc.misc-tests/linkage.c fails on mips64-linux-gnu

[Bug testsuite/51748] New: gcc.misc-tests/linkage.c fails on mips64-linux-gnu

[Bug testsuite/51875] FAIL: gfortran.dg/guality/pr41558.f90 -O0 line 7 s == 'foo'

[Bug testsuite/51875] New: FAIL: gfortran.dg/guality/pr41558.f90 -O0 line 7 s == 'foo'

[Bug testsuite/51919] g++.dg/pch/mangle1.* test FAILs without LTO

[Bug testsuite/51919] New: g++.dg/pch/mangle1.* test FAILs without LTO

[Bug testsuite/51941] FAIL: g++.dg/debug/dwarf2/nested-3.C scan-assembler

[Bug testsuite/51941] New: FAIL: g++.dg/debug/dwarf2/nested-3.C scan-assembler

[Bug testsuite/52011] [4.7 Regression] FAIL: gcc.dg/lto/trans-mem-* c_lto_trans-mem-*.o assemble, -flto -fgnu-tm in 32 bit mode

[Bug testsuite/52011] FAIL: gcc.dg/lto/trans-mem-* c_lto_trans-mem-*.o assemble, -flto -fgnu-tm in 32 bit mode

[Bug testsuite/52011] New: FAIL: gcc.dg/lto/trans-mem-* c_lto_trans-mem-*.o assemble, -flto -fgnu-tm in 32 bit mode

[Bug tree-optimization/15357] [tree-ssa] combing if statements

[Bug tree-optimization/15457] [tree-ssa] Convert a sign bit testing into "a < 0"

[Bug tree-optimization/15826] don't use "if" to extract a single bit bit-field.

[Bug tree-optimization/18589] could optimize FP multiplies better

[Bug tree-optimization/19105] fold does not spot anti-range test

[Bug tree-optimization/20083] Missed optimization with conditional and basically ||

[Bug tree-optimization/20962] copyprop dump files have wrong names

[Bug tree-optimization/21791] ccp and copy-prop print out too much garbage with -fdump-tree-ccp/copy-details

[Bug tree-optimization/21855] array bounds checking elimination

[Bug tree-optimization/23901] Dom jump-threading unrolls loops

[Bug tree-optimization/25290] PHI-OPT could be rewritten so that is uses fold

[Bug tree-optimization/27140] Compiling LLVM now takes nearly 5x as long with 4.1 as it did with 4.0

[Bug tree-optimization/29333] Jump threading getting in the way of PHI-OPT

[Bug tree-optimization/29751] not optimizing access a[0] , a[1]

[Bug tree-optimization/32306] [4.4/4.5/4.6/4.7 Regression] redundant && || not eliminated

[Bug tree-optimization/32825] Reduction with nonzero start (arbitrary also) causes an extra add to happen

[Bug tree-optimization/33512] Simple bitwise simplification missed

[Bug tree-optimization/34011] Memory load is not eliminated from tight vectorized loop

[Bug tree-optimization/35629] [4.4/4.5/4.6/4.7 Regression] gcc.dg/tree-ssa/loop-25.c scan-tree-dump-times profile fails

[Bug tree-optimization/37997] PHI translation does not simplify to non-constants

[Bug tree-optimization/38355] ICE with -fipa-struct-reorg

[Bug tree-optimization/38785] [4.4/4.5/4.6/4.7 Regression] huge performance regression on EEMBC bitmnp01

[Bug tree-optimization/38884] missed FRE with __real and __imag

[Bug tree-optimization/39612] [4.4/4.5/4.6/4.7 Regression] LIM inserts loads from uninitialized local memory

[Bug tree-optimization/39799] [4.4/4.5 Regression] missing 'may be used uninitialized' warning

[Bug tree-optimization/41881] [4.5/4.6 regression] Complete unrolling (inner) versus vectorization of reduction

[Bug tree-optimization/42149] ICE:verify_gimple failed for avr target

[Bug tree-optimization/42283] regression: ICE when bootstrapping trunk with -O2 -ftree-loop-distribution

[Bug tree-optimization/42635] no-op conversions hinder if-conversion

[Bug tree-optimization/42963] [4.5 Regression] Redundant switch labels not cleaned up anymore

[Bug tree-optimization/44776] FAIL: gcc.dg/matrix/transpose-3.c execution, -fprofile-use -fipa-matrix-reorg -fdump-ipa-matrix-reorg -O3 -fwhole-program

[Bug tree-optimization/45397] [4.5/4.6/4.7 Regression] Issues with integer narrowing conversions

[Bug tree-optimization/45397] [4.5/4.6/4.7/4.8 Regression] Issues with integer narrowing conversions

[Bug tree-optimization/46590] [4.5/4.6/4.7 Regression] long compile time with -O2 and many loops

[Bug tree-optimization/46693] incorrect code generation with -O2 optimization enabled

[Bug tree-optimization/46801] [4.6 Regression] FAIL: gnat.dg/pack9.adb scan-tree-dump-not optimized "gnat_rcheck"

[Bug tree-optimization/47579] STL size() == 0 does unnecessary shift

[Bug tree-optimization/48172] [4.5 Regression] incorrect vectorization of loop in GCC 4.5.* with -O3

[Bug tree-optimization/48571] [4.5/4.6 Regression] Missed data-dependence for (bogus?) reconstructed array-refs

[Bug tree-optimization/48625] [trans-mem] Segfault in libitm when compiling with -O2

[Bug tree-optimization/48764] [4.5 Regression] wrong-code bug in gcc-4.5.x, related to __restrict

[Bug tree-optimization/48783] ~0ULL % (a / (a & -a)) == 0 is not optimized to false on the tree level

[Bug tree-optimization/48794] [4.7 Regression] ICE: SIGSEGV in remap_eh_region_nr (tree-inline.c:1194) with -Os -fopenmp -fexceptions -fno-tree-ccp -fno-tree-copy-prop

[Bug tree-optimization/49279] [4.5 Regression] Optimization incorrectly presuming constant variable inside loop in g++ 4.5 and 4.6 with -O2 and -O3 for x86_64 targets

[Bug tree-optimization/49642] constant part of a macro not optimized away as expected due to splitter

[Bug tree-optimization/49651] [4.4 Regression] nested lambdas and -O3 produced incorrect integer variable increments

[Bug tree-optimization/49651] [4.4/4.5 Regression] nested lambdas and -O3 produced incorrect integer variable increments

[Bug tree-optimization/49857] Put constant switch-tables into flash

[Bug tree-optimization/49959] ABS pattern is not recognized

[Bug tree-optimization/50162] [4.5 Regression] Wrong vectorization

[Bug tree-optimization/50444] [4.6 Regression] -ftree-sra ignores alignment

[Bug tree-optimization/50444] [4.6/4.7 Regression] -ftree-sra ignores alignment

[Bug tree-optimization/50561] [4.7 regression] ICE when compiling zlib with -O2 -floop-flatten -floop-strip-mine

[Bug tree-optimization/50602] ICE in tree_nrv, at tree-nrv.c:155 during large LTO build

[Bug tree-optimization/50873] The fix to PR50730 causes gcc.c-torture/unsorted/dilayout.c to ICE

[Bug tree-optimization/50913] [4.7 Regression] ICE in scan_tree_for_params_right_scev, at graphite-sese-to-poly.c:633 compiling libgfortran with -floop-interchange -m32

[Bug tree-optimization/50955] [4.7 Regression] IVopts incorrectly rewrite the address of a global memory access into a local form.

[Bug tree-optimization/51030] PHI opt does not handle value-replacement with a transfer function

[Bug tree-optimization/51042] [4.5/4.6 Regression] endless recursion in phi_translate

[Bug tree-optimization/51070] [4.6/4.7 Regression] ICE verify_gimple failed

[Bug tree-optimization/51084] bounds checking not optimized to a single comparison

[Bug tree-optimization/51269] Vectorization profitability threshold is not actually used

[Bug tree-optimization/51315] [4.6/4.7 regression] unaligned memory accesses generated with -ftree-sra

[Bug tree-optimization/51492] vectorizer does not support saturated arithmetic patterns

[Bug tree-optimization/51528] [4.6 Regression] SRA should not create BOOLEAN_TYPE replacements

[Bug tree-optimization/51528] [4.6/4.7 Regression] SRA should not create BOOLEAN_TYPE replacements

[Bug tree-optimization/51566] [4.7 Regression] ICE: verify_gimple in testsuite/g++.dg/ipa/iinline-3.C

[Bug tree-optimization/51600] [4.7 Regression] ice in estimate_local_effects

[Bug tree-optimization/51624] [4.6/4.7 regression] Assert_Failure atree.adb:808 during stage 3

[Bug tree-optimization/51680] [4.7 Regression] g++ 4.7 fails to inline trivial template stuff

[Bug tree-optimization/51680] g++ 4.7 fails to inline trivial template stuff

[Bug tree-optimization/51692] [4.7 Regression] ICE on several valgrind tests

[Bug tree-optimization/51694] [4.7 Regression] ICE while compiling alliance package

[Bug tree-optimization/51704] [4.7 Regression] ICE: vector VEC(vec_void_p,base) index domain error, in vinfo_for_stmt at tree-vectorizer.h:620 with -O3 -fno-tree-copy-prop -fno-tree-fre

[Bug tree-optimization/51719] [4.7 Regression] ICE: verify_gimple failed: LHS in noreturn call with -fpartial-inlining -fprofile-use and exceptions

[Bug tree-optimization/51721] -Warray-bounds false positives and inconsistencies

[Bug tree-optimization/51737] [4.6 Regression] g++ crashes (internal compiler error: Segmentation fault) when compiling quickbook

[Bug tree-optimization/51759] [4.5 Regression] miscompile writes past end of bitfield

[Bug tree-optimization/51760] [4.7 Regression] ICE in set_lattice_value, at tree-ssa-ccp.c:456

[Bug tree-optimization/51760] New: [4.7 Regression] ICE in set_lattice_value, at tree-ssa-ccp.c:456

[Bug tree-optimization/51775] [4.6 Regression] FAIL: gnat.dg/pack9.adb scan-tree-dump-not optimized "gnat_rcheck"

[Bug tree-optimization/51775] [4.6/4.7 Regression] FAIL: gnat.dg/pack9.adb scan-tree-dump-not optimized "gnat_rcheck"

[Bug tree-optimization/51780] New: Missed optimization for ==/!= comparison

[Bug tree-optimization/51781] New: Missed optimization for ==/!= comparison type-sinking

[Bug tree-optimization/51782] -ftree-sra: Missing address-space information leads to wrong

[Bug tree-optimization/51782] Missing address-space information leads to wrong code

[Bug tree-optimization/51782] New: Missing address-space information leads to wrong code

[Bug tree-optimization/51783] Missed optimization for X ==/!= (signed type) ((unsigned type) Y + Z)

[Bug tree-optimization/51783] New: Missed optimization for X ==/!= (signed type) ((unsigned type) Y + Z)

[Bug tree-optimization/51799] [4.7 Regression] Compiler ICE in vect_is_simple_use_1

[Bug tree-optimization/51799] Compiler ICE in vect_is_simple_use_1

[Bug tree-optimization/51799] New: Compiler ICE in vect_is_simple_use_1

[Bug tree-optimization/51801] [4.7 Regression] ICE in inline_small_functions

[Bug tree-optimization/51801] New: [4.7 Regression] ICE in inline_small_functions

[Bug tree-optimization/51840] asm goto incorrect code generation at -O2 and -O3

[Bug tree-optimization/51840] New: asm goto incorrect code generation at -O2 and -O3

[Bug tree-optimization/51848] GCC is not able to vectorize when a constant value is also added to the sum of array expression inside a loop.

[Bug tree-optimization/51865] [4.7 Regression] ICE in insert_vi_for_tree, at tree-ssa-structalias.c:2642

[Bug tree-optimization/51865] New: ICE in insert_vi_for_tree, at tree-ssa-structalias.c:2642

[Bug tree-optimization/51877] [4.7 Regression] XEmacs miscompilation due to tail merging

[Bug tree-optimization/51877] New: [4.7 Regression] XEmacs miscompilation due to tail merging

[Bug tree-optimization/51879] Missed tail merging with non-const/pure calls

[Bug tree-optimization/51879] New: Missed tail merging with non-const/pure calls

[Bug tree-optimization/51890] New: vectorizer does not recognize intrinsic functions like sqrt

[Bug tree-optimization/51890] vectorizer does not recognize intrinsic functions like sqrt

[Bug tree-optimization/51903] [4.7 Regression] ICE: in gimple_purge_all_dead_eh_edges, at tree-cfg.c:7196 with -fnon-call-exceptions

[Bug tree-optimization/51903] New: [4.7 Regression] ICE: in gimple_purge_all_dead_eh_edges, at tree-cfg.c:7196 with -fnon-call-exceptions

[Bug tree-optimization/51914] [4.7] vect-intfloat-conversion4a/b tests fail for arm-linux-gnueabi

[Bug tree-optimization/51914] New: [4.7] All vect-intfloat-conversion tests fail for arm-linux-gnueabi

[Bug tree-optimization/51938] New: missed optimization: 2 comparisons

[Bug tree-optimization/51964] Missed tail merging opportunity

[Bug tree-optimization/51964] New: Missed tail merging opportunity

[Bug tree-optimization/51984] ICE: SIGSEGV with -O2 -fgraphite-identity

[Bug tree-optimization/51987] [4.7 Regression] Predictive commoning wrong-code with non-volatile asm

[Bug tree-optimization/51987] New: [4.7 Regression] Predictive commoning wrong-code with non-volatile asm

[Bug tree-optimization/51988] New: value_replacement in PHIOPT should handle even the cases where there are other PHIs even with non equal value

[Bug tree-optimization/51988] value_replacement in PHIOPT should handle even the cases where there are other PHIs even with non equal value

[Bug tree-optimization/51990] ICE in copy_reference_ops_from_ref

[Bug tree-optimization/51990] New: ICE in copy_reference_ops_from_ref

[Bug tree-optimization/51994] [4.6/4.7 Regression] git-1.7.8.3 miscompiled due to negative bitpos from get_inner_reference

[Bug tree-optimization/51994] New: [4.6/4.7 Regression] git-1.7.8.3 miscompiled due to negative bitpos from get_inner_reference

[Bug tree-optimization/52005] New: tree-ssa-combineif does not work with some cfgs

[Bug tree-optimization/52005] tree-ssa-combineif does not work with some cfgs

[Bug tree-optimization/52009] Another missed tail merging opportunity

[Bug tree-optimization/52009] New: Another missed tail merging opportunity

[Bug tree-optimization/52019] [4.7 Regression] tree-ssa/ipa-split-5.c fails with -fno-tree-sra because of CLOBBERS

[Bug tree-optimization/52019] New: [4.7 Regression] tree-ssa/ipa-split-5.c fails with -fno-tree-sra because of CLOBBERS

[Bug tree-optimization/52028] [4.7 Regression] wrong code with -O2 -ftree-loop-distribution

[Bug tree-optimization/52028] New: [4.7 Regression] wrong code with -O2 -ftree-loop-distribution

[Bug tree-optimization/52034] New: __builtin_copysign optimization suboptimal

[Bug tree-optimization/52037] [4.7 regression] ICE in update_ssa, at tree-into-ssa.c:3362 while linking LTO libxul

[Bug tree-optimization/52037] New: [4.7 regression] ICE in update_ssa, at tree-into-ssa.c:3362 while linking LTO libxul

[Bug tree-optimization/52046] [4.7 Regression] ICE: verify_gimple failed: invalid operands in ternary operation with -O -fexceptions -fnon-call-exceptions -ftree-vectorize

[Bug tree-optimization/52054] New: Value-numbering does not enter translated expressions into the hash table

[Bug tree-optimization/52054] Value-numbering does not enter translated expressions into the hash table

[Bug tree-optimization/52056] Vectorizer cost model is imprecise

[Bug tree-optimization/52070] New: missing integer comparison optimization

[Bug tree-optimization/52073] [4.7 Regression] ICE: vector VEC(vec_void_p,base) index domain error, in vinfo_for_stmt at tree-vectorizer.h:620

[Bug web/27877] path mentioned in faq for specs file is incorrect

Annual Agreement Update - Sage Payments

C++/4.1.2/Problem compiling units with medium to large global array definitions on IA64

Notice Update 9e96749f762c445f

Product Samples .

Request for price quote


Indexes: [Date Index] [Subject Index] [Author Index] [Thread Index]
Site Nav: [Browse other archives for this mailing list]
[Browse other mailing lists at this site]
Search: Limit to:

Mail converted by MHonArc 2.6.3