This is the mail archive of the
gcc-bugs@gcc.gnu.org
mailing list for the GCC project.
[Bug bootstrap/17284] New: build failure, unsatisfied symbols: libiconv libiconv_open libiconv_close
- From: "mec dot gnu at mindspring dot com" <gcc-bugzilla at gcc dot gnu dot org>
- To: gcc-bugs at gcc dot gnu dot org
- Date: 2 Sep 2004 12:55:45 -0000
- Subject: [Bug bootstrap/17284] New: build failure, unsatisfied symbols: libiconv libiconv_open libiconv_close
- Reply-to: gcc-bugzilla at gcc dot gnu dot org
This is a build failure with native hppa2.0w-hp-hpux11.11 using gnu make 3.79.1,
as binutils 2.15, the vendor-supplied linker, and the vendor-supplied ansi c
compiler (hp ansi c b.11.11.28706.gp).
stage1/xgcc -Bstage1/ -B/tmp/chastain/install/hppa2.0w-hp-hpux11.11/bin/ -g
-O2 -DIN_GCC -W -Wall -Wwrite-strings -Wstrict-prototypes -Wmissing-prototypes
-pedantic -Wno-long-long -Wold-style-definition -DHAVE_CONFIG_H -o cc1 \
c-parse.o c-lang.o c-pretty-print.o stub-objc.o attribs.o c-errors.o
c-lex.o c-pragma.o c-decl.o c-typeck.o c-convert.o c-aux-info.o c-common.o
c-opts.o c-format.o c-semantics.o c-incpath.o cppdefault.o c-ppoutput.o
c-cppbuiltin.o prefix.o c-objc-common.o c-dump.o c-pch.o libcpp.a main.o
libbackend.a ../libiberty/libiberty.a ../intl/libintl.a
/usr/ccs/bin/ld: Unsatisfied symbols:
libiconv (first referenced in libcpp.a(cppcharset.o)) (code)
libiconv_open (first referenced in libcpp.a(cppcharset.o)) (code)
libiconv_close (first referenced in libcpp.a(cppcharset.o)) (code)
collect2: ld returned 1 exit status
make[2]: *** [cc1] Error 1
make[2]: Leaving directory `/tmp/chastain/342/build/gcc'
make[1]: *** [stage2_build] Error 2
make[1]: Leaving directory `/tmp/chastain/342/build/gcc'
make: *** [bootstrap] Error 2
Scripts and logs attached.
This looks similar to PR java/7169. However, there is no gcc anywhere in $PATH,
so it's probably a different bug.
Build script and log files attached.
--
Summary: build failure, unsatisfied symbols: libiconv
libiconv_open libiconv_close
Product: gcc
Version: 3.4.2
Status: UNCONFIRMED
Severity: critical
Priority: P1
Component: bootstrap
AssignedTo: unassigned at gcc dot gnu dot org
ReportedBy: mec dot gnu at mindspring dot com
CC: gcc-bugs at gcc dot gnu dot org,mark at codesourcery dot
com
GCC build triplet: hppa2.0w-hp-hpux11.11
GCC host triplet: hppa2.0w-hp-hpux11.11
GCC target triplet: hppa2.0w-hp-hpux11.11
http://gcc.gnu.org/bugzilla/show_bug.cgi?id=17284
- Follow-Ups:
- [Bug bootstrap/17284] build failure, unsatisfied symbols: libiconv libiconv_open libiconv_close
- From: mec dot gnu at mindspring dot com
- [Bug bootstrap/17284] build failure, unsatisfied symbols: libiconv libiconv_open libiconv_close
- From: mec dot gnu at mindspring dot com
- [Bug bootstrap/17284] build failure, unsatisfied symbols: libiconv libiconv_open libiconv_close
- From: mec dot gnu at mindspring dot com
- [Bug bootstrap/17284] build failure, unsatisfied symbols: libiconv libiconv_open libiconv_close
- From: pinskia at gcc dot gnu dot org
- Re: [Bug bootstrap/17284] New: build failure, unsatisfied symbols: libiconv libiconv_open libiconv_close
- [Bug bootstrap/17284] build failure, unsatisfied symbols: libiconv libiconv_open libiconv_close
- From: ehrhardt at mathematik dot uni-ulm dot de
- [Bug bootstrap/17284] build failure, unsatisfied symbols: libiconv libiconv_open libiconv_close
- From: mec dot gnu at mindspring dot com
- [Bug bootstrap/17284] build failure, unsatisfied symbols: libiconv libiconv_open libiconv_close
- From: mmitchel at gcc dot gnu dot org
- [Bug bootstrap/17284] build failure, unsatisfied symbols: libiconv libiconv_open libiconv_close
- From: mec dot gnu at mindspring dot com
- [Bug bootstrap/17284] build failure, unsatisfied symbols: libiconv libiconv_open libiconv_close
- From: mark at codesourcery dot com