gcc-bugs archive
subject index for June, 2003

This is the mail archive of the gcc-bugs@gcc.gnu.org mailing list for the GCC project.

Indexes: [Date Index] [Subject Index] [Author Index] [Thread Index]
Site Nav: [Browse other archives for this mailing list]
[Browse other mailing lists at this site]
Search: Limit to:

3.4 irix6.5 bootstrap failure - ICE in expr.c

3.4, recent CVS, alpha Linux, bad code generation with "warning: the address ... will always be `true'"

[Bug ada/10110] [3.3 regression] [mipsel-linux]ada bootstrap error

[Bug ada/10881] Ada doesn't compile on debian linux powerpc macintosh

[Bug ada/10973] Bootstrap error building Ada

[Bug ada/11046] GNAT bug on MacOS X 10.2.6 (Darwin 6.6)

[Bug ada/11055] "make bootstrap" fails with ada enabled

[Bug ada/11055] New: "make bootstrap" fails with ada enabled

[Bug ada/11079] Ada: Inline-Assembler - Outputs => only stores last mentioned register

[Bug ada/11079] New: Ada: Inline-Assembler - Outputs => only stores last mentioned register

[Bug ada/11090] New: Variant Record Initialization.

[Bug ada/11090] Variant Record Initialization.

[Bug ada/11100] Internal compiler error: Ada florist-3.15p posix-sockets.gpb:481:20

[Bug ada/11100] New: Internal compiler error: Ada florist-3.15p posix-sockets.gpb:481:20

[Bug ada/11130] Compile of Booch Componenent with debug options failed

[Bug ada/11130] New: Compile of Booch Componenent with debug options failed

[Bug ada/11186] New: gcc aborts when using -gnatR on generic procedures

[Bug ada/11290] New: "so large that it is unsigned" gripe #2.

[Bug ada/4945] Rewriting '-gant' as '-gnat' is failing

[Bug ada/5679] ICE in assign_stack_temp_for_type, returning unconstrained type conversion ("GtkAda bug")

[Bug ada/5978] A short-circuit return statement should be added to a-ngcefu.adb

[Bug ada/6452] GtkAda fails to build on i386

[Bug ada/6584] failure building GNAT library: ICE on s-auxdec.adb

[Bug ada/6661] gcc can't bootstrap gcc with -O3

[Bug ada/6852] gnatlib fails to build with newlib because it doesn't set up the include path

[Bug ada/6879] can't build cross-compiler to mips-elf if ada is enabled

[Bug ada/7984] [3.3 regression] ICE in loc_descriptor_from_tree

[Bug ada/8614] Assert_Failure exp_util.adb:1404

[Bug ada/8898] [Ada] cannot link with tasks and pragma Linker_Options ("-Wl,--stack=0x80000");

[Bug ada/9129] Code generation error

[Bug ada/9130] [3.3/3.4 regression] Assertion failure in einfo.adb (line 4551)

[Bug ada/9131] [3.3 regression] ICE in varasm.c (line 2625)

[Bug ada/9137] [3.3/3.4 regression] renaming of array object fails

[Bug ada/9535] Datagram socket semantics are wrong

[Bug ada/9536] [3.3/3.4 regression] Constraint error on valid Ada.Calendar.Time_Of

[Bug ada/9596] ICE in assign_stack_temp_for_type, returning unconstrained type conversion ("GtkAda bug")

[Bug ada/9596] Internal compiler error during gtkada compilation

[Bug ada/9953] [3.4 regression] Unsatisfied symbols: U_prep_frame_rec_for_unwind (code)

[Bug bootstrap/10007] building the compiler fails with some java problem in spite of --enable-languages=c,c++,f77

[Bug bootstrap/10010] [x86 linux 2.0] looking for sys/ucontext.h

[Bug bootstrap/10013] [HP-UX] libintl and libiconv not found in non-standard paths

[Bug bootstrap/10054] [cygwin] core dump building libgcc for arm-elf

[Bug bootstrap/10057] [Sparc/Solaris 2.6] relocation error when creating libstdc++

[Bug bootstrap/10088] GCC 3.2.2 bootstrap croaks with "virtual memory exhausted: Not enough space"

[Bug bootstrap/10129] Ada bootstrap fails on powerpc-apple-darwin6.4 - invalid assembler emitted

[Bug bootstrap/10140] Cross-compiling gcc 3.3 for sh-elf: gnu-regex.c:undefined reference to: ___mempcpy

[Bug bootstrap/10227] Random segfaults

[Bug bootstrap/10229] [3.3/3.4 regression] [IA-64 HP-UX 11.22] Internal compiler error in emit_move_insn

[Bug bootstrap/10284] mmap test configury - subtle breakage exposed by corner case

[Bug bootstrap/10389] [sparc x ia64-pc-linux-gnu] GCC 3.2.2 cross-compiler - Can't compile istream.tcc during build

[Bug bootstrap/10636] configuration mismatch with mempcpy

[Bug bootstrap/10657] [3.3 regression] java section can not find libiconv

[Bug bootstrap/10666] undefined ATTRIBUTE_NULL_PRINTF_3

[Bug bootstrap/10693] make gnatlib_and_tools fails

[Bug bootstrap/10731] make

[Bug bootstrap/10755] mcore-elf cc1 possible infinite loop _lshrdi3.o

[Bug bootstrap/10758] bootstrap failure on HP-UX 11.22/IPF

[Bug bootstrap/10802] Bootstrap of gcc-3.3 on Solaris 9 x86 fails on undefined symbol in libgcj.so

[Bug bootstrap/10815] [AIX] C compiler cannot create executables

[Bug bootstrap/10835] [3.3/3.4 regression] [SPARC] combinatory explosion in scheduler on HyperSPARC

[Bug bootstrap/10835] [3.3/3.4 regression] combinatory explosion in scheduler on HyperSPARC

[Bug bootstrap/10847] gcc 3.3 will not build on openbsd3.2-sparc64

[Bug bootstrap/10873] /var/tmp//ccvH2onm.s:8872: Error: operation combines symbols in different segments

[Bug bootstrap/10942] [powerpc][altivec] ICE on trunc_int_for_mode, at explow.c:56

[Bug bootstrap/10951] gcc-3.3 (libstdc++) fails to bootstrap on AIX 4.3.3

[Bug bootstrap/10957] m68k-cross build broken in libiberty (hashtab.c)

[Bug bootstrap/10974] Bootstrap failure

[Bug bootstrap/10983] [3.4 regression] [SPARC64 ]ICE in verify_wide_reg, at flow.c:551, while compiling libjava

[Bug bootstrap/10983] [3.4 regression] [sparc64-linux ]ICE in verify_wide_reg, at flow.c:552, while compiling libjava

[Bug bootstrap/10983] [3.4 regression] [SPARC64] ICE in verify_wide_reg, at flow.c:551, while compiling libjava

[Bug bootstrap/10998] Configure fails: Cannot determine host character set

[Bug bootstrap/11035] gcc 3.3 fails to compile on AIX5.2

[Bug bootstrap/11060] [3.4 regression] [arm/m68k] bootstrap error in libgcj

[Bug bootstrap/11060] New: [3.4 regression] [arm/m68k] bootstrap error in libgcj

[Bug bootstrap/11074] libstdc++ fails to build due to gettext issue

[Bug bootstrap/11074] New: libstdc++ fails to build due to gettext issue

[Bug bootstrap/11088] configure breaks on Tru64Unix 5.1A

[Bug bootstrap/11088] New: configure breaks on Tru64Unix 5.1A

[Bug bootstrap/11102] gcc-3.3/configure breaks on Solaris 2.6 host

[Bug bootstrap/11102] New: configure breaks on Solarais 2.6 host

[Bug bootstrap/11155] gcc's ia64-unwind.c makes gcc bootstrap internal error

[Bug bootstrap/11155] New: gcc's ia64-unwind.c makes gcc bootstrap internal error

[Bug bootstrap/11156] new bootstrap failure on mips-sgi-irix6.5 stage2 libgcc2 fp-bit.c

[Bug bootstrap/11169] bootstrap failure after passing configure options

[Bug bootstrap/11169] New: bootstrap failure after passing configure options

[Bug bootstrap/11171] New: Wrong ctype/OS include files when using Newlib

[Bug bootstrap/11171] Wrong ctype/OS include files when using Newlib

[Bug bootstrap/11216] [3.4][cygwin]`OPT_iwithprefixbefore' undeclared

[Bug bootstrap/11216] New: [3.4][cygwin]`OPT_iwithprefixbefore' undeclared

[Bug bootstrap/11265] Cannot bootstrap with gcc 2.95 due to _Bool

[Bug bootstrap/11265] New: Cannot bootstrap with gcc 2.95 due to _Bool

[Bug bootstrap/11271] [3.4 regression] [arm-elf] regex.c ICEs for thumb multilib

[Bug bootstrap/11271] [arm-elf] regex.c ICEs for thumb multilib

[Bug bootstrap/11271] New: [arm-elf] regex.c ICEs for thumb multilib

[Bug bootstrap/11272] make bootstrap fails while building libstdc++

[Bug bootstrap/11272] New: make bootstrap fails while building libstdc++

[Bug bootstrap/11293] Failure to configure on Solaris 2.8: error: *** unable to determine endianness

[Bug bootstrap/11297] [3.4 Regression] ICE building abi_check.cc

[Bug bootstrap/11297] ICE building abi_check.cc

[Bug bootstrap/11297] New: ICE building abi_check.cc

[Bug bootstrap/11313] New: #pragma weak and static inline functions

[Bug bootstrap/11315] New: bootstrap error with math.h after fixes 5200-01

[Bug bootstrap/11317] make bootstrap-lean fails with #error Unrecognized value in TARGET_CPU_DEFAULT

[Bug bootstrap/11317] New: make bootstrap-lean fails with #error Unrecognized value in TARGET_CPU_DEFAULT

[Bug bootstrap/11318] [3.4 regresssion] Spurious bootstrap comparison failures on sparc-sun-solaris

[Bug bootstrap/11318] New: [3.4 regresssion] Spurious bootstrap comparison failures on sparc-sun-solaris

[Bug bootstrap/11321] Internal compiler error in `schedule_block', at haifa-sched.c:6903

[Bug bootstrap/11321] New: Internal compiler error in `schedule_block', at haifa-sched.c:6903

[Bug bootstrap/11321] unknown option -m31 while bootstrapping on s390x

[Bug bootstrap/11337] GCC Bootstraping STOP on "/libstdc++-v3/"

[Bug bootstrap/11337] New: GCC Bootstraping STOP on "/libstdc++-v3/"

[Bug bootstrap/11341] [cygwin] [pch] ICE in ggc_pop_context, at ggc-page.c:1441 while compiling libstc++3

[Bug bootstrap/11341] [cygwin] ICE in ggc_pop_context, at ggc-page.c:1441 while compiling libstc++3

[Bug bootstrap/11341] New: [cygwin] ICE in ggc_pop_context, at ggc-page.c:1441 while compiling libstc++3

[Bug bootstrap/11354] GNAT ICE during make gnatlib_and_tools on Tru64 UNIX V5.1

[Bug bootstrap/11354] New: GNAT ICE during make gnatlib_and_tools on Tru64 UNIX V5.1

[Bug bootstrap/11359] New: No bootstrap for cygwin using PCH: ICE creating bits/stdc++.h.gch/O2g

[Bug bootstrap/11359] No bootstrap for cygwin using PCH: ICE creating bits/stdc++.h.gch/O2g

[Bug bootstrap/11360] New: No bootstrap for cygwin using PCH: ICE creating bits/stdc++.h.gch/O2g

[Bug bootstrap/11360] No bootstrap for cygwin using PCH: ICE creating bits/stdc++.h.gch/O2g

[Bug bootstrap/11362] New: Implicit declaration of `internal_dfa_insn_code' in insn-attrtab.c

[Bug bootstrap/11383] New: byte ordering test breaks using native sed

[Bug bootstrap/3039] Type of variable is wrong in dwarf2 debugging info

[Bug bootstrap/3163] [3.3 Only] gcc/aclocal.m4 mmap test fails on UnixWare 7.1.1

[Bug bootstrap/3163] gcc/aclocal.m4 mmap test fails on UnixWare 7.1.1

[Bug bootstrap/3355] [alphaev6-dec-osf5.0] Build of gcc3.0 fails

[Bug bootstrap/3437] [vxworks] cross-compile problem because of fixincludes

[Bug bootstrap/3525] dependency_libs in .la files are broken

[Bug bootstrap/3799] [fr30-elf] fails to build on 3.0-CVS

[Bug bootstrap/3922] [sparc-elf] embedded target makes UNIX calls

[Bug bootstrap/4068] [linux-x86] bootstrapping on glibc2.0 systems

[Bug bootstrap/4747] Encounter errors while building 2.95 gcc on i386-pc-interix (version 2.2)

[Bug bootstrap/5883] gcc-20020304 bootstrap failure on IBM SP/2 AIX 4.3: inconsistent declarations in gcc/intl/plural.y

[Bug bootstrap/6680] [alphaev5-dec-osf5.0] gcc-3.1 build fails with internal error

[Bug bootstrap/6680] genattrtab crashes on tru64 5.0

[Bug bootstrap/6743] Building gcc-3.1 failed

[Bug bootstrap/6802] [sparc-solaris2.7] && -m64 && binutils2.11.94 seems broken, causing bootstrap failure

[Bug bootstrap/6825] [Sun OS 4.1.4] gcc 3.1 fails to build

[Bug bootstrap/6858] bootstrap fails due to cpp-precomp

[Bug bootstrap/6947] /usr/software/gcc/gcc-3.1/gcc/libgcc2.c:64: internal error: Segmentation fault

[Bug bootstrap/7072] [sparc solaris] Installation .h files missing errors

[Bug bootstrap/7090] libstdc++ (or libffi) configure script fails to find install-sh when cross-compiling in srcdir

[Bug bootstrap/7093] ICE building libgcc during boostrap

[Bug bootstrap/7125] libz is built even if configured with --with-system-zlib

[Bug bootstrap/7231] boostrap failure on gcc-cvs (libstdc++)

[Bug bootstrap/7392] [i586-linux] ICE building tmp-dum.c

[Bug bootstrap/7496] [mipsisa32-elf] gcc cross compiler build problem

[Bug bootstrap/7548] gcc3.1.1 can't be bootstraped on HPUX 10.20 using HP compilers

[Bug bootstrap/7553] install problem on alpha axp with gcc-3.1.1

[Bug bootstrap/7555] make command too long during install for gcc-3.1.1 on alpha axp

[Bug bootstrap/7608] libgcj build fails

[Bug bootstrap/7692] [x86-solaris2.8] failed to bootstrap on Solaris8 x86

[Bug bootstrap/7716] can't compile getpwd.c during build

[Bug bootstrap/7727] `make install' fails when none of the localization files are installed (as controlled by LINGUAS)

[Bug bootstrap/7757] configure: error: can not find install-sh or install.sh in . ./.. ./../..

[Bug bootstrap/7790] [sparc-solaris2.8]GCC doesn't build on Solaris 2.8 (needs -liconv)

[Bug bootstrap/7791] [hpux 11.11] missing include prevents bootstrap

[Bug bootstrap/7800] underscore.c:0: malformed option `-A system=posix'

[Bug bootstrap/7817] [3.3/3.4 regression] Link to gcc man page in g++ man page incorrect

[Bug bootstrap/7817] [3.3/3.4 regression][IRIX] Link to gcc man page in g++ man page incorrect

[Bug bootstrap/7881] Cannot compile gcc-3.2 on Tru64 4.0G if gnu libiconv is installed

[Bug bootstrap/7882] HP bootstrap failure when building on PA 2.0 for PA 1.1

[Bug bootstrap/7892] [sparc-sun-solaris2.9]gcc-3.2 make bootstrap fails with default ld

[Bug bootstrap/7893] [sparc-solaris2.8]Internal compiler error in simplify_gen_subreg

[Bug bootstrap/7979] OpenUNIX8/Unixware stage 3 failing in eh_alloc.cc

[Bug bootstrap/7980] [sparc-solaris2.5.1]configure: error: *** unable to determine endianness

[Bug bootstrap/8009] Can't find library for -lintl

[Bug bootstrap/8018] 'install-headers-dir' should default to 'install-headers-cp'

[Bug bootstrap/8122] severe build problems for i586-pc-linux-gnulibc1

[Bug bootstrap/8124] GCC 3.2 make install error

[Bug bootstrap/8180] --without-headers configure option not working

[Bug bootstrap/8261] [HP-UX] internal error when trying to build hpux cross compiler

[Bug bootstrap/8303] [sparc-linux]libstdc++-v3 library fails to compile, with "internal compiler error"

[Bug bootstrap/8304] [HP UX] quadlib.c can't be found

[Bug bootstrap/8365] anon mmap configure test fails

[Bug bootstrap/8657] [aix] (sed failure) No rule to make target `bootstrap' in directory 'gcc'

[Bug bootstrap/8677] "gcc -v" should report options used for bootstrap

[Bug bootstrap/8686] [sparc-solaris]3.2.1 multilib bootstrap fails: 32-bit Solaris 9 + Sun patch 112963-01

[Bug bootstrap/8710] make bootstrap fails with error on plural.y on AIX 4.3.3

[Bug bootstrap/8717] [sparc-solaris2.8]gcc 3.2.1 fails to compile in 64-bit mode under Solaris 8

[Bug bootstrap/8752] error compiling plural.c in gcc/intl

[Bug bootstrap/8800] make install fails to find install-sh

[Bug bootstrap/8834] d30v-elf ICE during bootstrap

[Bug bootstrap/8835] mcore-elf bootstrap ICE at expr.c:2771

[Bug bootstrap/8843] gcc 3.2.1 boostrap fails on RedHat 6.2 with binutils error

[Bug bootstrap/8844] [sparc-solaris2.7,sparc-solaris2.8] Libffi can't find install-sh

[Bug bootstrap/8845] Cannot generate gcc 3.2.1 on HPUX 10.20

[Bug bootstrap/8920] [sparc-solaris2.6] Cannot compile libiberty on Solaris 2.6 inside gcc-3.2.1

[Bug bootstrap/9084] [i486]Compile error with "--target=i486-pc-linux-gnu" on i686

[Bug bootstrap/9204] [i386-pc-solaris2.8] bootstrap fails when building gcc on dell 1550

[Bug bootstrap/9382] AIX 5.2 ../../gcc-20030120/gcc/libgcc2.c:1161: internal compiler error: in extract_insn, at recog.c:2175

[Bug bootstrap/9451] Cannot build cross gcc /w shared libs

[Bug bootstrap/9498] cannot make install-no-fixedincludes, gcc-3.2.2-20030128

[Bug bootstrap/9631] [hppa64-linux] [gcc-3.3] fails to bootstrap

[Bug bootstrap/9631] [hppa64-unknown-linux-gnu] [gcc-3.2.2] fails to bootstrap

[Bug bootstrap/9697] [3.4 regression] wrong assembly emitted for m68000 __umulsidi3

[Bug bootstrap/9697] invalid instruction when building m68k cross in libiberty

[Bug bootstrap/9705] gengenrtl segfaults on athlon t-bird in v3.2.2

[Bug bootstrap/9710] [i370] Configure Error

[Bug bootstrap/9741] [hppa-linux] ICE (segfault) while building a cross compiler

[Bug bootstrap/9772] [3.3 regression] [d30v-elf] fails to build on 3.3 branch

[Bug bootstrap/9899] [tru64 5.0] genattrtab crashes

[Bug bootstrap/9968] When gxx-include-dir contains 'include', its removed...

[Bug bootstrap/9989] [HPUX 11.00, gcc 3.3] fixing of stdio.h fails

[Bug bootstrap/9992] [SCO OpenServer] Building compiler for UDK fails

[Bug bootstrap/9996] plural.c can't be found

[Bug c++/10032] [3.3/3.4 regression] -pedantic converts some errors to warnings

[Bug c++/10038] [3.3 only] ICE when trying to access multilple nested template structs

[Bug c++/10079] ICE (segfault) while substitute return type containing unresolved qualified id

[Bug c++/10108] tree checking ICE: expected var_decl, have error_mark in tsubst_decl

[Bug c++/10126] ICE in convert_nontype_argument on using overload resolution in template args

[Bug c++/10135] [3.3/3.4 Regression] Uncaught exceptions with --disable-sjlj-exceptions configured GCC

[Bug c++/10146] [3.4 regression] accepting invalid syntax "f.template foo()"

[Bug c++/10147] [3.3/3.4 regression] Confusing error message for invalid template function argument

[Bug c++/1016] friend class declarations not observing namespace rules.

[Bug c++/10200] Weird clash with same names in different scopes

[Bug c++/10207] Empty structure initialization fails under C++ (but works under C)

[Bug c++/10219] [3.4 regression] ICE in maybe_adjust_types_for_deduction on invalid code

[Bug c++/10248] including system headers makes g++ barf

[Bug c++/10269] ncurses function in class causes malloc() syscall to loop infinitly

[Bug c++/10291] error referencing a static local from a local struct in template code

[Bug c++/10310] [3.4 regression] [New parser] ICE on illegal use of template keyword

[Bug c++/10316] [3.3/3.4 regression] Very long compile time when exceptions enabled

[Bug c++/10345] [3.3/3.4 regression] Misleading error message for binding rvalue to reference

[Bug c++/10398] [3.4 regression] ICE with missing typename keyword

[Bug c++/10432] [3.3/3.4 regression] ICE in poplevel, at cp/decl.c:1230

[Bug c++/10433] [3.4 regression] [New parser] SegFault in type_unknown_p with sizeof

[Bug c++/10468] [3.3 Regression] const typeof(x) is non-const, but only in templates

[Bug c++/10476] [3.4 regression] ICE in ocp_convert, at cp/cvt.c:652

[Bug c++/10527] [3.3/3.4 regression] confused error message with "new int()" parameter initializer

[Bug c++/10558] [3.3 regression] Segfault on illegal use of template without template args

[Bug c++/10594] [3.3 regression] ICE (segfault) on error recovering in weird code

[Bug c++/10603] [3.4 regression] failing to print problematic token upon parse error

[Bug c++/10617] [3.3 regression] ICE in poplevel at cp/decl.c:1296 when defining a function with invalid return type

[Bug c++/10627] improve error message when a template is used without argument list

[Bug c++/10635] [3.3/3.4 regression] ICE (segfault) when dereferencing an incomplete type casted from a void pointer

[Bug c++/10646] [3.3/3.4 regression] non-const reference is incorrectly matched in a "const T" partial specialization

[Bug c++/10694] Befriending a function in a class that is only forward-declared

[Bug c++/10709] [3.3 regression] ICE in poplevel at cp/decl.c:1296 when using an invalid member from a template

[Bug c++/10712] [3.3/3.4 regression] ICE in constructor_name_full, at cp/decl2.c:1255

[Bug c++/10722] [3.3 regression] ICE (segfault) with invalid specialization

[Bug c++/10749] [3.3 regression] triple nested template classes in namespace need to qualify ns

[Bug c++/10749] [3.3/3.4 regression] triple nested template classes in namespace need to qualify ns

[Bug c++/10750] [3.4 regression] error with using template template expression in static const initializer

[Bug c++/10761] [3.4 regression] wrong virtual function called

[Bug c++/10762] [3.4 regression] [New parser] failure on illegal templated type declared with 'using'

[Bug c++/10784] Warning about choosing custom operator over copy constructor cannot be turned off (and it's useless in the first place)

[Bug c++/10793] [3.4 regression] ICE (treecheck) when partial-specializing with an invalid type and a base class, in xref_basetypes, at cp/decl.c:12834

[Bug c++/10796] [3.3/3.4 regression] ICE (segfault) when defining an enum with two values: -1 and MAX_INT_64BIT

[Bug c++/10804] [3.4 regression] missing implicit instantiation of template static methods

[Bug c++/10816] [3.3/3.4 regression] warning message refers to lines which don't exist

[Bug c++/10820] [3.3 regression] ICE in poplevel with attributes

[Bug c++/10832] Cannot define an out-of-class explicit specialization of a template constructor of a specialized template class.

[Bug c++/10845] [3.3/3.4 regression] template member function (getting a nested template as parameter) cannot be called anymore if another unrelated template member function is defined.

[Bug c++/10849] [3.3 regression] Cannot define an out-of-class specialization of a private nested template class

[Bug c++/10849] [3.3/3.4 regression] Cannot define an out-of-class specialization of a private nested template class

[Bug c++/10864] Unreadable error message for "no match for 'A < B' operator" if A,B are templates

[Bug c++/10888] [3.3/3.4 regression] inlining failure for allocate in ~vector()

[Bug c++/10896] Unable to compile c++ program using gcc 3.0

[Bug c++/10898] [3.3 regression] ICE on illegal template parameter (resume_binding_level, at cp/decl.c:598)

[Bug c++/10915] a not-useful non-avoidable warning: conversion to a reference to the same type will never use a type conversion operator

[Bug c++/10916] parse error when trying to create iterator with a template

[Bug c++/10926] ICE in build_delete when trying to declare template destructor

[Bug c++/10929] [3.3/3.4 regression] -Winline warns about functions for which no definition is visible

[Bug c++/10930] g++-3.3 should warn about class/struct equivalence

[Bug c++/10931] [3.3/3.4 regression] valid conversion static_cast<const unsigned int&>(lvalue-of-type-int) is rejected

[Bug c++/10939] [3.3/3.4 regression] ICE with templated code

[Bug c++/10940] [3.3/3.4 regression] Bad code with explicit specialization

[Bug c++/10952] ICE (segfault) in redeclare_class_template at cp/pt.c:2999

[Bug c++/10953] [3.4 regression] ICE in cp_parser_function_definition at cp/parser.c:10931

[Bug c++/10968] [3.3/3.4 regression] If member function implicitly instantiated, explicit instantiation of class fails to instantiate it

[Bug c++/10990] [3.3/3.4 regression] Cannot convert with dynamic_cast<> to a private base class from within a member function

[Bug c++/11006] [3.3/3.4 regression] [CNI] ICE with use of __java_boolean

[Bug c++/11021] [3.3/3.4 regression] [cygwin/mingw]: Inheriting a virtual method from a dllimport'd base class->segfault

[Bug c++/11024] [3.4 regression] ICE in tsubst_decl at cp/pt.c:5988

[Bug c++/11025] [3.3 regression] ICE (segfault) in tsubst_decl

[Bug c++/11026] [Darwin] g++ does instantiate static data members of templates

[Bug c++/11027] [3.4 regression] Error with static array of pointer-to-member-functions

[Bug c++/11030] Cannot befriend a template specialization

[Bug c++/11030] two-stage name lookup: Cannot befriend a template specialization

[Bug c++/11034] name wrongly found in dependent base class (14.6.2)

[Bug c++/11034] two-stage name lookup: name wrongly found in dependent base class (14.6.2)

[Bug c++/11036] typedef-name used in an elaborated-type-specifier is incorrectly accepted

[Bug c++/11039] [3.3 regression] Bad interaction between implicit typename deprecation and friendship

[Bug c++/11041] [3.3/3.4 regression] ICE: const myclass &x = *x; (when operator*() defined)

[Bug c++/11041] ICE: const myclass &x = *x; (when operator*() defined)

[Bug c++/11049] [3.4 regression] -fdump-class-hierarchy causes tree checking failure

[Bug c++/11050] [3.4 regression] "some string" __FUNCTION__ is accepted

[Bug c++/11058] [PCH] ICE on using precompiled header; Alpha Red Hat 7.1 Linux

[Bug c++/11058] New: ICE on using precompiled header; Alpha Red Hat 7.1 Linux

[Bug c++/11061] Internal Compiler Error in g++-2.95.4 while using multiple templates

[Bug c++/11061] New: Internal Compiler Error in g++-2.95.4 while using multiple templates

[Bug c++/11063] [3.3/3.4 Regression] ICE on parsing initialization list of const array member

[Bug c++/11063] ICE on parsing initialization list of const array member

[Bug c++/11063] New: ICE on parsing initialization list of const array member

[Bug c++/11067] [3.3/3.4 regression] Strange warning with abstract virtual inline function

[Bug c++/11067] New: [3.3/3.4 regression] Strange warning with abstract virtual inline function

[Bug c++/11069] C++ Standard Violation (15.3.3)

[Bug c++/11069] New: C++ Standard Violation (15.3.3)

[Bug c++/11070] [3.4 regression] ICE in regenerate_decl_from_template after forgotten template for disambiguation

[Bug c++/11070] New: [3.4 regression] ICE in regenerate_decl_from_template after forgotten template for disambiguation

[Bug c++/11071] [3.4 regression] ICE in regenerate_decl_from_template after forgotten template for disambiguation, part 2

[Bug c++/11071] New: [3.4 regression] ICE in regenerate_decl_from_template after forgotten template for disambiguation, part 2

[Bug c++/11072] [3.4 regression] Implementation of offsetof macro

[Bug c++/11072] New: [3.4 regression] Implementation of offsetof macro

[Bug c++/11073] [sparc] -O3 and -Wcast-align generate "increases required alignment" warnings

[Bug c++/11073] New: Optimizer -O3 with -Wcast-align generate "increases required alignment" warnings

[Bug c++/11076] ICE with invalid base class

[Bug c++/11076] New: ICE with invalid base class

[Bug c++/11077] enumerator value in template not assignable from bool

[Bug c++/11077] New: enumerator value in template not assignable from bool

[Bug c++/11078] ICE in write_type with typeof and templates

[Bug c++/11078] ICE with typeof and templates

[Bug c++/11078] New: typeof and templates.... internal compiler error

[Bug c++/11080] g++ fails to compile Daixtrose

[Bug c++/11080] New: g++ fails to compile Daixtrose

[Bug c++/11089] New: ICE: instantiate_virtual_regs_lossage

[Bug c++/11091] New: Wrong code in variable initialization

[Bug c++/11091] Wrong code in variable initialization

[Bug c++/11094] incomplete static member breaks sizeof containing template class

[Bug c++/11094] New: incomplete static member breaks sizeof containing template class

[Bug c++/11095] New: C++ iostream manipulator causes segfault when called iwth negative argument

[Bug c++/11098] g++ doesn't emit complete debugging information for local variables in destructors

[Bug c++/11098] New: g++ doesn't emit complete debugging information for local variables in destructors

[Bug c++/11104] GCC gets stuck when streampos is typedefed

[Bug c++/11104] New: GCC gets stuck when streampos is typedefed

[Bug c++/11105] [3.3/3.4 regression of sorts] ICE in mangle_conv_op_name_for_type

[Bug c++/11105] New: [3.3/3.4 regression of sorts] ICE in mangle_conv_op_name_for_type

[Bug c++/11106] Error message gives partially mangled operator name

[Bug c++/11106] New: Error message gives partially mangled operator name

[Bug c++/11107] Crash on template member call / static data member inititalization

[Bug c++/11107] New: Crash on template member call / static data member inititalization

[Bug c++/11108] <iostream> causes transform() to not compile with tolower()

[Bug c++/11108] New: <iostream> causes transform() to not compile with tolower()

[Bug c++/11110] New: segfault when compiling exception template

[Bug c++/11110] segfault when compiling exception template

[Bug c++/11111] Exception in shared library gets only caught when lib is process local

[Bug c++/11111] New: Exception in shared library gets only caught when lib is process local

[Bug c++/11112] New: wrong warning when classes have private destructors and their first member functions are not static.

[Bug c++/11112] wrong warning when classes have private destructors and their first member functions are not static.

[Bug c++/11113] explicit instantiation of a typedef not diagnosed

[Bug c++/11113] New: explicit specialization of a typedef not diagnosed

[Bug c++/11116] [3.4 regression] misleading error message when template argument is forgotten

[Bug c++/11116] New: [3.4 regression] misleading error message when template argument is forgotten

[Bug c++/11118] [3.4 only] missleading error message on missing typename

[Bug c++/11118] New: Regression in 3.4 (cvs from jun 06) using nested classes in templates

[Bug c++/11118] Regression in 3.4 (cvs from jun 06) using nested classes in templates

[Bug c++/11119] New: using forward declared classes in templates

[Bug c++/11119] using forward declared classes in templates

[Bug c++/11120] [3.4 regression] template method used as function pointer does not get emitted

[Bug c++/11120] New: gcc 3.4 doesn't emit code for template methods used through function pointers

[Bug c++/11131] New: Unrelated declaration removes inline flag from function

[Bug c++/11131] Unrelated declaration removes inline flag from function

[Bug c++/11132] [3.4 Regression] tree-check failure after error for invalid template

[Bug c++/11132] New: tree-check failure after error for invalid template

[Bug c++/11132] tree-check failure after error for invalid template

[Bug c++/11133] Inernal compiler error when compiling xerxes 2.3.0

[Bug c++/11133] New: Inernal compiler error when compiling xerxes 2.3.0

[Bug c++/11134] DWARF Problems with const int globals

[Bug c++/11134] DWARF-2/3 Problems with const int globals

[Bug c++/11134] New: DWARF Problems with const int globals

[Bug c++/11137] [3.3 Regression] Linux shared library constructors not called unless there's one global object

[Bug c++/11137] New: Linux shared library constructors not called unless there's one global object

[Bug c++/11138] "no match" error when there is a match ...

[Bug c++/11138] New: "no match" error when there is a match ...

[Bug c++/11142] g++ segfaults with -Wunreachable-code

[Bug c++/11143] cannot use '-V' option with g++

[Bug c++/11143] New: cannot use '-V' option with g++

[Bug c++/11145] New: Overloading math functions sometimes fails if not in std namespace

[Bug c++/11145] Overloading math functions sometimes fails if not in std namespace

[Bug c++/11148] Incorrect codegen for explicit template instantiation, with ICE for error cases

[Bug c++/11148] New: Incorrect codegen for explicit template instantiation, with ICE for error cases

[Bug c++/11149] [3.3/3.4 Regression] ICE on error when instantiation with call function of a base type

[Bug c++/11149] New: [3.3/3.4 Regression] ICE on error when instantiation with call function of a base type

[Bug c++/11150] [3.3/3.4 Regression] No code generated with explicit template instantiation

[Bug c++/11150] New: [3.3/3.4 Regression] No code generated with explicit template instantiation

[Bug c++/11152] New: SIGSEGV on a simple static method when using -O3

[Bug c++/11154] [3.3/3.4 regression] spurious ambiguity report for template class specialization

[Bug c++/11154] New: g++-3.3 reports ambiguous class template instantiation for non-ambiguous specialization

[Bug c++/11157] Annoying warning message

[Bug c++/11157] New: Annoying warning message

[Bug c++/11158] Annoying warning message

[Bug c++/11158] New: Annoying warning message

[Bug c++/11159] errornous warning in copy ctor with virtual inheritance

[Bug c++/11159] New: errornous warning in copy ctor with virtual inheritance

[Bug c++/11160] Inappropriate error message

[Bug c++/11160] New: Inappropriate error message

[Bug c++/11161] internal compiler error

[Bug c++/11161] New: internal compiler error

[Bug c++/11163] Can't pass tolower as a parameter

[Bug c++/11163] New: Can't pass tolower as a parameter

[Bug c++/11168] New: public inline methods should be kept in .o file

[Bug c++/11168] public inline methods should be kept in .o file

[Bug c++/11170] New: bug in ctype_inline.h header file (undefined __istype will break compilation)

[Bug c++/11174] derived class can access protected base class member function through pointer to member function

[Bug c++/11174] New: derived class can access protected base class member function through pointer to member function

[Bug c++/11176] gcc random crash

[Bug c++/11176] New: gcc random crash

[Bug c++/11177] Error when calling operator() from temporary object in conditional

[Bug c++/11177] New: Error when calling operator() from temporary object in conditional

[Bug c++/11179] New: valarray resize error

[Bug c++/11182] gcc should warn when assigning unassigned variables

[Bug c++/11182] gcc should warn when assigning unassigned variables when not optimizating

[Bug c++/11182] New: gcc should warn when assigning unassigned variables

[Bug c++/11187] New: signed/unsigned conversion behaves differently

[Bug c++/11190] ICE in output_operand (wrong address) with static and -fPIC

[Bug c++/11190] New: ICE in output_operand (wrong address) with static and -fPIC

[Bug c++/11191] Applying format attribute to member functions is off by one

[Bug c++/11191] New: Applying format attribute to member functions is off by one

[Bug c++/11196] New: parse error before numeric constant

[Bug c++/11196] parse error before numeric constant

[Bug c++/11199] New: template

[Bug c++/11199] template

[Bug c++/11200] C++ front end accepts long long double

[Bug c++/11200] New: C++ front end accepts long long double

[Bug c++/11201] g++ -pedantic -O fails compile #include <cstdio>

[Bug c++/11201] New: g++ -pedantic -O fails compile #include <cstdio>

[Bug c++/11204] Link error when invoking non-implicit c'tor by hand

[Bug c++/11204] New: Link error when invoking non-implicit c'tor by hand

[Bug c++/11211] New: trivial static initializers of const objects should be done at compile time

[Bug c++/11211] trivial static initializers of const objects should be done at compile time

[Bug c++/11223] dynamic_cast<> in shared library fails with SegFault when called from JNI

[Bug c++/11223] New: dynamic_cast<> in shared library fails with SegFault when called from JNI

[Bug c++/11224] [3.3/3.4 regression] warning "value computed is not used" no longer emitted

[Bug c++/11224] [regression] warning "value computed is not used" no longer emitted

[Bug c++/11224] New: [regression] warning "value computed is not used" no longer emitted

[Bug c++/11225] comiler segfaults on stl_iterator_base_types.h:84

[Bug c++/11225] New: comiler segfaults on stl_iterator_base_types.h:84

[Bug c++/11228] [3.3/3.4 regression] ICE on new-expression using array operator new and default-initialization

[Bug c++/11228] New: ICE on new-expression using array operator new and default-initialization

[Bug c++/11230] New: Qualified name lookup (as per 3.4.3.1) is broken;

[Bug c++/11230] Qualified name lookup (as per 3.4.3.1) is broken;

[Bug c++/11235] New: pointer to memer function

[Bug c++/11235] pointer to memer function

[Bug c++/11236] [3.3 regression] ICE (segfault) with a statement containing only the name of a member function

[Bug c++/11236] g++ (cc1plus) crashes after heavy memory consumption, after error: statement cannot resolve overloaded function.

[Bug c++/11236] New: g++ (cc1plus) crashes after heavy memory consumption, after error: statement cannot resolve overloaded function.

[Bug c++/11237] Internal Compiler Error (segfault) in convert_from_reference at cvt.c:568

[Bug c++/11237] New: Internal Compiler Error (segfault) in convert_from_reference at cvt.c:568

[Bug c++/11238] A constructor with exception handler rethrows the exception to the constructor caller

[Bug c++/11238] New: A constructor with exception handler rethrows the exception to the constructor caller

[Bug c++/11242] #include <memory> takes my memory directory instead of the standard memory header file

[Bug c++/11242] New: #include <memory> takes my memory directory instead of the standard memory header file

[Bug c++/11247] -frepo fails to instantiate typeinfo

[Bug c++/11247] New: -frepo fails to instantiate typeinfo

[Bug c++/11249] [3.4 Regression]Too many similar declarations cause crash in the name mangler

[Bug c++/11249] New: Too many similar declarations cause crash in the name mangler

[Bug c++/11249] Too many similar declarations cause crash in the name mangler

[Bug c++/11253] New: Parsing error with anonymous class instantiation

[Bug c++/11253] Parsing error with anonymous class instantiation

[Bug c++/11254] g++ (3.3): ...Error: Field out of range (optimisation pb)

[Bug c++/11254] New: g++ (3.3): ...Error: Field out of range (optimisation pb)

[Bug c++/11257] Almost all libstdc++-v3 tests in testsuite fail

[Bug c++/11257] New: Almost all libstdc++-v3 tests in testsuite fail

[Bug c++/11262] New: internal compiler error: Segmentation fault

[Bug c++/11266] [tree-ssa] ICE with placement new

[Bug c++/11266] New: [tree-ssa] ICE with placement new

[Bug c++/11267] [tree-ssa] ICE with variable-sized arrays

[Bug c++/11267] New: [tree-ssa] ICE with variable-sized arrays

[Bug c++/11274] [3.3/3.4 regression] Segfault in hash_type

[Bug c++/11274] [3.4 regression] Segfault

[Bug c++/11274] [3.4 regression] Segfault in hash_type

[Bug c++/11274] New: [3.4 regression] Segfault

[Bug c++/11275] gcc296 and gcc322 leads to different double-type calculation results.

[Bug c++/11275] New: gcc296 and gcc322 leads to different double-type calculation results.

[Bug c++/11276] New: Segfault with multiple inheritance after syntax error

[Bug c++/11276] Segfault with multiple inheritance after syntax error

[Bug c++/11282] [3.3 regression] Infinite memory usage after syntax error

[Bug c++/11282] New: [3.3 regression] Infinite memory usage after syntax error

[Bug c++/11283] [3.4 regression]

[Bug c++/11283] [3.4 regression] ICE in build_conditional_expr

[Bug c++/11283] [3.4 regression] ICE in build_conditional_expr with vector<bool>

[Bug c++/11283] New: [3.4 regression]

[Bug c++/11284] Bad code generation with "warning: the address ... will always be `true'"

[Bug c++/11284] ICE on valid code in 3.3

[Bug c++/11284] New: Bad code generation with "warning: the address ... will always be `true'"

[Bug c++/11285] GCC 3.3 C++ for Sparc Solaris assumes system header files are C.

[Bug c++/11285] New: GCC 3.3 C++ for Sparc Solaris assumes system header files are C.

[Bug c++/11289] g++ don't recognize static template-member

[Bug c++/11289] New: g++ don't recognize static template-member

[Bug c++/11291] New: Segmentation fault in middle of error printing

[Bug c++/11291] Segmentation fault in middle of error printing

[Bug c++/11294] ICE in resolve_offset_ref, at cp/init.c: 1886

[Bug c++/11294] New: ICE in resolve_offset_ref, at cp/init.c: 1886

[Bug c++/11295] *reinterpret_cast<std::string *> causes ICE

[Bug c++/11295] [3.3/3.4 Regression] *reinterpret_cast<std::string *> causes ICE

[Bug c++/11295] [3.3/3.4 regression] ICE in cp_expr_size, at cp/cp-lang.c:314 when using a non-trivial object in a compound statement expression

[Bug c++/11295] New: *reinterpret_cast<std::string *> causes ICE

[Bug c++/11296] New: gcc 3.2 fails to honor 14.6.4.2, p1, bullet 1

[Bug c++/11296] Unqualified lookup should only use the definition context, if the funciton call is dependent (§14.6.4.2, p1, bullet 1)

[Bug c++/11308] ICE when calling a function on an enum type

[Bug c++/11308] New: ICE when calling a function on an enum type

[Bug c++/11309] New: Testsuite failures in g++.dg/expr/anew1.C (and anew2.C anew3.C anew4.c)

[Bug c++/11314] New: unqualified lookup prefers functions to non-functions

[Bug c++/11314] unqualified lookup prefers functions to non-functions

[Bug c++/11316] 3.3 ICE with empty constructor

[Bug c++/11316] New: 3.3 ICE with empty constructor

[Bug c++/11323] New: Template parsing error

[Bug c++/11323] Template parsing error

[Bug c++/11326] C++ IA64 ABI: 3.1.4: sometimes pointer to temporary return value is implicit first parameter preceding “this”

[Bug c++/11326] New: C++ IA64 ABI: 3.1.4: sometimes pointer to temporary return value is implicit first parameter preceding “this”

[Bug c++/11328] New: userdefined implicit typecast returns wrong reference

[Bug c++/11328] userdefined implicit typecast returns wrong reference

[Bug c++/11329] Compiler cannot find user defined implicit typecast

[Bug c++/11329] New: Compiler cannot find user defined implicit typecast

[Bug c++/11331] [Regression 3.4] ld: BFD 2.14.90 20030602 internal error

[Bug c++/11331] New: [Regression 3.4] ld: BFD 2.14.90 20030602 internal error

[Bug c++/11332] [3.3?/3.4 regression] Spurious error with casts in ?: expression

[Bug c++/11332] New: [3.3?/3.4 regression] Spurious error with casts in ?: expression

[Bug c++/11338] [3.3/3.4 Regression] [DR 214] Function template overload resolution failure

[Bug c++/11338] New: Function template overload resolution failure

[Bug c++/11339] cannot instantiate class derived from base with public virtual destructor and private operator delete

[Bug c++/11339] New: cannot instantiate class derived from base with public virtual destructor and private operator delete

[Bug c++/11340] New: Overload Resolution Failure Vis-a-Vis Broken Signature

[Bug c++/11340] Overload Resolution Failure Vis-a-Vis Broken Signature

[Bug c++/11342] Method selection warning prevents compilation

[Bug c++/11342] New: Method selection warning prevents compilation

[Bug c++/11343] New: Partial specialization doesn't work with template parameters, that are templates itself

[Bug c++/11343] Partial specialization doesn't work with template parameters, that are templates itself

[Bug c++/11344] [3.3/3.4 Regression] templates + friend + name conflict = ICE

[Bug c++/11344] New: templates + friend + name conflict = ICE

[Bug c++/11345] [3.3.1/3.4 regression] ICE in build_base_patch

[Bug c++/11345] C++ regression from 3.3.0

[Bug c++/11345] New: C++ regression from 3.3.0

[Bug c++/11347] ICE on valid expression in default value for int argument to inner template.

[Bug c++/11347] New: ICE on valid expression in default value for int argument to inner template.

[Bug c++/11348] internal compiler error: tree check: expected var_decl, have error_mark in tsubst_decl, at cp/pt.c:5872

[Bug c++/11348] New: internal compiler error: tree check: expected var_decl, have error_mark in tsubst_decl, at cp/pt.c:5872

[Bug c++/11351] New: typedef to nested template causes error

[Bug c++/11351] typedef to nested template causes error

[Bug c++/11355] compilation involving static class members is affected by the presence of virtual destructor

[Bug c++/11355] New: compilation involving static class members is affected by the presence of virtual destructor

[Bug c++/11357] New: no conversion of build-in binary operator argument attempted

[Bug c++/11357] no conversion of build-in binary operator argument attempted

[Bug c++/11363] Execution order is not correct

[Bug c++/11363] New: Execution order is not correct

[Bug c++/11367] [3.4 regression] undefined references for static template member functions

[Bug c++/11367] New: undefined references for static template member functions

[Bug c++/11367] undefined references for static template member functions

[Bug c++/11374] Call by reference using enum casted to int passes in wrong address

[Bug c++/11374] New: Call by reference using enum casted to int passes in wrong address

[Bug c++/11376] [3.3/3.4 regression] mozilla-1.4 miscompiled

[Bug c++/11376] New: [3.3/3.4 regression] mozilla-1.4 miscompiled

[Bug c++/11382] G++ emits spurious "inlining failed" warnings

[Bug c++/11382] New: G++ emits spurious "inlining failed" warnings

[Bug c++/11384] New: [3.4 regression] missing implicit instantiation of template static members

[Bug c++/157] ICE in pop_binding, at cp/decl.c:1187

[Bug c++/1833] Temporary rvalue (result of cast) can be illegally bound to non-const reference

[Bug c++/189] parse error in qualified member name lookup

[Bug c++/2094] unimplemented: use of `ptrmem_cst' in template type unification

[Bug c++/2200] -finstrument-functions doesn't work with exceptions?

[Bug c++/2200] -finstrument-functions should work with exceptions

[Bug c++/2204] G++ doesn't check (member) function parameter for abstract-ness.

[Bug c++/2330] static_cast<>() to a private base is allowed

[Bug c++/2478] problem with pointers to arrays and VLA

[Bug c++/2949] incorrect Koenig lookup of friend functions

[Bug c++/3079] ICE in c_expand_expr, at c-common.c:3521

[Bug c++/3187] [3.3/3.4 Regression] gcc lays down two copies of constructors

[Bug c++/3187] [3.3/3.4 Regression] gcc-3.0 prerelease lays down two copies of constructors

[Bug c++/3187] gcc-3.0 prerelease lays down two copies of constructors

[Bug c++/3671] cannot deduce enum template parameter with multiple overloads

[Bug c++/3713] Pointers to functions or member functions are not folded or inlined

[Bug c++/3761] ICE in check_template_shadow, at cp/pt.c:2013, with friend and strange class hierarchy

[Bug c++/3765] member using declaration can't change access from public

[Bug c++/3907] nested template parm collides with member name

[Bug c++/4403] incorrect class becomes a friend in template

[Bug c++/4672] [3.3/3.4 Regression] [DR 214] Template parameter deduction fails for overloaded template functions.

[Bug c++/4794] gcc hangs on small, simple code fragment

[Bug c++/4907] [3.3/3.4 regression] ICE in make_decl_rtl, at varasm.c:797 if a reference is used during its own definition

[Bug c++/4926] Segmentation Fault on Legal Code

[Bug c++/4933] tree_list not supported by dump_expr

[Bug c++/495] ICE in in lookup_template_class, at cp/pt.c:3961

[Bug c++/5247] Memory eating infinite loop on default parameter in constructor which is reference to class

[Bug c++/5293] [3.3/3.4 regression] confusing message when binding a temporary to a reference

[Bug c++/5390] Libiberty fails to demangle multi-digit template parameters.

[Bug c++/5754] [3.3 regression] g++ segfaults on compilation of template-enriched code

[Bug c++/5754] [3.3/3.4 regression] g++ segfaults on compilation of template-enriched code

[Bug c++/5754] [3.3] g++ segfaults on compilation of template-enriched code

[Bug c++/5] [1.36.3/1.37/.../3.2/3.3/3.4 regression] C++ sucks, can't you make it better?

[Bug c++/6057] expression mangling doesn't work for operator new

[Bug c++/6190] T::C.X is accepted, although it should read T::C::X

[Bug c++/6262] [3.4 regression] ICE when applying sizeof() to non-static class member

[Bug c++/6392] Problems with __restrict__ type qualifier (array)

[Bug c++/6682] [3.3 regression] ICE (segfault) while parsing an invalid identifier in function declaration

[Bug c++/6706] [3.4 regression] ICE with variable-sized arrays and DWARF-1 output

[Bug c++/6730] Crash involving templates when compiling program

[Bug c++/6771] [3.4 regression] [cygwin] ICE in in rest_of_compilation, at toplev.c:3761 for code with dllimport/dllexport

[Bug c++/6785] Core dump from g++ 3.0.4 (on Linux)

[Bug c++/6857] Missing space after pointer/reference types in warning.

[Bug c++/6880] Inefficient Copy constructor generation

[Bug c++/6949] [3.3/3.4 regression] ICE in tsubst_decl, at cp/pt.c:5733

[Bug c++/7033] [3.3/3.4 regression] Partial template specializations accepted even if a template parameter is used in a non-deduced context

[Bug c++/7307] -pedantic makes errors to warnings

[Bug c++/7313] variable declared but not defined with "C" linkage placed in enclosing namespace at link time

[Bug c++/7393] gcc / g++ says "Internal compiler error"

[Bug c++/7588] Built-in functions not marked as such

[Bug c++/7682] [HP UX] bug on hp making the gcc dump undefined type info name for a class

[Bug c++/7737] g++ ver 3.2 Internal Compiler Error

[Bug c++/7809] befriending inaccessible names

[Bug c++/7855] [3.3 regression] Wrong line number specified in error / warning message

[Bug c++/7874] [3.3/3.4 regression] g++ finds friend functions defined in class-definition but not declared in the enclosing namespace

[Bug c++/7876] g++ doesn't diagnose One Reference Rule violation

[Bug c++/7877] Incorrect parameter passing to specializations of member function templates

[Bug c++/7910] [3.3/3.4 regression] [cygwin] Seg fault when compiling OpenSceneGraph 0.9.1

[Bug c++/7939] [3.3/3.4 regression] ICE on function template specialization

[Bug c++/8046] ICE on illegal code involving destructor being treated as bit-not expression

[Bug c++/8047] [i386] Stack corruption with exceptions

[Bug c++/8057] [3.3/3.4 regression] Templates/non-templates and warnings about statements without effects

[Bug c++/8164] [3.3 regression] ICE when using different const expressions as template parameter

[Bug c++/8206] [parser] segfault on redefinition of constructor and missing semicolon, when function declared in inside constructor

[Bug c++/8222] Keyword 'template' required to access member templates in non-dependent postifx expressions

[Bug c++/8240] ICE, Internal compiler error in expand_call, at calls.c:3049

[Bug c++/8266] Explicit instantiation of a template outside its namespace is broken

[Bug c++/8355] befriending a template specialization in another namespace

[Bug c++/8442] [3.4 regression] ICE on nested template classes

[Bug c++/8586] -Wwrite-strings should be included in -Wall

[Bug c++/8806] gcc accepts bad argument for template template parameter

[Bug c++/8856] [3.3/3.4 regression] g++ accepts invalid conversion-function-id

[Bug c++/8861] [3.3/3.4 regression] [ABI] mangling floating point literal in template arg expression

[Bug c++/8861] [ABI] mangling floating point literal in template arg expression

[Bug c++/8876] [3.4 regression] ICE in resolve_offset_ref, at cp/init.c:1824

[Bug c++/8897] Demangling of template conversion operators

[Bug c++/8963] [3.3/3.4 regression] [ABI] The same template instance is mangled with 2 different names

[Bug c++/8986] [3.3 regression] ICE with segfault on include inside namespace

[Bug c++/9154] [3.4 regression] poor error message for ">>" vs. "> >" for nested template args

[Bug c++/9162] [3.4 regression][New parser] Problem with default argument in a friend function

[Bug c++/9259] Calling a non-qualified member function within a sizeof() expression leads to "invalid use of undefined type"

[Bug c++/9280] Internal compiler error in convert_from_eh_region_ranges_1

[Bug c++/9311] [3.3 regression] ICE on illegal code using templates and inheritance

[Bug c++/9338] ICE in peculiar templated constructors

[Bug c++/9381] [3.4 regression] [new parser] rejects attribute on member function pointer

[Bug c++/9393] [3.3 regression] Anonymous namespaces and compiling the same file twice

[Bug c++/9435] [Sparc] internal compiler error: in simplify_gen_subreg, at simplify-rtx.c

[Bug c++/9436] passing a class template followed by a template value of this class

[Bug c++/9447] [3.4 regression] using Base<T>::member does not work

[Bug c++/9483] [3.3/3.4 regression] Member with same name as class allowed

[Bug c++/9483] [3.4 regression] [New parser] Member with same name as class allowed

[Bug c++/9483] [3.4 regression] Member with same name as class allowed

[Bug c++/9556] [sparc-sun-solaris2.8] problem in dynamic casting with gcc 3.2.1

[Bug c++/9559] [3.3/3.4 regression] ICE with invalid initialization of a static const member

[Bug c++/9574] [3.4 regression] Error accessing static member with custom operator []

[Bug c++/9634] [3.4 regression] [DR224] Injected class name as qualifier should not make the name dependent

[Bug c++/9649] [3.3/3.4 regression] ICE in finish_member_declaration at cp/semantics.c:1850 when redeclaring a static member variable

[Bug c++/9712] [3.4 regression] __PRETTY_FUNCTION__ in function try block causes ICE

[Bug c++/9738] [3.3 regression] [mingw] Internal compiler error in rest_of_compilation, at toplev.c: 3491

[Bug c++/9779] [3.4 regression] ICE in type_unknown_p when casting in static member

[Bug c++/9810] Using-declaration for template functions does not work

[Bug c++/9848] [3.3/3.4 regression] missing 'unused parameter' warning.

[Bug c++/9871] Crash in __tcf_0 local cleanup called from __libc_start_main at end of program

[Bug c++/9907] [3.4 regression] sizeof considered as non constant

[Bug c/10148] [3.3 regression] [MingW/CygWin] Compiler dumps core

[Bug c/10178] [3.4 regression] ICE in tree_low_cst

[Bug c/10602] [3.3/3.4 regression] ICE in c-typeck.c (tree check failure)

[Bug c/10735] ICE on incorrect type conversion with vector

[Bug c/10735] ICE on type conversion with vector

[Bug c/10892] do not Suggest attributes in ANSI mode

[Bug c/10934] funny symbols when compiling libXaw from Xfree-86-4 4.3.0

[Bug c/10962] [3.3/3.4 regression] lookup_field is a linear search on a linked list (can be slow if large struct)

[Bug c/11007] internal error reported in linux kernel compilation

[Bug c/11056] ice in ix86_expand_binop_builtin with -mmmx

[Bug c/11056] New: ice in ix86_expand_binop_builtin with -mmmx

[Bug c/11057] ice in extract_constrain_insn_cached with -fcall-saved-mm0

[Bug c/11057] New: ice in extract_constrain_insn_cached with -fcall-saved-mm0

[Bug c/11092] ICE: unrecognizable insn (vector constant)

[Bug c/11092] New: ICE: unrecognizable insn (vector constant)

[Bug c/11093] internal compiler error when compiling -O3 in ncurses-5.3

[Bug c/11093] New: internal compiler error when compiling -O3 in ncurses-5.3

[Bug c/11101] Kernel compilation error only with 3.3 gcc version

[Bug c/11103] New: asm-specifier conflicts with asm clobber list

[Bug c/11122] gcc: Internal error: Illegal instruction (program cc1) on GSL 1.3 cblas/test_rotg.c

[Bug c/11122] New: gcc: Internal error: Illegal instruction (program cc1) on GSL 1.3 cblas/test_rotg.c

[Bug c/11128] gcc: Internal error: Illegal instruction (program cc1)

[Bug c/11128] New: gcc: Internal error: Illegal instruction (program cc1)

[Bug c/11136] [SPARC64] gcc creates incorrect code for passing parameters which are structs

[Bug c/11136] gcc -m64 creates incorrect code for passing parameters which are structs

[Bug c/11136] New: gcc -m64 creates incorrect code for passing parameters which are structs

[Bug c/11151] __builtin_return(__builtin_apply(...)) gives wrong result

[Bug c/11151] New: __builtin_return(__builtin_apply(...)) gives wrong result

[Bug c/11164] ld: Unsatisfied symbol "_Unwind_Resume"

[Bug c/11164] New: ld: Unsatisfied symbol "_Unwind_Resume"

[Bug c/11167] Migrating application from solaris 2.5.1 to Solaris8

[Bug c/11167] New: Migrating application from solaris 2.5.1 to Solaris8

[Bug c/11173] (lseek (0, 0L, SEEK_CUR) < 0) is ALWAYS false, even if lseek IS negative

[Bug c/11173] New: (lseek (0, 0L, SEEK_CUR) < 0) is ALWAYS false, even if lseek IS negative

[Bug c/11175] -ftrapv breaks modulo

[Bug c/11175] New: -ftrapv breaks modulo

[Bug c/11197] two function pointers to the same function are not equal

[Bug c/11207] [3.3/3.4 regression] ICE with negative index in array element designator

[Bug c/11207] New: ICE: negative index in array initialisation when no -funsigned-char

[Bug c/11213] ICE on __builtin_ia32_psrlw with constant shift

[Bug c/11213] New: ICE on __builtin_ia32_psrlw with constant shift

[Bug c/11214] gcc dbdimp in DBD::Pg give seg fault under cygwin 1.3

[Bug c/11214] New: gcc dbdimp in DBD::Pg give seg fault under cygwin 1.3

[Bug c/11215] ICE on vector operation involving local initialized variable

[Bug c/11215] New: ICE on vector operation involving local initialized variable

[Bug c/11217] New: Segmentation Fault when compiling arts-1.1.2

[Bug c/11217] Segmentation Fault when compiling arts-1.1.2

[Bug c/11218] [tree-ssa] symbol already defined

[Bug c/11218] New: [tree-ssa] symbol already defined

[Bug c/11221] gcc 3.2.3.0 problem- Urgent

[Bug c/11221] New: gcc 3.2.3.0 problem- Urgent

[Bug c/11231] [3.4 regression] undefined array size inside struct cause segfault with -g

[Bug c/11231] New: undefined array size inside struct cause segfault with -g

[Bug c/11232] New: stack allocation bug?

[Bug c/11232] stack allocation bug?

[Bug c/11243] New: [3.4 regression] segfault on valid code initializing a vector

[Bug c/11244] New: pipe hang when program compiled with -maix64 and -static

[Bug c/11246] New: warning: no previous prototype for foobar_func ()

[Bug c/11246] warning: no previous prototype for foobar_func ()

[Bug c/11255] New: one-pass cross-compile failure

[Bug c/11255] one-pass cross-compile failure

[Bug c/11258] allocation of large arrays in 64-bit mode

[Bug c/11258] allocation of large arrays, sparc

[Bug c/11258] New: allocation of large arrays, sparc

[Bug c/11268] corrupted arg values/addresses when passed to a function

[Bug c/11268] New: corrupted arg values/addresses when passed to a function

[Bug c/11270] [tree-ssa] Strange warning with -Wunreachable-code.

[Bug c/11270] New: [tree-ssa] Strange warning with -Wunreachable-code.

[Bug c/11290] "so large that it is unsigned" gripe #2.

[Bug c/11300] New: Internal Error: SeqFault -O2 only compiling kde-arts

[Bug c/11304] New: Wrong code production with -fomit-frame-pointer

[Bug c/11306] New: unnamed struct bugs in gcc

[Bug c/11306] unnamed struct bugs in gcc

[Bug c/11307] New: Random printf values under different optimization levels.

[Bug c/11307] Random printf values under different optimization levels.

[Bug c/11319] [3.3 regression] loop miscompiled on ppc32

[Bug c/11319] [3.3/3.4 regression] loop miscompiled on ppc32

[Bug c/11319] New: [3.3 regression] loop miscompiled on ppc32

[Bug c/11327] New: Non-optimal code when using MMX/SSE builtins

[Bug c/11327] Non-optimal code when using MMX/SSE builtins

[Bug c/11333] negative indexes for array static initializers cause an internal compiler error

[Bug c/11333] New: negative indexes for array static initializers cause an internal compiler error

[Bug c/11334] New: some warnings missed if optimization not on

[Bug c/11334] some warnings missed if optimization not on

[Bug c/11358] New: complex-6.c:40: internal compiler error: in subreg_hard_regno, at emit-rtl.c:1087

[Bug c/11369] New: too relaxed checking with -Wstrict-prototypes

[Bug c/11370] [3.3/3.4 Regression] -Wunreachable-code gives false complaints

[Bug c/11370] New: -Wunreachable-code gives false complaints

[Bug c/11373] asm generated lhs expressions are discarded

[Bug c/11373] New: asm generated lhs expressions are discarded

[Bug c/11377] New: fault or warn modifiable static in extern inline definition

[Bug c/11380] New: [ia64] stack frame > 2 GB and no optimization results in SEGV

[Bug c/11386] New: GNU Emacs 21.3 failed to install using GCC 3.3, but GCC 3.2.3 works.

[Bug c/1687] [3.4 regression] Exponential time behavior with -O -finline-functions (compile time regression from 3.2, 3.3)

[Bug c/2511] -pedantic not warning about bitfield overflow

[Bug c/4210] should not warning with dead code

[Bug c/4784] Anonymous structs issues

[Bug c/5035] Incorrectly produces '`<var>' might be used uninitialized in this function'

[Bug c/5277] NaN unexpectedly

[Bug c/529] -Wshadow warns on function prototypes vs. global vars

[Bug c/6488] GCC Release 3.0.4 fails with Segmentation fault when compiling the vmware driver which is included in XFree86 4.2.0 Release.

[Bug c/6614] [-Wconversion] incorrect conversion warning for function taking a short

[Bug c/6873] Improper Alignment Parameters Emitted by Compiler for .comm Section

[Bug c/7054] #pragma pack handled incorrectly

[Bug c/7277] Casting integers to vector types causes internal compiler error

[Bug c/7544] #pragma weak problem

[Bug c/7710] GCC warns "<var> might be used uninitialized" when optimisation turned on

[Bug c/8028] GCC 3.x __builtin_apply() passes wrong arguments

[Bug c/8081] ICE with variably sized types and nested functions

[Bug c/8335] problems with __builtin_frame_address when -fomit-frame-pointer used

[Bug c/8703] Compiler Segmentation Fault cross-compiling PPC Altivec accelerated code

[Bug c/8715] '~' operator for unsigned char and conversion to bool

[Bug c/8960] [3.3 regression] Segfault with __attribute__ ((mode (...))) in start_function:5702

[Bug c/9163] [3.3/3.4 regression] ICE in genrtl_compound_stmt at c-semantics.c:776 with c99 mode and checking enabled

[Bug c/9262] [3.3 regression] ICE on false case label

[Bug c/9469] [3.3/3.4 regression] initializer element is (allegedly) not constant

[Bug c/9526] Internal compiler error

[Bug c/9564] compiling sdiff causes ICE on powerpc

[Bug c/9743] -MF only writes the info from the very last of multiple C files.

[Bug c/9756] libgcc_s.so symbol versioning

[Bug c/9838] The problem with installing php4

[Bug c/9933] "internal error: Illegal instruction" when compiling 2.4.20 linux kernel

[Bug c/9956] objdump incomplete if gcc has option -ggdb (instead of -g)

[Bug c/9980] internal compiler error

[Bug debug/10000] gcc -g generates location expressions which are not valid in prologue

[Bug debug/10003] gcc -g mis-places low_pc of inlined functions

[Bug debug/10004] gcc -g does not always include labels in concrete inlined instance tree

[Bug debug/10005] gcc -O -g does not produce location information for aliases of a variable

[Bug debug/10055] [3.4 regression] g++ emits "<internal>" as source filename with -gstabs+

[Bug debug/10068] Java debug info for class members has wrong DW_AT_name

[Bug debug/10156] g++ 3.2 fails to emit debug location info for a local variable inside a class constructor

[Bug debug/10249] [ppc] -gxcoff switch causes parser to abort

[Bug debug/10281] [3.4 regression] ICE in loc_descriptor_from_tree in dwarf2out.c compiling glibc

[Bug debug/10718] nested locals with same name broken with gcc HEAD 2003-04-11

[Bug debug/11114] GCC doesn't generate DW_TAG_namespace entries

[Bug debug/11114] New: GCC doesn't generate DW_TAG_namespace entries

[Bug debug/11115] GCC doesn't generate DW_TAG_imported_{module,declaration} entries

[Bug debug/11115] New: GCC doesn't generate DW_TAG_imported_{module,declaration} entries

[Bug debug/11195] Gcc ELF file format NOT compatible with AXD *.axf

[Bug debug/11195] New: Gcc ELF file format NOT compatible with AXD *.axf

[Bug debug/11279] New: DWARF-2 output mishandles large enums

[Bug debug/11325] [3.4 regression] nested class debug info incorrect

[Bug debug/11325] [3.4 regression] nested class debug info missing

[Bug debug/11325] New: [3.4 regression] nested class debug info incorrect

[Bug debug/11353] New: Still problems with namespaces

[Bug debug/11353] Still problems with namespaces

[Bug debug/3524] Source can not be comiled using option -gdwarf

[Bug debug/3532] mips stabs are emitted wrongly for current binutils

[Bug debug/4252] cc1: Invalid option `-fdump-translation-unit'

[Bug debug/4431] Wrong .stabs entries when using -O2

[Bug debug/5271] Wrong line number information with optimization

[Bug debug/6885] Incorrect DWARF2 emitted for C VLA constructs

[Bug debug/7078] debug info is not generated correctly with c++ namespaces are used

[Bug debug/7081] DWARF enhancements for C++

[Bug debug/7092] Bootstrap fails with ICE on sparc-solaris, CFLAGS="-g1" when building 64-bit libsupc++

[Bug debug/7241] DWARF encoding for "char" incorrect in gcc

[Bug debug/7521] DWARF problem: bad .text reference from .debug_line section.

[Bug debug/7580] incorrect/unfortunate DWARF-2 info for static const int class members

[Bug debug/7853] gcc reports multiple symbol definitions on the wrong line

[Bug debug/8188] DW_AT_containing_type incorrectly emitted

[Bug debug/8354] Incorrect DWARF-2/3 emitted for const + array + typedef

[Bug debug/9366] no debugging information for sub-classes with virtual members

[Bug debug/9499] GCC no longer emits DWARF-2 locations for variables in global regs

[Bug debug/9509] Incorrect function starts in DWARF2 .debug_line section

[Bug debug/9803] Internal compiler error with -g -gdwarf -O4

[Bug debug/9864] [3.3/3.4 regression] Fortran ICE in dwarf2out:add_abstract_origin_attribute with -g -O -finline-functions

[Bug debug/9905] [3.4 regression] Unhandled STMT_EXPR in loc_descriptor_from_tree

[Bug debug/9984] ICE with -gdwarf-2 -feliminate-dwarf2-dups

[Bug driver/10590] [sparc][solaris] "-static -shared" unsupported using solaris linker

[Bug driver/10707] c++ linking impossible when -V specified

[Bug driver/10961] read_specs -- compilers[n_compilers].cpp_spec not initialized

[Bug driver/11368] New: -falign-* has no effect on i386

[Bug driver/1512] Path confusion w/ -print-prog-name + autoconf

[Bug driver/8393] specs file has wrong mcpu alias

[Bug driver/9362] solaris 'as' dies when fed .s and "-gstabs"

[Bug driver/9669] C cannot create exexcutables

[Bug fortran/10965] g77 compiles illegal code in testsuite

[Bug fortran/10986] [3.3/3.4 regression] ICE in ffeste_R839, at f/ste.c:2984

[Bug fortran/11124] [3.4 regression] Test g77.f-torture/compile/20010321-1.f fails

[Bug fortran/11124] [3.4] Test g77.f-torture/compile/20010321-1.f fails

[Bug fortran/11124] New: [3.4][cygwin] Test g77.f-torture/compile/20010321-1.f fails

[Bug fortran/11125] internal compiler error: in lhd_incomplete_type_error, at langhooks.c:210

[Bug fortran/11125] New: internal compiler error: in lhd_incomplete_type_error, at langhooks.c:210

[Bug fortran/11127] Bad arithmetic in complex parameter

[Bug fortran/11127] New: Bad arithmetic in complex parameter

[Bug fortran/11139] New: Non-stantard code in test 980519-2.f

[Bug fortran/11141] [3.4 Regression] Pre-Proccessed Source causes segmentation fault

[Bug fortran/11141] New: Pre-Proccessed Source causes segmentation fault

[Bug fortran/11165] ffelex_send_token_ in gcc/f/lex.c went into an infinite loop

[Bug fortran/11165] New: ffelex_send_token_ in gcc/f/lex.c went into an infinite loop

[Bug fortran/11220] g77: hiccup on variable declaration interchange

[Bug fortran/11220] New: g77: hiccup on variable declaration interchange

[Bug fortran/11251] New: g77 complex number program produces wrong code when optimising

[Bug fortran/11260] New: code causes 'output_operand: floating constant misused' underg77 3.1

[Bug fortran/11299] [3.4 Regression] f771 ICE on line directive

[Bug fortran/11301] [3.3/3.4 Regression] ICE with -fno-globals

[Bug fortran/11301] ICE with -fno-globals

[Bug fortran/7179] No error on DIMENSION A(250 000, 250 000) on 32-bit target.

[Bug fortran/8751] g77 produces incorrect code when using -funroll-loops

[Bug fortran/9972] [3.4 regression] Failure of g77.f-torture/execute/980520-1.f

[Bug inline-asm/10153] [3.3/3.4 regression] selection of %dil or %sil on ia32 by valid C source

[Bug inline-asm/10402] [3.3/3.4 regression] [x86] ICE in merge_assigned_reloads, at reload1.c:6134

[Bug inline-asm/10890] [3.3/3.4 regression] ICE building Linux 2.4.2x sched.c

[Bug inline-asm/10890] [3.3/3.4 regression] ICE in merge_assigned_reloads building Linux 2.4.2x sched.c

[Bug inline-asm/10890] [3.3/3.4 regression] internal compiler error: in merge_assigned_reloads, at reload1.c:6134

[Bug inline-asm/11103] [3.3/3.4 regression] asm-specifier conflicts with asm clobber list

[Bug inline-asm/11203] source doesn't compile with -O0 but they compile with -O3

[Bug inline-asm/2182] ICE in set_mem_attributes_minus_bitpos

[Bug inline-asm/4823] [3.3/3.4 regression] gcc reports internal compiler error on legal code

[Bug inline-asm/5426] Documentation/Behavior differ for array ids in inline asm

[Bug inline-asm/6162] [3.3/3.4 regression] i386 asm reloader ice in reload_cse_simplify_operands

[Bug inline-asm/9233] ICE for inline asm call to function taking a reference parameter

[Bug java/10304] ICE when compiling OpenNMS (jcf-write.c:1041)

[Bug java/10878] miscompilation of boolean parameters from bytecode

[Bug java/10919] Win32 JNI heap corruption issue

[Bug java/11045] int cast bug

[Bug java/11075] ICE compiling cross-package inherited constants

[Bug java/11075] New: ICE compiling cross-package inherited constants

[Bug java/11109] GCJ crashes when compiling included program

[Bug java/11117] internal error on compilation of java code

[Bug java/11117] New: internal error on compilation of java code

[Bug java/11147] New: fficonfig.h is abi-specific

[Bug java/11188] Internal compiler error in make_class_data, at java/class.c:1676

[Bug java/11188] New: Internal compiler error in make_class_data, at java/class.c:1676

[Bug java/11209] New: Problems with the reset method in ObjectOutputStream.

[Bug java/11209] Problems with the reset method in ObjectOutputStream.

[Bug java/11248] New: java.util.Date is incorrect on Solaris

[Bug java/11298] New: nl_langinfo (CODESET) handling

[Bug java/11336] ICE: bytecode-to-native compiler cannot find interface methods on abstract implementing classes

[Bug java/11336] New: ICE: bytecode-to-native compiler cannot find interface methods on abstract implementing classes

[Bug java/1202] jvgenmain should support -ms and -mx options

[Bug java/1255] Can't call methods from Object on an inner class

[Bug java/2370] Behavior of main compilation without --main is unfriendly

[Bug java/4066] gcj -fjni generates thread-unsafe code

[Bug java/5688] cross compiler build fails in libjava

[Bug java/7066] gcj does not have a way to generate 1.1 bytecode

[Bug java/7123] TLtest in java testsuite fails, regression on 3.1 branch from 3.1 release

[Bug java/7739] compile with -findirect-dispatch by default

[Bug java/7879] Segmentation fault: jc1 -> java/mangle.c:228 -> No such file or directory

[Bug java/8204] gcj -O2 to native reorders certain instructions improperly.

[Bug java/8447] java/lang/Thread.java:0: Internal error: Segmentation fault

[Bug java/8626] warn for non-static references to static members

[Bug java/8627] warn about unused imports

[Bug java/8628] warn about assignments that have no effect

[Bug java/8939] Class files produced by gcj are incompatible with Sun's vm

[Bug java/9018] Some .jar files fail to compile due to bugs in the exception table

[Bug java/9019] Compiling included jar into dll fails

[Bug java/9351] Cannot compile kaffe core classes (foreign java.lang.Object)

[Bug java/9532] jar -C flag is incompatible with Sun's

[Bug java/9532] jar -C flag is incompatible with Sun's (fastjar uses nonportable feature of getcwd)

[Bug java/9685] Illegal access to package-private method is allowed

[Bug java/9947] gcj run into segmentation fault when compiling JAR files

[Bug libf2c/10885] On 64-bit targets one can write >2Gb records in sequential files, but not in direct access files

[Bug libgcj/10172] System.properties cannot be given with '-Dmyprop=myvalue'

[Bug libgcj/10353] [3.3/3.4 regression] sparc-sun-solaris2.7 java testsuite failures Array_3, TLtest, Thread_Join, Thread_Wait_Interrupt & Throw_2

[Bug libgcj/10421] java.text.Collator.getInstance returns null for "de" locale

[Bug libgcj/10598] dispatch tables and other Class structures not GCd

[Bug libgcj/10609] --enable-debug: different meanings for libstdc++v3 and libffi

[Bug libgcj/10610] [powerpc-linux] 230 testsuite failures due to alignment errors

[Bug libgcj/10632] Numerical result differs from Sun JDK

[Bug libgcj/10746] [3.3 regression] garbage collection crash in GCJ

[Bug libgcj/10886] The RMI registry that comes with GCJ does not work correctly

[Bug libgcj/10920] Too many roots is reported for program, which shouldn't run out of memory

[Bug libgcj/11085] SimpleDateFormat fails to parse valid dates

[Bug libgcj/11109] GCJ crashes when compiling included program

[Bug libgcj/11109] New: GCJ crashes when compiling included program

[Bug libgcj/11147] fficonfig.h is abi-specific

[Bug libgcj/11223] dynamic_cast<> in shared library fails with SegFault when called from JNI

[Bug libgcj/11239] java.awt.datatransfer.DataFlavor.isMimeTypeEqual final, so Java Activation Framework doesn't compile

[Bug libgcj/11239] New: java.awt.datatransfer.DataFlavor.isMimeTypeEqual final, so Java Activation Framework doesn't compile

[Bug libgcj/11241] New: WeakHashMap throws a "/ zero" ArithmeticException when initialCapacity is explicitly zero

[Bug libgcj/11287] Libjava is not made when making cygwin cross compiler on linux.

[Bug libgcj/11287] New: Libjava is not made when making cygwin cross compiler on linux.

[Bug libgcj/11288] Libjava is not made when making linux cross cygwin compiler.

[Bug libgcj/11288] New: Libjava is not made when making linux cross cygwin compiler.

[Bug libgcj/11330] New: java.lang.ClassLoader() does not set parent classloader

[Bug libgcj/11349] JNDI URL context factories not located correctly

[Bug libgcj/11349] New: JNDI URL context factories not located correctly

[Bug libgcj/11385] New: compute GC bitmap values at runtime

[Bug libgcj/1379] converters must be able to throw exception

[Bug libgcj/1907] symbol demangling by Throwable.printStackTrace

[Bug libgcj/4485] DecimalFormat not spec compliant

[Bug libgcj/5385] Program objects randomly changed. GCC failure

[Bug libgcj/6183] BufferedByteOutputStream doesn't handle InterruptedIOException correctly

[Bug libgcj/6219] java.util.Propertiies failures with Mauve

[Bug libgcj/6293] PipedInputStream.close() does not notify writer (Mauve test)

[Bug libgcj/6302] http URLConnection does not support HTTP/1.1 (and chunked transfer encoding)

[Bug libgcj/6459] sparc-sun-solaris2.7 gcc-3.1 libjava testsuite failure in Throw_2

[Bug libgcj/6756] missing Constructor in java.awt.Color

[Bug libgcj/6819] duplicate class registration bug

[Bug libgcj/8945] StringTokenizer

[Bug libgcj/9124] URLClassLoader.getResource() should return canonicalized file URLs

[Bug libgcj/9463] add native methods for file name encoding

[Bug libgcj/9613] Lots of java.text.CollationElementIterator Mauve failures

[Bug libgcj/9684] java.lang.Socket leaks file desciptors on a connection timeout

[Bug libgcj/9802] Bug in surrogate handling in Unicode to UTF-8 conversion

[Bug libobjc/11184] libobjc generation fails with internal compiler error

[Bug libobjc/11184] New: libobjc generation fails with internal compiler error

[Bug libobjc/11273] New: make install fails in libobjc directory

[Bug libstdc++/10041] HPUX 11.0 GCC 3.2.2 does not allow _GLIBCPP_USE_WCHAR_T to be defined

[Bug libstdc++/10061] cannot use wchar_t in gcc-3.2.2/solaris8, _GLIBCPP_USE_WCHAR_T undefined

[Bug libstdc++/10081] basic_ios constructor fails to initialize variables

[Bug libstdc++/10081] basic_ios::_M_cache_locale leaves NULL members in the face of unknown locales

[Bug libstdc++/10193] Regression: iostreams no longer threadsafe

[Bug libstdc++/10246] [3.4 regression] libsupc++ needs to be independent (again) of libstdc++

[Bug libstdc++/10257] libstdc++ breaks when NetBSD is build with -lc in LIB_SPEC shared

[Bug libstdc++/10276] [3.4 regression] ABI, memory issues with __locale_cache

[Bug libstdc++/10350] thread-safety problem in std::string.

[Bug libstdc++/10425] function index() should not live in the global namespace

[Bug libstdc++/10535] cygwin _GLIBCPP_USE_WCHAR_T undefined

[Bug libstdc++/10564] Statically linked C++ program cannot be transferred from RHL 9 to RHL 7.3

[Bug libstdc++/10672] Binary IO with fstream is slow in 3.2+ compared to gcc 2.96

[Bug libstdc++/10703] [3.3 regression] [Solaris] 27_io/istream_unformatted.cc fails on Sparc/Solaris 2.5.1 and 2.6

[Bug libstdc++/10783] std::vector::reverse_iterator could be smaller

[Bug libstdc++/10797] filebuf.open() locks when using -lpthread on MIPS

[Bug libstdc++/10809] [3.3 regression] mips-sgi-irix6.5 libstdc++-v3 testsuite execution failure in 27_io/istream_unformatted.cc

[Bug libstdc++/10943] ext/hash_map causes namespace issues with abs

[Bug libstdc++/10958] [sparc] Link failure in abi_check in stage3 of bootstrap

[Bug libstdc++/10975] incorrect initial ostringstream::tellp()

[Bug libstdc++/11062] New: Please avoid __attribute__ ((unused))

[Bug libstdc++/11062] Please avoid __attribute__ ((unused))

[Bug libstdc++/11065] New: ctype<wchar_t>::do_is unimplemented

[Bug libstdc++/11095] [3.3 Regression] C++ iostream manipulator causes segfault when called iwth negative argument

[Bug libstdc++/11099] New: wrong values for numeric_limits<double>

[Bug libstdc++/11099] wrong values for numeric_limits<double>

[Bug libstdc++/11108] <iostream> causes transform() to not compile with tolower()

[Bug libstdc++/11126] Error in valarray::operator =

[Bug libstdc++/11126] New: Error in valarray::operator =

[Bug libstdc++/11153] bad build directory references in libstdc++.la and libsupc++.la

[Bug libstdc++/11153] New: bad build directory references in libstdc++.la and libsupc++.la

[Bug libstdc++/11170] bug in ctype_inline.h header file (undefined __istype will break compilation)

[Bug libstdc++/11179] valarray resize error

[Bug libstdc++/11193] New: Version 1.126 of libstdc++-v3/configure.in broke pre-installed newlib builds

[Bug libstdc++/11196] parse error before numeric constant

[Bug libstdc++/11212] demangler bug

[Bug libstdc++/11212] invalid template instantiations

[Bug libstdc++/11240] New: operator-() fails for reverse_iterator<const char*>

[Bug libstdc++/11240] operator-() fails for reverse_iterator<const char*>

[Bug libstdc++/11272] make bootstrap fails while building libstdc++

[Bug libstdc++/11281] C++ support on alpha is no more

[Bug libstdc++/11281] New: C++ support on alpha is no more

[Bug libstdc++/11286] New: the stl files wont compile

[Bug libstdc++/11286] the stl files wont compile

[Bug libstdc++/11305] basic_filebuf::_M_convert_to_external fails to convert single characters.

[Bug libstdc++/11305] New: basic_filebuf::_M_convert_to_external fails to convert single characters.

[Bug libstdc++/11312] GCC (g++) does not support std::wstring or other wchar_t based types

[Bug libstdc++/11312] New: GCC (g++) does not support std::wstring or other wchar_t based types

[Bug libstdc++/11324] New: unimplemented, had to relocate pch

[Bug libstdc++/11346] New: Regressions from 3.3.0

[Bug libstdc++/11346] Regressions from 3.3.0

[Bug libstdc++/11352] crash while internal padding numeric 0

[Bug libstdc++/11352] New: crash while internal padding numeric 0

[Bug libstdc++/11364] half of permuations missing

[Bug libstdc++/11364] half of permutations missing

[Bug libstdc++/11364] New: half of permuations missing

[Bug libstdc++/11365] initializer problem in stl_threads.h

[Bug libstdc++/11365] New: initializer problem in stl_threads.h

[Bug libstdc++/11378] New: Unbuffered sputn is slow

[Bug libstdc++/11378] Unbuffered sputn is slow

[Bug libstdc++/3845] [CygWin] Standard streams closed when g++-produced DLL loaded.

[Bug libstdc++/4764] std::wstring missing on Solaris

[Bug libstdc++/5001] g++ 3.0.2 getline is too slow

[Bug libstdc++/5090] linking fails when using std::basic_stringstream<wchar_t>

[Bug libstdc++/5799] streams reading from fifo

[Bug libstdc++/6243] testsuite fails almost all tests due to no libintl in LD_LIBRARY_PATH during test.

[Bug libstdc++/6257] C-library symbols enter global namespace

[Bug libstdc++/6702] requirements for wchar_t support are too restrictive

[Bug libstdc++/6702] requirements for wchar_t support are too restrictive for Solaris

[Bug libstdc++/6712] __default_alloc_template erroneously calls realloc

[Bug libstdc++/6896] ofstream, ^D and flushing

[Bug libstdc++/7076] [3.3/3.4 regression] iostreams very slow compared with earlier gcc versions

[Bug libstdc++/7076] iostreams very slow compared with earlier gcc versions

[Bug libstdc++/7264] g++3.1:ostrstream::freeze() don`t work

[Bug libstdc++/7276] strstreambuf (charbuf,N,charbuf) doesn`t allowed to read.

[Bug libstdc++/7942] ostream core dump with hex/internal/showbase formatted output

[Bug libstdc++/8246] Cast increases alignment in __default_alloc_template on Sparcs

[Bug libstdc++/8307] libstdc++ fails to compile because of fixincludes headers

[Bug libstdc++/8610] std::streamoff type is 32-bit in GCC 3.2 whereas it was 64-bit in GCC 2.96

[Bug libstdc++/8761] poor fstream performance

[Bug libstdc++/9024] Input fails after call to basic_filebuf<>::pubsetbuf(0, 0)

[Bug libstdc++/9028] codecvt<wchar_t, char, mbstate_t> doesn't work on Red Hat Linux 8.0.

[Bug libstdc++/9178] wfilebuf input fails when codecvt<>::encoding() == 5

[Bug libstdc++/9371] Bad exception handling in i/ostream::operator>>/<<(streambuf*)

[Bug libstdc++/9396] [3.4 regression] ambiguities with abs()

[Bug libstdc++/9581] Array versions of ctype<wchar_t>::do_narrow and do_widen broken.

[Bug libstdc++/9679] Strange behaviour of valarray::apply method

[Bug libstdc++/9761] filebuf::pbackfail discards previously put back characters

[Bug libstdc++/9815] atomicity.h - fails to compile with -O3 -masm=intel

[Bug libstdc++/9828] [3.3/3.4 Regression] Segmentation fault in num_put::put

[Bug libstdc++/9828] [3.4 Regression] Segmentation fault in num_put::put

[Bug libstdc++/9870] ctype<wchar_t>::do_widen(char) is broken

[Bug libstdc++/9875] filebuf doesn't handle codecvt::encoding() > 1

[Bug libstdc++/9975] time defined in :: namespace

[Bug libstdc++/9977] rand() etc imported to global namespace by #include <vector>

[Bug middle-end/10003] gcc -g mis-places low_pc of inlined functions

[Bug middle-end/10472] [3.4 regression] ICE in instantiate_virtual_regs_lossage

[Bug middle-end/10475] [3.3/3.4 regression] ICE in subreg_highpart_offset for code with long long

[Bug middle-end/10510] [3.3 regression] 20020227-1.c:30: internal compiler error: in reload, at reload1.c:1108 on hppa64-hp-hpux11.11

[Bug middle-end/10540] [3.3 regression] mips-sgi-irix6.5 testsuite failure in gcc.c-torture/execute/20020227-1.c with checking enabled

[Bug middle-end/10557] [3.3/3.4 regression] [m68k] ICE in subreg_offset_representable_p

[Bug middle-end/10776] [3.3/3.4 regression] Large aggregate initializers with a single relocated entry causes excessive compile time regression

[Bug middle-end/10795] [3.4 regression] ICE in extract_insn, at recog.c:2188

[Bug middle-end/11041] [3.3/3.4 regression] ICE: const myclass &x = *x; (when operator*() defined)

[Bug middle-end/11089] [3.3/3.4 regression] ICE: instantiate_virtual_regs_lossage while using sse built-ins

[Bug middle-end/11135] It ought to be possible to make PIC_OFFSET_TABLE_REGNUM a pseudo

[Bug middle-end/11135] New: It ought to be possible to make PIC_OFFSET_TABLE_REGNUM a pseudo

[Bug middle-end/11185] [tree-ssa] ICE with "Vars Conflict across an abnormal edge"

[Bug middle-end/11185] New: [tree-ssa] ICE with "Vars Conflict across an abnormal edge"

[Bug middle-end/11243] [3.4 regression] segfault on valid code initializing a vector

[Bug middle-end/11264] LROTATE_EXPR/RROTATE_EXPR misexpanded by middle-end/back-end

[Bug middle-end/11264] LROTATE_EXPR/RROTATE_EXPR misexpanded by middle-end/back-end for bitfields

[Bug middle-end/11264] New: LROTATE_EXPR/RROTATE_EXPR misexpanded by middle-end/back-end

[Bug middle-end/11274] [3.4 regression] Segfault in hash_type

[Bug middle-end/11310] [3.4 Regression] ICE with -ftime-report

[Bug middle-end/11310] New: [3.4 Regression] ICE with -ftime-report

[Bug middle-end/168] Spurious signed/unsigned comparison warning

[Bug middle-end/4907] [3.3/3.4 regression] ICE in make_decl_rtl, at varasm.c:797 if a reference is used during its own definition

[Bug middle-end/6123] sparc-sun-solaris2.7 gcc-3.1 C testsuite failure in verify_local_live_at_start w/-fpic|-fPIC on gcc.dg/20020312-2.c

[Bug middle-end/7594] [3.3 regression] [m68k] ICE on legal code associated with simplify-rtx

[Bug middle-end/8306] [3.3/3.4 regression] ICE for bitfield7_y.C in C++ compatibility tests

[Bug middle-end/9986] [HP-UX] [3.4 regression] Incorrect transformation of fputs_unlocked to fputc_unlocked

[Bug objc/10925] make -k check quits when reaching objc

[Bug objc/11277] New: function call stack disorder.

[Bug objc/2145] objc testsuite fails since libgcc_so.0 is not found

[Bug objc/429] -forward:: / -performv:: does not work with floats/structs

[Bug objc/429] forward:: / performv:: fail to work

[Bug objc/7993] [3.3/3.4 regression] private variables cannot be shadowed in subclasses

[Bug objc/9008] objc crashes with "-fsyntax-only"

[Bug optimization/10015] gcc++ 3.2.2 can create buggy binaries with -Os option set

[Bug optimization/10050] [SH] Weak optimization on array references in conditiona blocks

[Bug optimization/10128] [sparc] gcc generates bad code when -fgcse or -frerun-cse-after-loop used

[Bug optimization/10160] [3.3/3.4 regression] compile time regression; inordinate time spent in "scheduling"

[Bug optimization/10160] [3.3/3.4 regression][SPARC] compile time regression; inordinate time spent in "scheduling"

[Bug optimization/10221] gcc -O9 will introduce wrong asembler?

[Bug optimization/10239] [m68k] switch jumptable causes assembler error

[Bug optimization/10280] [IA-64] __builtin_frame_address() broken in ia64 optimizer

[Bug optimization/10287] [3.4 regression] [ARM] Loop/conditional store bug

[Bug optimization/10392] [3.3/3.4 regression] [SH] optimizer generates faulty array indexing

[Bug optimization/10409] "__attribute__((const))" apparently not working

[Bug optimization/10409] [ARM] "__attribute__((const))" apparently not working

[Bug optimization/10435] [3.4 regression] ICE: insn does not satisfy its constraints - i686-pc-linux-gnu

[Bug optimization/10469] [3.3, 3.4] constant V4SF loads get moved inside loop

[Bug optimization/10474] gcc should be able to delay the setup of the frame pointer

[Bug optimization/10482] Optimized and debug binaries of same application give different results.

[Bug optimization/10494] [3.4 regression] optimization based on SSA "-O2 -fssa" removes needed code

[Bug optimization/10519] optimization based on SSA "-O2 -fssa" uses wrong register

[Bug optimization/10520] induction variable analysis not used to eliminate comparisons

[Bug optimization/10528] Unexpected loop un-optimization when removing a field of a class

[Bug optimization/10536] [3.4 regression] Linux kernel miscompiled on s390

[Bug optimization/10588] [PPC] i==0||j==0 should use cntlzw and swrawi

[Bug optimization/10624] unroll-loops can't unroll nested constant loops

[Bug optimization/10625] -freduce-all-givs has negative effect

[Bug optimization/10631] [3.3 regression] ICE in simplify_unary_expr at simplify-rtx.c:387 for easy sse2 code with mode V2DF

[Bug optimization/10654] feature request: non-temporal store, 64-bit general purpose register

[Bug optimization/10679] [3.3/3.4] --param min-inline-insns not honoured

[Bug optimization/10684] register variable update disappears when using -O

[Bug optimization/10817] gcc does not optimize result=0;if(t!=0)result=t; to result=t;

[Bug optimization/10823] [3.3/3.4 regression] wrong code after first cse pass

[Bug optimization/10842] [3.3 regression] [arm] Clobbered link register is copied to pc under certain circumstances

[Bug optimization/10863] [tree-ssa] ICE in assign_var

[Bug optimization/10876] [3.3/3.4 regression] [Sparc] ICE in calculate_giv_inc at unroll.c:1588 on FP code

[Bug optimization/10877] [3.3/3.4 regression] documentation for a newer binutils: miscompilation with -O3 -fPIC on x86

[Bug optimization/10877] [3.3/3.4 regression] miscompilation with -O3 -fPIC on x86

[Bug optimization/10904] [Sparc64] invalid (misaligned) FP register

[Bug optimization/10945] Trivial Bit Twiddling Optimizations Not Performed

[Bug optimization/10955] [3.3 regression] [SPARC] wrong code at -O3 for structure argument in context of structure return

[Bug optimization/10971] Static function inlining fails in C99 mode

[Bug optimization/10979] [3.4 regression] g++ ICEs on legal code in subst_stack_regs_pat() (reg-stack.c), with -O -ffast-math

[Bug optimization/10982] [arm] poor optimisation of "if (var & const)"

[Bug optimization/10992] invalid instruction reordering with -O2 / -fschedule-insns2

[Bug optimization/11001] ICE in spill_failure, at reload1.c:1915: unable to find a register in class `DIREG'

[Bug optimization/11009] [3.4 regression] -finline emits incorrect jmp instructions

[Bug optimization/11018] [3.3 regression] [SPARC] -mcpu=ultrasparc busts tar-1.13.25

[Bug optimization/11053] [3.3 regression] ICE with kernel 2.4.20; sched.c

[Bug optimization/11053] [3.3/3.4 regression] ICE with kernel 2.4.20; sched.c

[Bug optimization/11053] New: [3.3 regression] ICE with kernel 2.4.20; sched.c

[Bug optimization/11054] [3.3 regression] [m68k] ICE in reg_overlap_mentioned_p

[Bug optimization/11054] New: [3.3 regression] [m68k] ICE in reg_overlap_mentioned_p

[Bug optimization/11059] [3.3/3.4 regression] empty union optimization ice

[Bug optimization/11059] New: empty union optimization ice

[Bug optimization/11066] error in the optimization of packed structures

[Bug optimization/11066] New: error in the optimization of packed structures

[Bug optimization/11068] GCC 3.2.X miscompiles Firebird 1.5 with -O1

[Bug optimization/11068] New: GCC 3.2.X miscompiles Firebird 1.5 with -O1

[Bug optimization/11083] [3.3 regression] ICE in commit_one_edge_insertion, at cfgrtl.c:1438 with -O2 -fnon-call-exceptions

[Bug optimization/11083] New: [3.3 regression] ICE in commit_one_edge_insertion, at cfgrtl.c:1438 with -O2 -fnon-call-exceptions

[Bug optimization/11121] [3.4 regression] [unit-at-a-time] function prototypes, function pointers and -O3

[Bug optimization/11121] function prototypes, function pointers and -O3

[Bug optimization/11121] New: function prototypes, function pointers and -O3

[Bug optimization/11162] new-ra bug

[Bug optimization/11162] New: new-ra bug

[Bug optimization/11181] New: [avr-gcc] Optimization of "uchar/xor/and/single_bit" produced wrong code.

[Bug optimization/11192] Building Pari-2.1.5 fails with SuSE gcc 3.3 -O3 (internal compiler error)

[Bug optimization/11192] New: Building Pari-2.1.5 fails with SuSE gcc 3.3 -O3 (internal compiler error)

[Bug optimization/11198] -O2 -frename-registers generates wrong code

[Bug optimization/11198] [3.3/3.4? regression] -O2 -frename-registers generates wrong code

[Bug optimization/11198] New: -O2 -frename-registers generates wrong code

[Bug optimization/11202] [regression 3.4] incorrectly ordered rtl after emit_libcall_block

[Bug optimization/11202] New: [regression 3.4] incorrectly ordered rtl after emit_libcall_block

[Bug optimization/11203] New: source doesn't compile with -O0 but they compile with -O3

[Bug optimization/11203] source doesn't compile with -O0 but they compile with -O3

[Bug optimization/11210] New: optimizer drops conditional with typecast from signed to unsigned char

[Bug optimization/11210] optimizer drops conditional with typecast from signed to unsigned char

[Bug optimization/11222] arm/thumb __Unwind_SjLj_Register prologue optimization causes crash on interrupts

[Bug optimization/11222] New: arm/thumb __Unwind_SjLj_Register prologue optimization causes crash on interrupts

[Bug optimization/11252] [3.3/3.4 regression] code generation bug

[Bug optimization/11252] Code generation bug

[Bug optimization/11252] New: Code generation bug

[Bug optimization/11256] New: Optimization problem causes incorrect numeric calculation.

[Bug optimization/11256] Optimization problem causes incorrect numeric calculation.

[Bug optimization/11259] New: [avr] gcc Double 'andi' missed optimization

[Bug optimization/11261] New: Weak code generated for JPEG compression

[Bug optimization/11261] Weak code generated for JPEG compression

[Bug optimization/11263] New: [SPARC] wrong code with -O2 -fnew-ra : undefined content of output register o3 was used

[Bug optimization/11269] [tree-ssa] wrong-code

[Bug optimization/11269] New: [tree-ssa] wrong-code

[Bug optimization/11278] gcc sometimes doesnt remove unused static functions

[Bug optimization/11278] New: gcc sometimes doesnt remove unused static functions

[Bug optimization/11300] Internal Error: SeqFault -O2 only compiling kde-arts

[Bug optimization/11304] [3.3 Regression] Wrong code production with -fomit-frame-pointer

[Bug optimization/11304] Wrong code production with -fomit-frame-pointer

[Bug optimization/11311] [3.4 regression] ICE with pow and large exponent

[Bug optimization/11311] New: [3.4 regression] ICE with pow and large exponent

[Bug optimization/11320] [3.3 regression] [ia64] Reload bug

[Bug optimization/11320] New: [3.3 regression] [ia64] Reload bug

[Bug optimization/11327] Non-optimal code when using MMX/SSE builtins

[Bug optimization/11350] [3.3/3.4 regression] undefined labels with -Os -fPIC

[Bug optimization/11350] New: undefined labels with -Os -fPIC

[Bug optimization/11350] undefined labels with -Os -fPIC

[Bug optimization/11366] [3.3 regression] miscompiles XDM-AUTHORIZATION-1 key generation and/or validation in XFree86 at -O2

[Bug optimization/11366] New: [3.3 regression] miscompiles XDM-AUTHORIZATION-1 key generation and/or validation in XFree86 at -O2

[Bug optimization/11368] -falign-* has no effect on i386

[Bug optimization/11372] [3.4 regression] verify_flow_info: Wrong frequency of block at -O3

[Bug optimization/11372] New: [3.4 regression] verify_flow_info: Wrong frequency of block at -O3

[Bug optimization/11373] asm generated lhs expressions are discarded

[Bug optimization/11379] ICE with optimization option -fnew-ra

[Bug optimization/11379] New: ICE with optimization option -fnew-ra

[Bug optimization/11381] [3.3/3.4 regression] volatile memory access optimized away

[Bug optimization/11381] [regression] volatile memory access optimized away

[Bug optimization/11381] New: [regression] volatile memory access optimized away

[Bug optimization/1532] -O3 generates (obviously) redundant tests and jumps

[Bug optimization/192] String literals don't obey -fdata-sections

[Bug optimization/2399] 23 superflouis moves in a C++ function that needs 1

[Bug optimization/2806] if's are not combined together

[Bug optimization/3436] severe code quality regression when compiling gforth

[Bug optimization/4079] unnecessary register move on simple code

[Bug optimization/4454] [mips] Suboptimal schedule following unroll of "reversed" loops in gcc

[Bug optimization/4490] ICE with -m128bit-long-double

[Bug optimization/4648] gcc generates bad code at -O2 for SPEC crafty pgm on HPPA 32 HP-UX

[Bug optimization/4714] Haney's real matrix performance regression

[Bug optimization/5079] Reference to static const int not eliminated during optimization

[Bug optimization/5200] Store Motion is broken

[Bug optimization/5415] [hp-ux] -O2 crash in redirect_edge_and_branch

[Bug optimization/5477] gcc 3.0.x reserves a large stack frame, but uses only some parts of it

[Bug optimization/5720] useless jump to call of nonreturning function

[Bug optimization/5738] GCSE missed optimization

[Bug optimization/5739] "const" and "pure" function attributes pessimize code

[Bug optimization/5739] [sparc] "const" and "pure" function attributes pessimize code

[Bug optimization/5793] [hpux] optimisation causes an integer comparison to fail when it shouldn't

[Bug optimization/5959] __attribute__((pure)) ignored on PowerPC AIX

[Bug optimization/6065] [sparc] gcc seems to reorder IEEE fpsetsticky and sqrt functions

[Bug optimization/6169] loop unroller crashes after executing bzero() on local stack

[Bug optimization/6537] For -O (but not -O2 or -O0) incorrect assembly is generated

[Bug optimization/6597] [3.3/3.4 regression] ICE in set_mem_alias_set compiling Qt with -O2 on ia64

[Bug optimization/6860] [3.3/3.4 regression] [arm-thumb] ICE in pre_insert_copy_insn

[Bug optimization/6860] [3.3/3.4 regression] [arm-thumb] pre_insert_copy_insn

[Bug optimization/6895] gcc 3.02 can't compile 3.1 mainline

[Bug optimization/6901] optimiser could be improved

[Bug optimization/6901] optimiser could be improved (removing unused local variables)

[Bug optimization/6990] -O do better optimization than -O3/-O2/-Os on jump-to-jump for PowerPC

[Bug optimization/7061] Alpha: Access of bytes in struct parameters

[Bug optimization/7155] AVR Build of GCC - Problem with optimizing

[Bug optimization/7269] Inlining may not eliminate unnecessary tests and branches.

[Bug optimization/7270] Redundant compares not eliminated on x86.

[Bug optimization/7391] [sparc-sun-solaris2.8] generation of duplicate labels causes assembler to fail

[Bug optimization/7571] BitchX fails with a segmentation fault when compiled with -O3

[Bug optimization/7908] [ia64] warning 'Use of 'mov' may violate WAW dependency' on -O2 and above

[Bug optimization/7908] ia64 warning 'Use of 'mov' may violate WAW dependency' on -O2 and above

[Bug optimization/7936] gcc-3.2 crash

[Bug optimization/7953] labels-as-values, GCSE, and tail de-duplication slowdowns

[Bug optimization/8012] [vax-netbsdelf-gcc] ICE: Wrong amount of branch edges after unconditional jump 0

[Bug optimization/8092] cross-jump triggers too often

[Bug optimization/8126] [3.3/3.4 regression] Floating point computation far slower in 3.2 than in 2.95

[Bug optimization/8154] gcj not emitting switch table

[Bug optimization/8178] [3.4 regression] __builtin_ffs broken with -march=k6

[Bug optimization/8361] [3.3/3.4 regression] C++ compile-time performance regression

[Bug optimization/8474] -mcpu=i686 produces much faster code than -mcpu=pentium4 on a P4 machine

[Bug optimization/8479] [new-ra] ICE in select_spill, at ra-colorize.c:1001

[Bug optimization/8681] Generates unneeded test

[Bug optimization/8737] ICE in spill_failure, at reload1.c:1916 with SSE

[Bug optimization/8776] loop invariants are not removed (most likely)

[Bug optimization/8781] Pessimization of functional-style code

[Bug optimization/8812] [avr] Registers allocated for two uses at once

[Bug optimization/8873] Optimization on alpha (ev5)

[Bug optimization/8878] miscompilation with -O and SSE

[Bug optimization/8883] Alpha: regalloc too eager to use FP regs on EV6

[Bug optimization/8967] [3.4 regression] Making class data members `const' pessimizes code

[Bug optimization/8985] [3.3 regression] ICE in extract_insn, at recog.c:2148 with -fssa-ccp option

[Bug optimization/9059] unused arrays not optimized away

[Bug optimization/9059] unused arrays not optimized away when followed by external call

[Bug optimization/9196] [3.4 regression] Inlining of function with void * arithmetic is misoptimized

[Bug optimization/9240] wierd scheduling on v850 unless -fno-sched-spec specified

[Bug optimization/9357] [3.3 regression] SegFault with -fssa -funroll-loops -fprofile-arcs

[Bug optimization/9363] unused struct literal constants remain

[Bug optimization/9383] -fomit-frame-pointer has no effect on nested functions

[Bug optimization/9412] [3.4 regression] incorrect code with -O2 flag, but not -O

[Bug optimization/9508] internal compiler error

[Bug optimization/9531] Problem with -fprefetch-loop-arrays -funroll-loops

[Bug optimization/9540] C99 initializers generate lots of code

[Bug optimization/9553] No induction variable elimination

[Bug optimization/9567] Using struct fields produces worse code than stand-alone vars.

[Bug optimization/9591] [ppc] Partially unoptimized assembly when inline function operates on bit fields

[Bug optimization/9702] [ARM] Constant pools are not shared among functions

[Bug optimization/9711] glibc 2.3.1 miscompiled (mcpu=i686, mcpu=athlon, -fomit-frame-pointer)

[Bug optimization/9723] [ARM] With -Os optimization increases size if the loop contains array element access

[Bug optimization/9735] [IA-64] GCC doesn't honor trapping math when doing final schedule

[Bug optimization/9745] [3.3/3.4 regression][powerpc] miscompiles libmcrypt (alias problem during loop)

[Bug optimization/9767] explicit instantiation of class members unoptimized?

[Bug optimization/9786] [3.3/3.4 regression] Ice in fixup_abnormal_edges with -fnon-call-exceptions -O2

[Bug optimization/9805] optimisation of largish array constant containing strings takes forever(?) and consumes very large amounts of memory

[Bug optimization/9812] [3.3/3.4 regression] [m68k] ICE in extract_insn, at recog.c:2148

[Bug optimization/9900] [3.4 Regression] [fnewra] -O2 and ICE in verify_flow_info

[Bug optimization/9900] [3.4 Regression] [fnewra] ICE in verify_flow_info

[Bug optimization/9900] [3.4 Regression] [new-ra] -O2 and ICE in verify_flow_info

[Bug optimization/9904] aliasing problem

[Bug other/10184] unsigned long long arithmetics incorrect

[Bug other/10240] HOST_CFLAGS in gcc/Makefile.in shouldn't include XCFLAGS

[Bug other/10284] mmap test configury - subtle breakage exposed by corner case

[Bug other/10301] Side effects of architecture specific flags are not documented.

[Bug other/10778] Exception handling seems to fail on a powerpc using GCC 3.2.3 powerpc-eabi cross compiler

[Bug other/10799] [powerpc-eabi] Constructors of static classes are not called

[Bug other/10810] gcc-3.3 fails make check: buffer overrun in test_demangle.c

[Bug other/10944] alloc_page in ggc-page.c is slow

[Bug other/11123] New: Some option names are truncated in gcc --help -v

[Bug other/11123] Some option names are truncated in gcc --help -v

[Bug other/11146] [3.3 regression] Bad characters in cpp.1, gcc.1 man pages

[Bug other/11146] Bad characters in cpp.1, gcc.1 man pages

[Bug other/11146] New: Bad characters in cpp.1, gcc.1 man pages

[Bug other/11219] 'make distclean' aborts

[Bug other/11219] 'make distclean' aborts (bugs in boehm-gc, zlib Makefiles)

[Bug other/11219] New: 'make distclean' aborts

[Bug other/11280] [3.3/3.4 Regression] Manual incorrect WRT -freorder-blocks

[Bug other/11280] New: Manual incorrect WRT -freorder-blocks

[Bug other/11293] Failure to configure on Solaris 2.8: error: *** unable to determine endianness

[Bug other/11293] New: Failure to configure on Solaris 2.8: error: *** unable to determine endianness

[Bug other/11375] New: rtl_dump_file problems in rest_of_compilation

[Bug other/1494] Residual EGCS references in comments

[Bug other/2873] [3.3 only][fixinclude] Bogus fixinclude of stdio.h from glibc 2.2.3

[Bug other/3386] [3.3/3.4 Regression] Undocumented target macros in 3.0

[Bug other/3386] Undocumented target macros in 3.0

[Bug other/346] gcc install clobbers files that it shouldn't touch

[Bug other/4520] cselib.c hash_rtx incorrectly hashes based on rtx address

[Bug other/5235] -Wl,-Bstatic -lstdc++ -Wl,-Bdynamic combo fails

[Bug other/5490] libffi cross-compile build fails due to AC_CHECK_SIZE's

[Bug other/5762] collect2 passes o_file too soon if -soname option is passed early.

[Bug other/6480] C testsuite '--tool_opts' has incorrect precedence

[Bug other/6870] ld built using gcc-3.1 crashes

[Bug other/7031] program-suffix not respected in make install

[Bug other/704] --help and --version

[Bug other/7088] host-x-host builds install broken limits.h

[Bug other/7549] gcc3.1: Documentation glitches in info-files

[Bug other/7645] nisa-elf-gcc fails to compile a helloworld application.

[Bug other/7742] genrecog goes crazy on 'parallel' with more than 25 elements

[Bug other/7771] Build on AIX fails

[Bug other/7894] When configured for cross-compiling ("<target>-" program-prefix), install of gcov as <prefix>/bin/<target>-gcov first removes <prefix>/bin/gcov

[Bug other/7957] change request: more flexible %D specs directive

[Bug other/8121] BAD file ownership for gcc include files

[Bug other/8757] GCC crash when sizeof (long) > sizeof (char *), (splay_tree_compare_fn)strcmp is wrong

[Bug other/8974] fabs error with -ansi

[Bug other/9056] configure always defines PREFIX_INCLUDE_DIR

[Bug other/9105] gcc-3.2.1/gcc/intl/Makefile gets incorrect INSTALL variable path

[Bug other/9214] gcc should document libstdc++ testsuite's locale requirements

[Bug other/931] VMS support looks bitrotten

[Bug other/9398] Bug in ffi.h.in header file

[Bug other/9655] Slow linking times, even after gcc -fno-merge-constants used.

[Bug other/9691] Shared libraries don't work with g++

[Bug other/9755] Code gets compiled that shouldn't be when using Newlib (compiling the compiler)

[Bug other/9816] GCC 3.2.2 (Mingw Release candidate version) - Regression in building GNU Emacs 21.3 (CVS)

[Bug other/9863] Absence of awk isn't properly diagnosed at configure time

[Bug pch/10434] Duplicate symbol __tcf_0

[Bug pch/10591] Members of anonymous namespaces get name mangled with header name

[Bug pch/10757] Adding -fpic/-fPIC causes crash with PCH created without -fpic/-fPIC

[Bug pch/10917] pch tests don't corrrectly copy symlinks

[Bug pch/10935] PCH causing ICE during building of libstc++-v3

[Bug pch/11058] ICE on using precompiled header; Alpha Red Hat 7.1 Linux

[Bug pch/11324] unimplemented, had to relocate pch

[Bug pch/9830] PCH not working on Solaris

[Bug preprocessor/11022] [3.3 regression] no warning for non-compatible macro redefine

[Bug preprocessor/11022] [3.3/3.4 regression]no warning for non-compatible macro redefine

[Bug preprocessor/11064] New: Preprocessor tries to tokenize code that should be unconditionally skipped

[Bug preprocessor/11064] Preprocessor tries to tokenize code that should be unconditionally skipped

[Bug preprocessor/11166] New: Incorrect dependencies file under es_ES

[Bug preprocessor/11178] [3.4 regression] preprocessor calls abort on -CC -traditional-cpp

[Bug preprocessor/11178] New: preprocessor calls abort on -CC -traditional-cpp

[Bug preprocessor/11233] -pedantic accepts missing/empty macro argument

[Bug preprocessor/11356] preprocessor fail concatenation ## parameters

[Bug preprocessor/11361] [3.4 regression] ICE (segfault) in c-lex.c with one-liner

[Bug preprocessor/11361] New: [3.4 regression] ICE (segfault) in c-lex.c with one-liner

[Bug preprocessor/4917] Make -print-search-dirs show include dirs

[Bug target/10021] [3.3/3.4 regression] [m68k] alias problem during loop pass

[Bug target/10023] g++ Internal Compiler Error at -O2

[Bug target/10023] g++ Internal Compiler Error at -O2-4

[Bug target/10058] [darwin] gcc-3.2.2 crashes while building a cross compiler

[Bug target/10142] [SPARC64] gcc produces wrong code when passing structures by value

[Bug target/10142] [Sparc] gcc -m64 produces wrong code when passing structures by value

[Bug target/10149] [CygWin] Resource temporarily unavailable for cc1.exe

[Bug target/10206] [3.3/3.4 regression][arm] ICE in emit-rtl.c:change_address_1 when compiling fftw

[Bug target/10242] [ARM] subsequent use of plus and minus operators could be improved

[Bug target/10274] [HP-PA] ICE in output_cbranch, at config/pa/pa.c:5549

[Bug target/10331] [x86 -> SH] can't compile c++ crosscompiler part of gcc crosscompiler for sh-elf

[Bug target/10365] [sparc] bug in code generator

[Bug target/10400] [AIX 5.1] ICE in subst_reloads

[Bug target/10404] [PPC] gcc does not use 0 when using the indexed instructions of altivec like stewx

[Bug target/10412] Renesas SH - Incorrect code generation

[Bug target/10413] [3.3 Regression] SH ICE 3.3 branch

[Bug target/10467] [arm] ICE in pre_insert_copy_insn,

[Bug target/10501] [HP-UX] Syntax error when running make bootstrap

[Bug target/10504] [3.3] ICE with SSE2 code and -O3 -mcpu=pentium4 -msse2

[Bug target/10587] [3.3/3.4 regression] [ia64] ICE in copy_to_mode_reg compiling libquicktime

[Bug target/10595] [ia64] use of register variables creates stop bits

[Bug target/10599] [hp-ux] -O2 with exception in shared libraries cause Segmentation fault

[Bug target/10663] [Solaris] New configure check aborts with Sun tools.

[Bug target/10673] [3.3] ICE for x86-64 on freebsd libc vfprintf.c source

[Bug target/10681] [3.3 regression] [IA64] ICE in ia64_expand_epilogue

[Bug target/10681] [3.3/3.4 regression] [IA64] ICE in ia64_expand_epilogue

[Bug target/10692] [3.3/3.4 regression] [m68k] miscompilation of perl with -O2 -fPIC

[Bug target/10700] [3.3/3.4 regression] ICE in copy_to_mode_reg on 64-bit targets

[Bug target/10730] [3.3 regression] [arm] -O2 generates invalid asm

[Bug target/10775] m32r-elf-gcc -O3 (regrename) used lr in leaf-functions without saving

[Bug target/10865] [ia64] gcc -pthread does not add -D_REENTRANT

[Bug target/10871] rs6000.c

[Bug target/10901] [ppc-darwin] non-local goto's (still) don't work

[Bug target/10913] [3.3 regression] mips-elf ICE in text_section at varasm.c: 241

[Bug target/10913] mips-elf ICE in text_section at varasm.c: 241

[Bug target/10922] [Darwin] Internal error: Illegal instruction (program cc1plus)

[Bug target/10936] -Wpadded produces warning for every file when target is powerpc

[Bug target/10946] sibcall optimization does not call directly to sibling

[Bug target/10955] [3.3 regression] [SPARC] wrong code at -O3 for structure argument in context of structure return

[Bug target/10955] [SPARC] wrong code for structure argument in context of structure return with -O3

[Bug target/10963] cc1 fails on generation of SIMD code on target MMX

[Bug target/10964] [3.3/3.4 regression] [i?86] Problem with initialization of reference to pointer

[Bug target/10964] Problem with initialization of reference to pointer

[Bug target/10978] [m32r-elf] miss install crtini.o crtfini.o for m32rx target.

[Bug target/10979] [3.4 regression] g++ ICEs in subst_stack_regs_pat with -O -ffast-math and atan2

[Bug target/10984] x86/sse2 ICEs on vector intrinsics

[Bug target/10988] [m32r-elf] wrong blockmove code with -O3

[Bug target/11012] [m32r-elf] wrong code with -O at branch of conditional

[Bug target/11015] [PPC] -finstrument-functions and variable size with sizes > 17 and -fPIC

[Bug target/11016] errno not found when dynamic linking

[Bug target/11020] [ia64] gcc "Floating Point Exception" handling problem

[Bug target/11029] pentiumiii/pentium3/pentiumiv/pentium4 aren't recognized

[Bug target/11040] Wrong Floating Point Calculations

[Bug target/11044] [3.3 regression] [x86] out of range loop instructions for FP code on K6

[Bug target/11052] [3.3 regression] [arm] ICE (segfault) compiling xfree86

[Bug target/11052] [3.3 regression] [arm] noce_process_if_block() can loose REG_INC notes

[Bug target/11052] New: [3.3 regression] [arm] ICE (segfault) compiling xfree86

[Bug target/11084] [3.3/3.4 regression] ICE in propagate_one_insn, at flow.c:1639

[Bug target/11084] [mips] regression from 3.2 ICE in propagate_one_insn, at flow.c:1639

[Bug target/11084] New: [mips] regression from 3.2 ICE in propagate_one_insn, at flow.c:1639

[Bug target/11087] gcc miscompiles raid1.c from linux kernel

[Bug target/11087] New: gcc miscompiles raid1.c from linux kernel

[Bug target/11089] [3.3/3.4 regression] ICE: instantiate_virtual_regs_lossage while using sse built-ins

[Bug target/11092] [3.4 Regression] [altivec] ICE:unrecognizable insn (vector constant)

[Bug target/11092] [altivec] ICE:unrecognizable insn (vector constant)

[Bug target/11092] [Regression] [altivec] ICE:unrecognizable insn (vector constant)

[Bug target/11096] i686-linux to sh-linux cross compiler fails to compile C++ files

[Bug target/11096] New: i686-linux to sh-linux cross compiler fails to compile C++ files

[Bug target/11129] New: TLS broken on i686 and x86-64

[Bug target/11129] TLS broken on i686 and x86-64

[Bug target/11144] g++.dg/eh/simd-2.C fails on x86

[Bug target/11144] New: g++.dg/eh/simd-2.C fails on x86

[Bug target/11152] SIGSEGV on a simple static method when using -O3

[Bug target/11156] new bootstrap failure on mips-sgi-irix6.5 stage2 libgcc2 fp-bit.c

[Bug target/11156] New: new bootstrap failure on mips-sgi-irix6.5 stage2 libgcc2 fp-bit.c

[Bug target/11183] [3.3/3.4 regression] [arm] ICE in change_address_1 (3.3) / subreg_hard_regno (3.4)

[Bug target/11183] New: [3.3/3.4 regression] [arm] ICE in change_address_1 (3.3) / subreg_hard_regno (3.4)

[Bug target/11184] [ia64 hpux] ICE on __builtin_apply

[Bug target/11184] libobjc generation fails with internal compiler error

[Bug target/11194] [3.3.1 regression] ICE in simplify_gen_subreg, at simplify-rtx.c

[Bug target/11194] New: [3.3.1 regression] ICE in simplify_gen_subreg, at simplify-rtx.c

[Bug target/11226] New: ICE passing struct arg with two floats

[Bug target/11227] ICE for _Complex float, _Complex long double args

[Bug target/11227] New: ICE for _Complex float, _Complex long double args

[Bug target/11229] New: pure-1.c fails on powerpc64-linux with -O1

[Bug target/11229] pure-1.c fails on powerpc64-linux with -O1

[Bug target/11251] [3.3/3.4 Regression] g77 complex number program produces wrong code when optimising

[Bug target/11254] g++ (3.3): ...Error: Field out of range (optimisation pb)

[Bug target/11260] [alpha] 'output_operand: floating constant misused' with sqrt(0.0) and -mcpu=ev6

[Bug target/11260] code causes 'output_operand: floating constant misused' underg77 3.1

[Bug target/11271] [3.4 regression] [arm-elf] regex.c ICEs for thumb multilib

[Bug target/11277] function call stack disorder.

[Bug target/11292] [3.4 Regression] -fnew-ra causes sibcalling to go wrong.

[Bug target/11292] New: [3.4 Regression] -fnew-ra causes sibcalling to go wrong.

[Bug target/11303] ICE in stor-layout.c:304 in int_mode_for_mode

[Bug target/11303] New: ICE in stor-layout.c:304 in int_mode_for_mode

[Bug target/11322] New: SH profiler outputs multiple definitions of symbol

[Bug target/11371] bogus warning and/or mis-optimization on ia64

[Bug target/11371] New: bogus warning and/or mis-optimization on ia64

[Bug target/1698] [MIPS] compiling optimized code using mips4 on R12000

[Bug target/3724] [ARM]Illegal instruction when profiling optimized code on arm-linux

[Bug target/4156] [sco3.2v5] pic/libgcc.a

[Bug target/4516] [SH] sh-unknown-linux-gnu: big jump table

[Bug target/4587] [AIX] g++ -maix64 generates illeagal assembler code

[Bug target/5138] [powerpc] -mno-eabi option not working

[Bug target/5287] [3.3/3.4 regression] [mingw/cygwin] ICE with dllimport (two other testcases)

[Bug target/5329] Profiling doesn't work under Solaris 8 x86 - executable cores.

[Bug target/5360] [SH-4] NON_OPTIMAL CODE GENERATED FOR SH4

[Bug target/5372] [powerpc-*-eabi] -mno-eabi not working

[Bug target/5596] [arm-wince-pe] GCC won't build when configured for this target

[Bug target/5714] [ColdFire] Invalid use of dbra

[Bug target/5858] atomicity.h support for -fcheck-memory_usage

[Bug target/592] [ARM/Thumb] Poor choice of PIC register

[Bug target/605] [Solaris] '-Y' option broken.

[Bug target/6191] [HP-PA] ICE doing pointer math with -fPIC

[Bug target/6431] [v850] va_arg() fails in expanding arguments

[Bug target/6434] [ARM/Thumb] compilation produces no DWARF FDE instructions

[Bug target/6456] builtin memset broken on x86 with -minline-all-stringops

[Bug target/6522] [3.3 regression] [x86] incorrect struct offset for unaligned 64-bit fields in debug information

[Bug target/6522] [x86] incorrect struct offset for unaligned 64-bit fields in debug information

[Bug target/6524] [sh3-linux] Assembler messages: Internal error!

[Bug target/6526] [SH4] sdivsi3_i4 can clobber xd0/xd2

[Bug target/6606] [SH]sh-linux compiler fails to build libgcc

[Bug target/6678] [i?86] g++ 3.1 leaks memory when throwing exceptions

[Bug target/6882] [SPARC] Useless stack adjustment code

[Bug target/6884] [v850] GCC overwrites return address

[Bug target/7198] [IA64] missing usual fnma patterns

[Bug target/7204] [3.3/3.4 regression] [x86/Athlon] ICE on __builtin_ia32_psllq(a, 1)

[Bug target/7297] [irix6 o32] sjlj exceptions fail

[Bug target/7318] [m32r-elf] trunk: RTL flag check failure building newlib/libc/stdlib/dtoa.c

[Bug target/7434] [x86_64] ICE in change_address_1, at emit-rtl.c:1934

[Bug target/7443] [MIPS] gcc 3.0.3 incorrectly optimizes arithmetic containing 0x80000000

[Bug target/7513] [ARM/Thumb] cross-compiler -mthumb -O2 trashes link register

[Bug target/7525] [ARM/Thumb] long calls stubs only in one code section, cannot branch to them from other section

[Bug target/7594] [3.3 regression] [m68k] ICE on legal code associated with simplify-rtx

[Bug target/7831] [mips] GCC 3.2 MIPS64 endian issues

[Bug target/8008] [vax-dec-netbsdelf] gcc pushes arguments without updating SP

[Bug target/8010] [vax-netbsdelf] ICE in extract_insn for g77.f-torture/execute/20010116.f

[Bug target/8011] [HP-UX] linker searches for a non-existent gcrt0.o on 64 bit HPUX11.00

[Bug target/8250] [Solaris] The "-b MACHINE" flag is passed to the Solaris linker, which doesn't understand it

[Bug target/8299] [sh] Optimizing problem

[Bug target/8309] [3.3/3.4 regression][m68k] m68k-elf-gcc -m5200 produces erroneous SImode set of short varaible on stack

[Bug target/8313] [PPC] gcc 3.2 on -O2 and yields bad code for unsigned short argument

[Bug target/8365] [sparc-sun-solaris2.8/9] anon mmap configure test fails

[Bug target/8397] [sh-coff] miscompilation with many local variables

[Bug target/8407] [IA-64] ICE in simplify_gen_subreg, at simplify-rtx.c:2711 with very simple code

[Bug target/8512] [hppa64-hp-hpux11.11] libstdc++-v3 fails to build with HP assembler

[Bug target/8528] [PPC] Internal compiler error in extract_insn, at recog.c:2148

[Bug target/8600] [3.3/3.4 regression] [i686] internal error using builtin shift MMX functions

[Bug target/8606] GNAT floating point optimization bug

[Bug target/8641] [hp-ux 11.00] va_arg(arglist,type) does not work if sizeof(type) = 6

[Bug target/8787] [Cygwin] GCC fails to emit .intel_syntax when invoked with the -masm=intel on DJGPP

[Bug target/8787] [DJGPP] GCC fails to emit .intel_syntax when invoked with the -masm=intel on DJGPP

[Bug target/8795] [PPC] Altivec related bugs concerning gcc3.2.1 and gcc3.3

[Bug target/8816] [Sparc] bad assembly generated

[Bug target/8819] [sparc] G++ generates code with unresolved internal label

[Bug target/8869] [3.3/3.4 regression] [x86 MMX] ICE with const variable optimization and MMX builtins

[Bug target/9201] [3.3/3.4 regression] ICE in instantiate_virtual_regs_1 compiling octave-2.1 on m68k-linux

[Bug target/9270] [mac68k] ICE in building blackbox-0.65.0

[Bug target/9365] [3.3 regression] [SH] segfault in gen_far_branch (config/sh/sh.c)

[Bug target/9468] [HP-UX] 3.2.1 ICE building libgcc muldi3.o when dwarf2 is enabled

[Bug target/9468] [HP-UX] 3.2.1 not compiling under HP-UX 10.20 and 11.00 - gcc/varasm.c

[Bug target/9511] [Cygwin] Can't detect whether threading enabled

[Bug target/9552] [3.3/3.4 regression] [s390] ICE in named_section_flags, at varasm.c

[Bug target/9552] [x86-64] ICE in named_section_flags, at varasm.c

[Bug target/9571] [3.3/3.4 regression] [PPC] problems with 'const', -msdata=eabi and sections.

[Bug target/9572] [x86 SSE2] ICE in output_constant_pool

[Bug target/9572] [x86 SSE] ICE in output_constant_pool

[Bug target/9663] [arm] gcc-20030127 misses an optimization opportunity

[Bug target/9680] [powerpc64] ICE for unrecog insn with vector_size attr

[Bug target/9691] Shared libraries don't work with g++

[Bug target/9759] [arm] Combine cannot do its job due to arithmetic expression evaluation order

[Bug target/9760] [arm] Combine cannot do its job because immediate operand is used instead of register

[Bug target/9835] [mips-elf] Internal Compiler Error (segfault) with -msoft-float

[Bug target/9893] [HP-PA] "bl" offsets out of range in large modules

[Bug target/9929] [3.3/3.4 regression] Can't find spill register in GENERAL_REGS

[Bug target/9941] [HP-UX] typeinfo not generated correctly when #pragmas are involved

[Bug target/9963] [CygWin] g++ -gcoff report "C_EFCN symbol out of scope"

[Bug target/9995] [msp430] ICE 'unrecognizable insn' for (int,int,enum,enum,char)

[Bug web/11205] Dead links on bugzilla/enter_bug.cgi

[Bug web/11205] New: Dead links on bugzilla/enter_bug.cgi

[Bug web/11206] New: No info about implicitely created Bugzilla-accounts

[Bug web/11206] No info about implicitely created Bugzilla-accounts

[Bug web/11302] gccbug and bugzilla

[Bug web/11335] New: cvsweb shows incomplete logs for some files

[Bug web/2493] GNATSweb should discourage huge attachments

[Bug web/638] Broken gcc-cvs links

[GCC] gcc vs. indentation

Re: [tree-ssa] bootstrap failure with RTL check

[tree-ssa][irix] libmudflap won't build - lots of warnings

Re: ada/8606: GNAT floating point optimization bug

Aliasing problem? gcc-3.3 miscompiles mozilla-1.4

Approved

ARM: Bug in gcc-3.3 optimizer

bootstrap failure - OPT_iwithprefixbefore undeclared

Re: bootstrap/8122: severe build problems for i586-pc-linux-gnulibc1

Re: bootstrap/8180: --without-headers configure option not working

Bug 8861 (and other ABI bugs)

Bug report

Bug report in GCC3.2 and GCC3.3

Bug summary notations (Was Re: [Bug target/11260] [alpha] 'output_operand: floating constant misused' with sqrt(0.0) and -mcpu=ev6)

Re: Bug summary notations (Was Re: [Bug target/11260] [alpha]'output_operand: floating constant misused' with sqrt(0.0) and -mcpu=ev6)

Bug with -fomit-frame-pointer in GCC3.2 and GCC3.3

Re: c/8730: [3.2/3.3/3.4 regression] Cannot compile C function inside other C function

Coalesce object-code identical dtor, template, etc. ?

Delivery Notification: Delivery has failed

Re: Extremelly slow link time with GCC 3.2 and 3.3

Re: g++ query

gcc 2.9.2 on HP 11.0 compile fails with LARGEFILE64_SOURCE

Re: GCC 3.3 build on AIX 5.2, ICE

GCC 3.3 code generation error

GCC Bootstraping problems on my little sparc

GCC-3.3 on SCO OpenServer: GAS_HIDDEN

gnat1: warning: ignoring command line option '-Wall'

host on bug list

ICE building Linux 2.4.20 sched.c on x86

Idea for switch optimization

Internal Compiler error with gcc 3.3 & linux/kernel/sched.c file

internal compiler error: Segmentation fault

Re: Is the result of offsetof an integral constant expression?

Last data page not being filled

Locked CVS

minor problems building gcc-3.3 on Solaris 9

More options.h problems on cygwin

mutt-users@mutt.org: Non-member submission from <bug-gcc@gnu.org>

new gcc bug

Re: NEW vs. UNCONFIRMED

new-ra excessive memory usage

no warning when assigning an unsigned int to signed double

Notification (Replaced with text)

options.h build fails with mawk

re: other/10799: constructors of static classes are not called

Please Help and Save Palestinian People & Jerusalem

PR target/10153 (x86_64 registers usage in x86)

Re: Preprocessor: some dollars-in-identifiers mishap broke cris-axis-elf

printf or stdargs bug (one-liner).

Re: Screensaver

Re: Submited (004756-3463)

Target specific install docs.

use of register keyword gives undefined reference to `LC0'

VAX gcc 2.95.3 (netbsd/vax 1.6.1) internal compiler error

volatile is not volatile enough

Weird behaviour of g++-3.2 with references

Re: Your application

Re: Your Application (Ref: 003844)

RE: your e-mail to Macromedia Support

Your mail to simple-times-request@listserv.cs.utwente.nl

Your website.


Indexes: [Date Index] [Subject Index] [Author Index] [Thread Index]
Site Nav: [Browse other archives for this mailing list]
[Browse other mailing lists at this site]
Search: Limit to:

Mail converted by MHonArc 2.6.3