This is the mail archive of the gcc-bugs@gcc.gnu.org mailing list for the GCC project.


Index Nav: [Date Index] [Subject Index] [Author Index] [Thread Index]
Message Nav: [Date Prev] [Date Next] [Thread Prev] [Thread Next]
Other format: [Raw text]

gcc 3.1, Linux Alpha: make check FAILs


Linux alpha1 2.4.9-31 #1 Tue Feb 26 06:07:30 EST 2002 alpha unknown

Configured with:
../gcc-3.1/configure --enable-languages=c++

Build goes without incident, search for FAIL (and maybe XPASS) below:

gmake do-check NOTPARALLEL=parallel-ok
gmake[1]: Entering directory `/usr/home/mckelvey/software/gcc-obj'
gmake[2]: Entering directory `/usr/home/mckelvey/software/gcc-obj/libiberty'
gmake[3]: Entering directory 
`/usr/home/mckelvey/software/gcc-obj/libiberty/testsuite'
/bin/sh ../../../gcc-3.1/libiberty/testsuite/regress-demangle 
../../../gcc-3.1/libiberty/testsuite/demangle-expected
All 648 tests passed
gmake[3]: Leaving directory 
`/usr/home/mckelvey/software/gcc-obj/libiberty/testsuite'
gmake[2]: Leaving directory `/usr/home/mckelvey/software/gcc-obj/libiberty'
gmake[2]: Entering directory 
`/usr/home/mckelvey/software/gcc-obj/alphaev56-unknown-linux-gnu/libstdc++-v3'
Making check in include
gmake[3]: Entering directory 
`/usr/home/mckelvey/software/gcc-obj/alphaev56-unknown-linux-gnu/libstdc++-v3/include'
gmake[3]: Nothing to be done for `check'.
gmake[3]: Leaving directory 
`/usr/home/mckelvey/software/gcc-obj/alphaev56-unknown-linux-gnu/libstdc++-v3/include'
Making check in libio
gmake[3]: Entering directory 
`/usr/home/mckelvey/software/gcc-obj/alphaev56-unknown-linux-gnu/libstdc++-v3/libio'
gmake[3]: Nothing to be done for `check'.
gmake[3]: Leaving directory 
`/usr/home/mckelvey/software/gcc-obj/alphaev56-unknown-linux-gnu/libstdc++-v3/libio'
Making check in libmath
gmake[3]: Entering directory 
`/usr/home/mckelvey/software/gcc-obj/alphaev56-unknown-linux-gnu/libstdc++-v3/libmath'
gmake[3]: Nothing to be done for `check'.
gmake[3]: Leaving directory 
`/usr/home/mckelvey/software/gcc-obj/alphaev56-unknown-linux-gnu/libstdc++-v3/libmath'
Making check in libsupc++
gmake[3]: Entering directory 
`/usr/home/mckelvey/software/gcc-obj/alphaev56-unknown-linux-gnu/libstdc++-v3/libsupc++'
gmake[3]: Nothing to be done for `check'.
gmake[3]: Leaving directory 
`/usr/home/mckelvey/software/gcc-obj/alphaev56-unknown-linux-gnu/libstdc++-v3/libsupc++'
Making check in src
gmake[3]: Entering directory 
`/usr/home/mckelvey/software/gcc-obj/alphaev56-unknown-linux-gnu/libstdc++-v3/src'
gmake[3]: Nothing to be done for `check'.
gmake[3]: Leaving directory 
`/usr/home/mckelvey/software/gcc-obj/alphaev56-unknown-linux-gnu/libstdc++-v3/src'
Making check in po
gmake[3]: Entering directory 
`/usr/home/mckelvey/software/gcc-obj/alphaev56-unknown-linux-gnu/libstdc++-v3/po'
/bin/sh ../../../../gcc-3.1/libstdc++-v3/../mkinstalldirs 
/home/mckelvey/software/gcc-obj/alphaev56-unknown-linux-gnu/libstdc++-v3/po/share/locale 
gmake[3]: Leaving directory 
`/usr/home/mckelvey/software/gcc-obj/alphaev56-unknown-linux-gnu/libstdc++-v3/po'
Making check in testsuite
gmake[3]: Entering directory 
`/usr/home/mckelvey/software/gcc-obj/alphaev56-unknown-linux-gnu/libstdc++-v3/testsuite'
gmake  check-DEJAGNU
gmake[4]: Entering directory 
`/usr/home/mckelvey/software/gcc-obj/alphaev56-unknown-linux-gnu/libstdc++-v3/testsuite'
srcdir=`cd ../../../../gcc-3.1/libstdc++-v3/testsuite && pwd`; export srcdir; 
\
EXPECT=`if [ -f 
/home/mckelvey/software/gcc-obj/alphaev56-unknown-linux-gnu/libstdc++-v3/../../expect/expect 
] ; then echo 
/home/mckelvey/software/gcc-obj/alphaev56-unknown-linux-gnu/libstdc++-v3/../../expect/expect 
; else echo expect ; fi`; export EXPECT; \
if [ -f ../../expect/expect ]; then \
  TCL_LIBRARY=`cd ../../../../gcc-3.1/libstdc++-v3/../tcl/library && pwd`; \
  export TCL_LIBRARY; \
fi; \
runtest=`if [ -f 
/home/mckelvey/software/gcc-3.1/libstdc++-v3/../dejagnu/runtest ] ; then echo 
/home/mckelvey/software/gcc-3.1/libstdc++-v3/../dejagnu/runtest ; else echo 
runtest; fi`; \
if /bin/sh -c "$runtest --version" > /dev/null 2>&1; then \
  $runtest --tool libstdc++-v3 --srcdir $srcdir ; \
else echo "WARNING: could not find \`runtest'" 1>&2; :;\
fi
WARNING: Couldn't find tool init file
Test Run By mckelvey on Sat May 18 13:35:36 2002
Native configuration is alphaev56-unknown-linux-gnu

		=== libstdc++-v3 tests ===

Schedule of variations:
    unix

Running target unix
Using /usr/local/share/dejagnu/baseboards/unix.exp as board description file 
for target.
Using /usr/local/share/dejagnu/config/unix.exp as generic interface file for 
target.
Using 
/usr/home/mckelvey/software/gcc-3.1/libstdc++-v3/testsuite/config/default.exp 
as tool-and-target-specific interface file.
Running 
/usr/home/mckelvey/software/gcc-3.1/libstdc++-v3/testsuite/libstdc++-v3.dg/dg.exp 
...
XPASS: 22_locale/ctype_members_char.cc execution test
XPASS: 22_locale/members.cc execution test
XPASS: 22_locale/messages_byname.cc execution test
XPASS: 22_locale/messages_members_char.cc execution test
XPASS: 22_locale/money_get_members_char.cc execution test
XPASS: 22_locale/money_get_members_wchar_t.cc execution test
XPASS: 22_locale/money_put_members_char.cc execution test
XPASS: 22_locale/money_put_members_wchar_t.cc execution test
XPASS: 22_locale/moneypunct_byname.cc execution test
XPASS: 22_locale/moneypunct_members_char.cc execution test
XPASS: 22_locale/moneypunct_members_wchar_t.cc execution test
XPASS: 22_locale/num_get_members_char.cc execution test
XPASS: 22_locale/num_get_members_wchar_t.cc execution test
XPASS: 22_locale/num_put_members_char.cc execution test
XPASS: 22_locale/num_put_members_wchar_t.cc execution test
XPASS: 22_locale/numpunct_byname.cc execution test
XPASS: 22_locale/numpunct_members_char.cc execution test
XPASS: 22_locale/numpunct_members_wchar_t.cc execution test
XPASS: 22_locale/time_get_members_char.cc execution test
XPASS: 22_locale/time_get_members_wchar_t.cc execution test
XPASS: 22_locale/time_put_members_char.cc execution test
XPASS: 22_locale/time_put_members_wchar_t.cc execution test
FAIL: 26_numerics/c99_classification_macros_c.cc (test for excess errors)

		=== libstdc++-v3 Summary ===

# of expected passes		374
# of unexpected failures	1
# of unexpected successes	22
# of expected failures		3
gmake[4]: *** [check-DEJAGNU] Error 1
gmake[4]: Leaving directory 
`/usr/home/mckelvey/software/gcc-obj/alphaev56-unknown-linux-gnu/libstdc++-v3/testsuite'
gmake[3]: *** [check-am] Error 2
gmake[3]: Target `check' not remade because of errors.
gmake[3]: Leaving directory 
`/usr/home/mckelvey/software/gcc-obj/alphaev56-unknown-linux-gnu/libstdc++-v3/testsuite'
gmake[3]: Entering directory 
`/usr/home/mckelvey/software/gcc-obj/alphaev56-unknown-linux-gnu/libstdc++-v3'
gmake[3]: Nothing to be done for `check-am'.
gmake[3]: Leaving directory 
`/usr/home/mckelvey/software/gcc-obj/alphaev56-unknown-linux-gnu/libstdc++-v3'
gmake[2]: *** [check-recursive] Error 1
gmake[2]: Target `check' not remade because of errors.
gmake[2]: Leaving directory 
`/usr/home/mckelvey/software/gcc-obj/alphaev56-unknown-linux-gnu/libstdc++-v3'
gmake[1]: *** [check-target-libstdc++-v3] Error 2
gmake[2]: Entering directory 
`/usr/home/mckelvey/software/gcc-obj/alphaev56-unknown-linux-gnu/libiberty'
gmake[3]: Entering directory 
`/usr/home/mckelvey/software/gcc-obj/alphaev56-unknown-linux-gnu/libiberty/testsuite'
gmake[3]: Nothing to be done for `check'.
gmake[3]: Leaving directory 
`/usr/home/mckelvey/software/gcc-obj/alphaev56-unknown-linux-gnu/libiberty/testsuite'
gmake[2]: Leaving directory 
`/usr/home/mckelvey/software/gcc-obj/alphaev56-unknown-linux-gnu/libiberty'
gmake[2]: Entering directory `/usr/home/mckelvey/software/gcc-obj/gcc'
Making a new config file...
echo "set tmpdir /home/mckelvey/software/gcc-obj/gcc/testsuite" >> ./tmp0
test -d testsuite || mkdir testsuite
rm -f testsuite/site.exp
sed '/set tmpdir/ s|testsuite|testsuite|' < site.exp > testsuite/site.exp
(rootme=`pwd`; export rootme; \
srcdir=`cd ../../gcc-3.1/gcc; pwd` ; export srcdir ; \
cd testsuite; \
EXPECT=expect ; export EXPECT ; \
if [ -f ${rootme}/../expect/expect ] ; then  \
   TCL_LIBRARY=`cd .. ; cd ../../gcc-3.1/gcc/../tcl/library ; pwd` ; \
   export TCL_LIBRARY ; fi ; \
runtest --tool gcc )
Test Run By mckelvey on Sat May 18 14:06:05 2002
Native configuration is alphaev56-unknown-linux-gnu

		=== gcc tests ===

Schedule of variations:
    unix

Running target unix
Using /usr/local/share/dejagnu/baseboards/unix.exp as board description file 
for target.
Using /usr/local/share/dejagnu/config/unix.exp as generic interface file for 
target.
Using /usr/home/mckelvey/software/gcc-3.1/gcc/testsuite/config/default.exp as 
tool-and-target-specific interface file.
Running 
/usr/home/mckelvey/software/gcc-3.1/gcc/testsuite/gcc.c-torture/compile/compile.exp 
...
FAIL: gcc.c-torture/compile/labels-3.c,  -O0  
FAIL: gcc.c-torture/compile/labels-3.c,  -O1  
FAIL: gcc.c-torture/compile/labels-3.c,  -O2  
FAIL: gcc.c-torture/compile/labels-3.c,  -O3 -fomit-frame-pointer  
FAIL: gcc.c-torture/compile/labels-3.c,  -O3 -g  
FAIL: gcc.c-torture/compile/labels-3.c,  -Os  
Running 
/usr/home/mckelvey/software/gcc-3.1/gcc/testsuite/gcc.c-torture/execute/execute.exp 
...
Running 
/usr/home/mckelvey/software/gcc-3.1/gcc/testsuite/gcc.c-torture/execute/ieee/ieee.exp 
...
Running 
/usr/home/mckelvey/software/gcc-3.1/gcc/testsuite/gcc.c-torture/unsorted/unsorted.exp 
...
Running /usr/home/mckelvey/software/gcc-3.1/gcc/testsuite/gcc.dg/cpp/cpp.exp 
...
Running 
/usr/home/mckelvey/software/gcc-3.1/gcc/testsuite/gcc.dg/debug/debug.exp ...
Running /usr/home/mckelvey/software/gcc-3.1/gcc/testsuite/gcc.dg/dg.exp ...
XPASS: gcc.dg/c99-intconst-1.c (test for excess errors)
Running 
/usr/home/mckelvey/software/gcc-3.1/gcc/testsuite/gcc.dg/format/format.exp ...
FAIL: gcc.dg/format/c99-scanf-1.c %hhu sign (test for warnings, line 144)
Running 
/usr/home/mckelvey/software/gcc-3.1/gcc/testsuite/gcc.dg/noncompile/noncompile.exp 
...
FAIL: gcc.dg/noncompile/voidparam-1.c (test for excess errors)
Running 
/usr/home/mckelvey/software/gcc-3.1/gcc/testsuite/gcc.dg/special/ecos.exp ...
Running 
/usr/home/mckelvey/software/gcc-3.1/gcc/testsuite/gcc.dg/special/special.exp 
...
Running 
/usr/home/mckelvey/software/gcc-3.1/gcc/testsuite/gcc.misc-tests/acker1.exp 
...
Running 
/usr/home/mckelvey/software/gcc-3.1/gcc/testsuite/gcc.misc-tests/arm-isr.exp 
...
Running 
/usr/home/mckelvey/software/gcc-3.1/gcc/testsuite/gcc.misc-tests/bprob.exp ...
Running 
/usr/home/mckelvey/software/gcc-3.1/gcc/testsuite/gcc.misc-tests/dg-test.exp 
...
Running 
/usr/home/mckelvey/software/gcc-3.1/gcc/testsuite/gcc.misc-tests/dhry.exp ...
Running 
/usr/home/mckelvey/software/gcc-3.1/gcc/testsuite/gcc.misc-tests/gcov.exp ...
Running 
/usr/home/mckelvey/software/gcc-3.1/gcc/testsuite/gcc.misc-tests/i386-prefetch.exp 
...
Running 
/usr/home/mckelvey/software/gcc-3.1/gcc/testsuite/gcc.misc-tests/linkage.exp 
...
Running 
/usr/home/mckelvey/software/gcc-3.1/gcc/testsuite/gcc.misc-tests/matrix1.exp 
...
Running 
/usr/home/mckelvey/software/gcc-3.1/gcc/testsuite/gcc.misc-tests/mg.exp ...
Running 
/usr/home/mckelvey/software/gcc-3.1/gcc/testsuite/gcc.misc-tests/sieve.exp ...
Running 
/usr/home/mckelvey/software/gcc-3.1/gcc/testsuite/gcc.misc-tests/sort2.exp ...

		=== gcc Summary ===

# of expected passes		18243
# of unexpected failures	8
# of unexpected successes	1
# of expected failures		75
# of unsupported tests		109
/usr/home/mckelvey/software/gcc-obj/gcc/xgcc version 3.1


gmake[2]: [check-gcc] Error 1 (ignored)
if (autogen --ver=v) > /dev/null 2>&1 ; \
then cd fixinc && gmake check ; \
else true ; fi
(rootme=`pwd`; export rootme; \
srcdir=`cd ../../gcc-3.1/gcc; pwd` ; export srcdir ; \
cd testsuite; \
EXPECT=expect ; export EXPECT ; \
if [ -f ${rootme}/../expect/expect ] ; then  \
   TCL_LIBRARY=`cd .. ; cd ../../gcc-3.1/gcc/../tcl/library ; pwd` ; \
    export TCL_LIBRARY ; fi ; \
runtest --tool g++ )
Test Run By mckelvey on Sat May 18 15:32:34 2002
Native configuration is alphaev56-unknown-linux-gnu

		=== g++ tests ===

Schedule of variations:
    unix

Running target unix
Using /usr/local/share/dejagnu/baseboards/unix.exp as board description file 
for target.
Using /usr/local/share/dejagnu/config/unix.exp as generic interface file for 
target.
Using /usr/home/mckelvey/software/gcc-3.1/gcc/testsuite/config/default.exp as 
tool-and-target-specific interface file.
Running 
/usr/home/mckelvey/software/gcc-3.1/gcc/testsuite/g++.dg/debug/debug.exp ...
Running /usr/home/mckelvey/software/gcc-3.1/gcc/testsuite/g++.dg/dg.exp ...
Running 
/usr/home/mckelvey/software/gcc-3.1/gcc/testsuite/g++.dg/special/ecos.exp ...
Running 
/usr/home/mckelvey/software/gcc-3.1/gcc/testsuite/g++.old-deja/old-deja.exp 
...

		=== g++ Summary ===

# of expected passes		7163
# of expected failures		88
# of untested testcases		22
# of unsupported tests		4
/usr/home/mckelvey/software/gcc-obj/gcc/testsuite/../g++ version 3.1


gmake[2]: Leaving directory `/usr/home/mckelvey/software/gcc-obj/gcc'
gmake[1]: Target `do-check' not remade because of errors.
gmake[1]: Leaving directory `/usr/home/mckelvey/software/gcc-obj'
gmake: *** [check] Error 2



Index Nav: [Date Index] [Subject Index] [Author Index] [Thread Index]
Message Nav: [Date Prev] [Date Next] [Thread Prev] [Thread Next]