This is the mail archive of the
gcc-bugs@gcc.gnu.org
mailing list for the GCC project.
Re: hppa2.0w-hp-hpux11.0: configure failure
- To: gcc-bugs at gcc dot gnu dot org
- Subject: Re: hppa2.0w-hp-hpux11.0: configure failure
- From: Markus Werle <markus at lufmech dot rwth-aachen dot de>
- Date: Fri, 15 Jun 2001 15:11:25 +0200
- References: <3B2A06F9.BF88763D@lufmech.rwth-aachen.de>
Markus Werle wrote:
> Hi folks!
>
> What went wrong here?
obviously missing flex in PATH, sorry, but build fails, too.
(I use flex 2.5.4)
make bootstrap
gmake[1]: Entering directory `/work/markus/GCC/build/libiberty'
if [ x"" != x ]; then \
cc -Aa -c -DHAVE_CONFIG_H -g -I. -I../../gcc/libiberty/../include
../../gcc/libiberty/fdmatch.c -o pic/fdmatch.o; \
else true; fi
cc -Aa -c -DHAVE_CONFIG_H -g -I. -I../../gcc/libiberty/../include
../../gcc/libiberty/fdmatch.c
cc: "../../gcc/libiberty/fdmatch.c", line 59: error 1574: Unknown size
for "sbuf1".
cc: "../../gcc/libiberty/fdmatch.c", line 60: error 1574: Unknown size
for "sbuf2".
cc: "../../gcc/libiberty/fdmatch.c", line 64: error 1530: Undefined
struct or union.
cc: "../../gcc/libiberty/fdmatch.c", line 64: error 1530: Undefined
struct or union.
cc: "../../gcc/libiberty/fdmatch.c", line 65: error 1530: Undefined
struct or union.
cc: "../../gcc/libiberty/fdmatch.c", line 65: error 1530: Undefined
struct or union.
cc: "../../gcc/libiberty/fdmatch.c", line 62: error 1563: Expression in
if must be scalar.
gmake[1]: *** [fdmatch.o] Error 1
gmake[1]: Leaving directory `/work/markus/GCC/build/libiberty'
gmake: *** [all-libiberty] Error 2