User account creation filtered due to spam.

Bug 9484 - GCC 3.2.1 build failure on FreeBSD 5.0
Summary: GCC 3.2.1 build failure on FreeBSD 5.0
Status: RESOLVED FIXED
Alias: None
Product: gcc
Classification: Unclassified
Component: bootstrap (show other bugs)
Version: 3.2.1
: P2 critical
Target Milestone: ---
Assignee: Gerald Pfeifer
URL:
Keywords:
Depends on:
Blocks:
 
Reported: 2003-01-28 17:36 UTC by Gerald Pfeifer
Modified: 2003-10-06 18:05 UTC (History)
1 user (show)

See Also:
Host:
Target:
Build:
Known to work:
Known to fail:
Last reconfirmed:


Attachments

Note You need to log in before you can comment on or make changes to this bug.
Description Gerald Pfeifer 2003-01-28 17:36:00 UTC
> While trying to build gcc3.2.1 on FreeBSD 5.0 box, 
> compilation fails with:
> [...]
> In file included from ../../gcc-3.2.1/gcc/tsystem.h:37,
>                  from ../../gcc-3.2.1/gcc/crtstuff.c:62:
> include/stddef.h:57:26: machine/ansi.h: No such file or directory
> gmake[2]: *** [crtbegin.o] Error 1
> gmake[2]: Leaving directory `/usr/home/kgardas/usr/src/obj/gcc'
> gmake[1]: *** [stage1_build] Error 2
> gmake[1]: Leaving directory `/usr/home/kgardas/usr/src/obj/gcc'
> gmake: *** [bootstrap-lean] Error 2

Release:
gcc version 3.2.1

Environment:
FreeBSD 5.0
Comment 1 Gerald Pfeifer 2003-01-28 17:38:12 UTC
Responsible-Changed-From-To: unassigned->gerald
Responsible-Changed-Why: I have resolved this.
Comment 2 Gerald Pfeifer 2003-01-28 17:38:12 UTC
State-Changed-From-To: open->closed
State-Changed-Why: Fixed by means of http://gcc.gnu.org/ml/gcc/2003-01/msg01442.html