Bug 71986 - Bug bug when compiling gammu-1.37.3
Summary: Bug bug when compiling gammu-1.37.3
Alias: None
Product: gcc
Classification: Unclassified
Component: c (show other bugs)
Version: 4.9.2
: P3 normal
Target Milestone: ---
Assignee: Not yet assigned to anyone
Depends on:
Reported: 2016-07-25 03:09 UTC by nequx
Modified: 2016-07-29 12:58 UTC (History)
0 users

See Also:
Build: gammu-1.37.3
Known to work:
Known to fail:
Last reconfirmed: 2016-07-25 00:00:00

Here they are (682 bytes, text/plain)
2016-07-25 14:02 UTC, nequx

Note You need to log in before you can comment on or make changes to this bug.
Description nequx 2016-07-25 03:09:48 UTC
[ 30%] Building C object libgammu/CMakeFiles/libGammu.dir/phone/s60/s60phone.c.o
/root/gammu-1.37.3/libgammu/phone/s60/s60phone.c: In function ‘S60_SetAddCalendar’:
/root/gammu-1.37.3/libgammu/phone/s60/s60phone.c:1407:1: internal compiler error: Ошибка сегментирования
Please submit a full bug report,
with preprocessed source if appropriate.
See <file:///usr/share/doc/gcc-4.9/README.Bugs> for instructions.
The bug is not reproducible, so it is likely a hardware or OS problem.
libgammu/CMakeFiles/libGammu.dir/build.make:1526: ошибка выполнения рецепта для цели «libgammu/CMakeFiles/libGammu.dir/phone/s60/s60phone.c.o»
make[2]: *** [libgammu/CMakeFiles/libGammu.dir/phone/s60/s60phone.c.o] Ошибка 1
CMakeFiles/Makefile2:1051: ошибка выполнения рецепта для цели «libgammu/CMakeFiles/libGammu.dir/all»
make[1]: *** [libgammu/CMakeFiles/libGammu.dir/all] Ошибка 2
Makefile:147: ошибка выполнения рецепта для цели «all»
make: *** [all] Ошибка 2

I can not in any way call this package using cmake!

Line is error: 

GSM_Error S60_SetCalendar(GSM_StateMachine *s, GSM_CalendarEntry *Entry)
	return S60_SetAddCalendar(s, Entry, NUM_CALENDAR_ENTRY_CHANGE, ID_SetCalendarNote);

I go out segmentation error.What to do?
Linux linux 3.16.0-4-amd64 #1 SMP Debian 3.16.7-ckt25-2 (2016-04-08) x86_64 GNU/Linux
Comment 1 Richard Biener 2016-07-25 08:09:25 UTC
Please attach preprocessed source.
Comment 2 nequx 2016-07-25 14:02:18 UTC
Created attachment 38959 [details]
Here they are

Comment 3 Markus Trippelsdorf 2016-07-25 14:16:41 UTC
Please read https://gcc.gnu.org/bugs/ . It will tell you exactly what information is needed.
Comment 4 Markus Trippelsdorf 2016-07-29 12:58:23 UTC
No feedback, no suitable testcase.