Bug 61860 - Internal compiler error Killed (program cc1plus)
Summary: Internal compiler error Killed (program cc1plus)
Status: RESOLVED INVALID
Alias: None
Product: gcc
Classification: Unclassified
Component: c++ (show other bugs)
Version: unknown
: P3 normal
Target Milestone: ---
Assignee: Not yet assigned to anyone
URL:
Keywords:
Depends on:
Blocks:
 
Reported: 2014-07-20 22:37 UTC by Dave O(lday
Modified: 2014-09-17 16:33 UTC (History)
0 users

See Also:
Host:
Target:
Build:
Known to work:
Known to fail:
Last reconfirmed:


Attachments
Internal compiler error (9 bytes, text/plain)
2014-07-20 22:37 UTC, Dave O(lday
Details

Note You need to log in before you can comment on or make changes to this bug.
Description Dave O(lday 2014-07-20 22:37:08 UTC
Created attachment 33162 [details]
Internal compiler error

During compile of gnuradio using pybombs the procedure gets to one file and dies with the above message. Here's the output from the script...

/home/debian/pybombs/src/gnuradio/build/gr-digital/swig/digital_swigPYTHON_wrap.cxx: In function ‘void init_digital_swig()’:
/home/debian/pybombs/src/gnuradio/build/gr-digital/swig/digital_swigPYTHON_wrap.cxx:243666:21: warning: variable ‘md’ set but not used [-Wunused-but-set-variable]
g++: internal compiler error: Killed (program cc1plus)
Please submit a full bug report,
with preprocessed source if appropriate.
See <file:///usr/share/doc/gcc-4.6/README.Bugs> for instructions.
make[2]: *** [gr-digital/swig/CMakeFiles/_digital_swig.dir/digital_swigPYTHON_wrap.cxx.o] Error 4
make[1]: *** [gr-digital/swig/CMakeFiles/_digital_swig.dir/all] Error 2
make: *** [all] Error 2
Comment 1 Mikael Pettersson 2014-07-20 22:53:49 UTC
You ran out of RAM during the g++ job so the kernel killed it.  You need more RAM (preferably), or to add some swap (unpleasant but sometimes necessary).
Comment 2 Paolo Carlini 2014-09-17 16:33:53 UTC
Closing.