This is the mail archive of the libstdc++@gcc.gnu.org mailing list for the libstdc++ project.


Index Nav: [Date Index] [Subject Index] [Author Index] [Thread Index]
Message Nav: [Date Prev] [Date Next] [Thread Prev] [Thread Next]
Other format: [Raw text]

error in libstdc++


 I am getting the following error in libstdc++ on i686-pc-cygwin, trunk gcc.
It can't find the renamed headers.
I am thinking about zapping my object directory and starting over, just to 
be sure.

Bobby.

        /home/Owner/gcc/o/./gcc/xgcc -shared-libgcc -B/home/Owner/gcc/o/./gcc 
 -n
ostdinc++ -L/home/Owner/gcc/o/i686-pc-cygwin/libstdc++-v3/src -L/home/Owner/gcc/
o/i686-pc-cygwin/libstdc++-v3/src/.libs -B/usr/local/i686-pc-cygwin/bin/ -B/usr/
local/i686-pc-cygwin/lib/ -isystem 
/usr/local/i686-pc-cygwin/include -isystem /u
sr/local/i686-pc-cygwin/sys-include -Winvalid-pch -Wno-deprecated -x 
c++-header
-g -O2  -I/home/Owner/gcc/o/i686-pc-cygwin/libstdc++-v3/include/i686-pc-cygwin 
 -
I/home/Owner/gcc/o/i686-pc-cygwin/libstdc++-v3/include -I/home/Owner/gcc/gcc/lib
stdc++-v3/libsupc++ -O0 -g 
/home/Owner/gcc/gcc/libstdc++-v3/include/precompiled/
stdc++.h -o i686-pc-cygwin/bits/stdc++.h.gch/O0g.gch
/home/Owner/gcc/gcc/libstdc++-v3/include/precompiled/stdc++.h:37:19: error: 
cass
ert: No such file or directory
/home/Owner/gcc/gcc/libstdc++-v3/include/precompiled/stdc++.h:38:18: error: 
ccty
pe: No such file or directory
/home/Owner/gcc/gcc/libstdc++-v3/include/precompiled/stdc++.h:39:18: error: 
cerr
no: No such file or directory
/home/Owner/gcc/gcc/libstdc++-v3/include/precompiled/stdc++.h:40:18: error: 
cflo
at: No such file or directory
/home/Owner/gcc/gcc/libstdc++-v3/include/precompiled/stdc++.h:41:19: error: 
ciso
646: No such file or directory
/home/Owner/gcc/gcc/libstdc++-v3/include/precompiled/stdc++.h:42:19: error: 
clim
its: No such file or directory
/home/Owner/gcc/gcc/libstdc++-v3/include/precompiled/stdc++.h:43:19: error: 
cloc
ale: No such file or directory
/home/Owner/gcc/gcc/libstdc++-v3/include/precompiled/stdc++.h:44:17: error: 
cmat
h: No such file or directory
/home/Owner/gcc/gcc/libstdc++-v3/include/precompiled/stdc++.h:45:19: error: 
cset
jmp: No such file or directory
/home/Owner/gcc/gcc/libstdc++-v3/include/precompiled/stdc++.h:46:19: error: 
csig
nal: No such file or directory
/home/Owner/gcc/gcc/libstdc++-v3/include/precompiled/stdc++.h:47:19: error: 
cstd
arg: No such file or directory
/home/Owner/gcc/gcc/libstdc++-v3/include/precompiled/stdc++.h:48:19: error: 
cstd
def: No such file or directory
/home/Owner/gcc/gcc/libstdc++-v3/include/precompiled/stdc++.h:49:18: error: 
cstd
io: No such file or directory
/home/Owner/gcc/gcc/libstdc++-v3/include/precompiled/stdc++.h:50:19: error: 
cstd
lib: No such file or directory
/home/Owner/gcc/gcc/libstdc++-v3/include/precompiled/stdc++.h:51:19: error: 
cstr
ing: No such file or directory
/home/Owner/gcc/gcc/libstdc++-v3/include/precompiled/stdc++.h:52:17: error: 
ctim
e: No such file or directory
/home/Owner/gcc/gcc/libstdc++-v3/include/precompiled/stdc++.h:55:21: error: 
algo
rithm: No such file or directory
/home/Owner/gcc/gcc/libstdc++-v3/include/precompiled/stdc++.h:56:18: error: 
bits
et: No such file or directory
/home/Owner/gcc/gcc/libstdc++-v3/include/precompiled/stdc++.h:57:19: error: 
comp
lex: No such file or directory
/home/Owner/gcc/gcc/libstdc++-v3/include/precompiled/stdc++.h:58:17: error: 
dequ
e: No such file or directory
/home/Owner/gcc/gcc/libstdc++-v3/include/precompiled/stdc++.h:60:19: error: 
fstr
eam: No such file or directory
/home/Owner/gcc/gcc/libstdc++-v3/include/precompiled/stdc++.h:61:22: error: 
func
tional: No such file or directory
/home/Owner/gcc/gcc/libstdc++-v3/include/precompiled/stdc++.h:62:19: error: 
ioma
nip: No such file or directory
/home/Owner/gcc/gcc/libstdc++-v3/include/precompiled/stdc++.h:63:15: error: 
ios:
 No such file or directory
/home/Owner/gcc/gcc/libstdc++-v3/include/precompiled/stdc++.h:64:18: error: 
iosf
wd: No such file or directory
/home/Owner/gcc/gcc/libstdc++-v3/include/precompiled/stdc++.h:65:20: error: 
iost
ream: No such file or directory
/home/Owner/gcc/gcc/libstdc++-v3/include/precompiled/stdc++.h:66:19: error: 
istr
eam: No such file or directory
/home/Owner/gcc/gcc/libstdc++-v3/include/precompiled/stdc++.h:67:20: error: 
iter
ator: No such file or directory
/home/Owner/gcc/gcc/libstdc++-v3/include/precompiled/stdc++.h:68:18: error: 
limi
ts: No such file or directory
/home/Owner/gcc/gcc/libstdc++-v3/include/precompiled/stdc++.h:69:16: error: 
list
: No such file or directory
/home/Owner/gcc/gcc/libstdc++-v3/include/precompiled/stdc++.h:70:18: error: 
loca
le: No such file or directory
/home/Owner/gcc/gcc/libstdc++-v3/include/precompiled/stdc++.h:71:15: error: 
map:
 No such file or directory
/home/Owner/gcc/gcc/libstdc++-v3/include/precompiled/stdc++.h:72:18: error: 
memo
ry: No such file or directory
/home/Owner/gcc/gcc/libstdc++-v3/include/precompiled/stdc++.h:74:19: error: 
nume
ric: No such file or directory
/home/Owner/gcc/gcc/libstdc++-v3/include/precompiled/stdc++.h:75:19: error: 
ostr
eam: No such file or directory
/home/Owner/gcc/gcc/libstdc++-v3/include/precompiled/stdc++.h:76:17: error: 
queu
e: No such file or directory
/home/Owner/gcc/gcc/libstdc++-v3/include/precompiled/stdc++.h:77:15: error: 
set:
 No such file or directory
/home/Owner/gcc/gcc/libstdc++-v3/include/precompiled/stdc++.h:78:19: error: 
sstr
eam: No such file or directory
/home/Owner/gcc/gcc/libstdc++-v3/include/precompiled/stdc++.h:79:17: error: 
stac
k: No such file or directory
/home/Owner/gcc/gcc/libstdc++-v3/include/precompiled/stdc++.h:80:21: error: 
stde
xcept: No such file or directory
/home/Owner/gcc/gcc/libstdc++-v3/include/precompiled/stdc++.h:81:21: error: 
stre
ambuf: No such file or directory
/home/Owner/gcc/gcc/libstdc++-v3/include/precompiled/stdc++.h:82:18: error: 
stri
ng: No such file or directory
/home/Owner/gcc/gcc/libstdc++-v3/include/precompiled/stdc++.h:84:19: error: 
util
ity: No such file or directory
/home/Owner/gcc/gcc/libstdc++-v3/include/precompiled/stdc++.h:85:20: error: 
vala
rray: No such file or directory
/home/Owner/gcc/gcc/libstdc++-v3/include/precompiled/stdc++.h:86:18: error: 
vect
or: No such file or directory
In file included from 
/home/Owner/gcc/gcc/libstdc++-v3/include/precompiled/stdc+
+.h:73:
/home/Owner/gcc/gcc/libstdc++-v3/libsupc++/new:86: error: declaration of 
'operat
or new' as non-function
/home/Owner/gcc/gcc/libstdc++-v3/libsupc++/new:86: error: 'size_t' is not a 
memb
er of 'std'
/home/Owner/gcc/gcc/libstdc++-v3/libsupc++/new:87: error: declaration of 
'operat
or new []' as non-function
/home/Owner/gcc/gcc/libstdc++-v3/libsupc++/new:87: error: 'size_t' is not a 
memb
er of 'std'
/home/Owner/gcc/gcc/libstdc++-v3/libsupc++/new:90: error: declaration of 
'operat
or new' as non-function
/home/Owner/gcc/gcc/libstdc++-v3/libsupc++/new:90: error: 'size_t' is not a 
memb
er of 'std'
/home/Owner/gcc/gcc/libstdc++-v3/libsupc++/new:90: error: expected 
primary-expre
ssion before 'const'
/home/Owner/gcc/gcc/libstdc++-v3/libsupc++/new:91: error: declaration of 
'operat
or new []' as non-function
/home/Owner/gcc/gcc/libstdc++-v3/libsupc++/new:91: error: 'size_t' is not a 
memb
er of 'std'
/home/Owner/gcc/gcc/libstdc++-v3/libsupc++/new:91: error: expected 
primary-expre
ssion before 'const'
/home/Owner/gcc/gcc/libstdc++-v3/libsupc++/new:96: error: declaration of 
'operat
or new' as non-function
/home/Owner/gcc/gcc/libstdc++-v3/libsupc++/new:96: error: 'size_t' is not a 
memb
er of 'std'
/home/Owner/gcc/gcc/libstdc++-v3/libsupc++/new:96: error: expected 
primary-expre
ssion before 'void'
/home/Owner/gcc/gcc/libstdc++-v3/libsupc++/new:97: error: declaration of 
'operat
or new []' as non-function
/home/Owner/gcc/gcc/libstdc++-v3/libsupc++/new:97: error: 'size_t' is not a 
memb
er of 'std'
/home/Owner/gcc/gcc/libstdc++-v3/libsupc++/new:97: error: expected 
primary-expre
ssion before 'void'
make[4]: *** [i686-pc-cygwin/bits/stdc++.h.gch/O0g.gch] Error 1
make[4]: Leaving directory 
`/home/Owner/gcc/o/i686-pc-cygwin/libstdc++-v3/includ
e'
make[3]: *** [all-recursive] Error 1
make[3]: Leaving directory `/home/Owner/gcc/o/i686-pc-cygwin/libstdc++-v3'
make[2]: *** [all] Error 2
make[2]: Leaving directory `/home/Owner/gcc/o/i686-pc-cygwin/libstdc++-v3'
make[1]: *** [all-target-libstdc++-v3] Error 2
make[1]: Leaving directory `/home/Owner/gcc/o'
make: *** [all] Error 2

Owner@BOBBY ~/gcc/o
$ 




Index Nav: [Date Index] [Subject Index] [Author Index] [Thread Index]
Message Nav: [Date Prev] [Date Next] [Thread Prev] [Thread Next]