This is the mail archive of the libstdc++@gcc.gnu.org mailing list for the libstdc++ project.


Index Nav: [Date Index] [Subject Index] [Author Index] [Thread Index]
Message Nav: [Date Prev] [Date Next] [Thread Prev] [Thread Next]
Other format: [Raw text]

Make Error


Hello,
I have found the following error during the make process:

/mnt/buildsys/build/alpha6/basic/native/toolchain/gcc/xgcc -shared-libgcc -B/mnt/buildsys/build/alpha6/basic/native/toolchain/gcc/ -nostdinc++ -L/mnt/buildsys/build/alpha6/basic/native/toolchain/alphaev67-unknown-linux-gnu/libstdc++-v3/src -L/mnt/buildsys/build/alpha6/basic/native/toolchain/alphaev67-unknown-linux-gnu/libstdc++-v3/src/.libs -B/mnt/buildsys/install/alpha6/basic/native/toolchain/alphaev67-unknown-linux-gnu/bin/ -B/mnt/buildsys/install/alpha6/basic/native/toolchain/alphaev67-unknown-linux-gnu/lib/ -isystem /mnt/buildsys/install/alpha6/basic/native/toolchain/alphaev67-unknown-linux-gnu/include -L/mnt/buildsys/build/alpha6/basic/native/toolchain/ld -nostdinc++ -I/mnt/buildsys/build/alpha6/basic/native/toolchain/alphaev67-unknown-linux-gnu/libstdc++-v3/include/alphaev67-unknown-linux-gnu -I/mnt/buildsys/build/alpha6/basic/native/toolchain/alphaev67-unknown-linux-gnu/libstdc++-v3/include -I/mnt/buildsys/source/toolchain/libstdc++-v3/libsupc++ -I/mnt/buildsys/source/toolchain/libstdc++-v3/libmath -g -O2 -D_GNU_SOURCE -mieee -fno-implicit-templates -Wall -Wno-format -W -Wwrite-strings -Winline -fdiagnostics-show-location=once -ffunction-sections -fdata-sections -g -c /mnt/buildsys/source/toolchain/libstdc++-v3/src/ext-inst.cc -o ext-inst.o >/dev/null 2>&1
make[4]: *** No rule to make target `fstream.cc', needed by `fstream.lo'. Stop.
make[4]: Leaving directory `/mnt/buildsys/build/alpha6/basic/native/toolchain/alphaev67-unknown-linux-gnu/libstdc++-v3/src'
make[3]: *** [all-recursive] Error 1
make[3]: Leaving directory `/mnt/buildsys/build/alpha6/basic/native/toolchain/alphaev67-unknown-linux-gnu/libstdc++-v3'
make[2]: *** [all-recursive-am] Error 2
make[2]: Leaving directory `/mnt/buildsys/build/alpha6/basic/native/toolchain/alphaev67-unknown-linux-gnu/libstdc++-v3'
make[1]: *** [all-target-libstdc++-v3] Error 2
make[1]: Leaving directory `/mnt/buildsys/build/alpha6/basic/native/toolchain'
make: *** [bootstrap] Error 2

I am building on an alpha with the alphaev67-unknown-linux-gnu configuration and the error occurs in the basic toolchain package. Can someone please fix this.
Salutations,
-Mike Cleary


Index Nav: [Date Index] [Subject Index] [Author Index] [Thread Index]
Message Nav: [Date Prev] [Date Next] [Thread Prev] [Thread Next]