This is the mail archive of the java@gcc.gnu.org mailing list for the Java project.


Index Nav: [Date Index] [Subject Index] [Author Index] [Thread Index]
Message Nav: [Date Prev] [Date Next] [Thread Prev] [Thread Next]
Other format: [Raw text]

Building GCJ Error


I am trying to compile gcc 4.1.1 and I get the
following error.

Thanks in advance

CSJakharia


m -f libcpp.a
ar cru libcpp.a charset.o directives.o errors.o expr.o
files.o 

identifiers.o init.o lex.o line-map.o macro.o mkdeps.o
pch.o symtab.o 

traditional.o
ranlib libcpp.a
gcc  -I/gcjsrc/gcc-4.1.1/libcpp -I. 

-I/gcjsrc/gcc-4.1.1/libcpp/../include 

-I/gcjsrc/gcc-4.1.1/libcpp/include  -g -O2  -W -Wall
-Wwrite-strings 

-Wstrict-prototypes -Wmissing-prototypes
-Wold-style-definition 

-Wmissing-format-attribute -pedantic -Wno-long-long  

-I/gcjsrc/gcc-4.1.1/libcpp -I.
-I/gcjsrc/gcc-4.1.1/libcpp/../include 

-I/gcjsrc/gcc-4.1.1/libcpp/include  -c -o makedepend.o
-MT makedepend.o 

-MD -MP -MF .deps/makedepend.Po
/gcjsrc/gcc-4.1.1/libcpp/makedepend.c
gcc -g -O2   -o makedepend.exe \
  makedepend.o libcpp.a ../libiberty/libiberty.a \
   -liconv
make[2]: Leaving directory `/xgccbuild/libcpp'
make[2]: Entering directory `/xgccbuild/gcc'
Makefile:1277: *** target pattern contains no `%'. 
Stop.
make[2]: Leaving directory `/xgccbuild/gcc'
make[1]: *** [all-gcc] Error 2
make[1]: Leaving directory `/xgccbuild'
make: *** [all] Error 2
Press ENTER when you are ready to install...
make[1]: Entering directory `/xgccbuild'
/bin/sh /gcjsrc/gcc-4.1.1/mkinstalldirs /xgcc /xgcc
make[2]: Entering directory `/xgccbuild/fastjar'
make[3]: Entering directory `/xgccbuild/fastjar'
test -z "/xgcc/bin" || mkdir -p -- "/xgcc/bin"
  /bin/install -c 'fastjar.exe'
'/xgcc/bin/fastjar.exe'
  /bin/install -c 'grepjar.exe'
'/xgcc/bin/grepjar.exe'
test -z "/xgcc/info" || mkdir -p -- "/xgcc/info"
 /bin/install -c -m 644 './fastjar.info'
'/xgcc/info/fastjar.info'
 install-info --info-dir='/xgcc/info'
'/xgcc/info/fastjar.info'
test -z "/xgcc/man/man1" || mkdir -p --
"/xgcc/man/man1"
 /bin/install -c -m 644
'/gcjsrc/gcc-4.1.1/fastjar/fastjar.1' 

'/xgcc/man/man1/fastjar.1'
 /bin/install -c -m 644
'/gcjsrc/gcc-4.1.1/fastjar/grepjar.1' 

'/xgcc/man/man1/grepjar.1'
make[3]: Leaving directory `/xgccbuild/fastjar'
make[2]: Leaving directory `/xgccbuild/fastjar'
make[2]: Entering directory `/xgccbuild/fixincludes'
rm -rf
/xgcc/libexec/gcc/i686-pc-mingw32/4.1.1/install-tools
/bin/sh /gcjsrc/gcc-4.1.1/fixincludes/../mkinstalldirs


/xgcc/libexec/gcc/i686-pc-mingw32/4.1.1/install-tools 
mkdir -p --
/xgcc/libexec/gcc/i686-pc-mingw32/4.1.1/install-tools
/bin/sh /gcjsrc/gcc-4.1.1/fixincludes/../mkinstalldirs


/xgcc/lib/gcc/i686-pc-mingw32/4.1.1/install-tools/include
mkdir -p --
/xgcc/lib/gcc/i686-pc-mingw32/4.1.1/install-tools/include
/bin/install -c -m 644
/gcjsrc/gcc-4.1.1/fixincludes/README-fixinc \
 
/xgcc/lib/gcc/i686-pc-mingw32/4.1.1/install-tools/include/README
/bin/install -c fixinc.sh 

/xgcc/libexec/gcc/i686-pc-mingw32/4.1.1/install-tools/fixinc.sh
/bin/install -c fixincl.exe \
 
/xgcc/libexec/gcc/i686-pc-mingw32/4.1.1/install-tools/fixincl.exe
/bin/install -c mkheaders 

/xgcc/libexec/gcc/i686-pc-mingw32/4.1.1/install-tools/mkheaders
make[2]: Leaving directory `/xgccbuild/fixincludes'
make[2]: Entering directory `/xgccbuild/gcc'
Makefile:1277: *** target pattern contains no `%'. 
Stop.
make[2]: Leaving directory `/xgccbuild/gcc'
make[1]: *** [install-gcc] Error 2
make[1]: Leaving directory `/xgccbuild'
make: *** [install] Error 2


 Subscribe to bermudaEmail:  [input]  [input] Browse Archives at groups.google.com

__________________________________________________
Do You Yahoo!?
Tired of spam?  Yahoo! Mail has the best spam protection around 
http://mail.yahoo.com 


Index Nav: [Date Index] [Subject Index] [Author Index] [Thread Index]
Message Nav: [Date Prev] [Date Next] [Thread Prev] [Thread Next]