java-prs archive
date index for January - March, 2012

This is the mail archive of the java-prs@gcc.gnu.org mailing list for the Java project.

Indexes: [Date Index] [Subject Index] [Author Index] [Thread Index]
Site Nav: [Browse other archives for this mailing list]
[Browse other mailing lists at this site]
Search: Limit to:


2012-03-31 [Bug java/52805] [4.8 Regression] 243 new GCC HEAD@185977regressions (libjava failures) iains at gcc dot gnu.org
2012-03-31 [Bug java/52805] New: [4.8 Regression] 243 new GCC HEAD@185977regressions (libjava failures) dominiq at lps dot ens.fr
2012-03-29 [Bug java/52730] Java front end emits assembly steven at gcc dot gnu.org
2012-03-29 [Bug java/52730] Java front end emits assembly steven at gcc dot gnu.org
2012-03-28 [Bug libgcj/50845] java.util.concurrent.ThreadPoolExecutor do notwork with core thread=0 bentatham at nanometrics dot ca
2012-03-28 [Bug libgcj/52694] [4.8 regression] bootstrap failure:libjava/java/io/natVMConsole.cc:35:20: error: 'IUCL C' was not declared inthis scope gnu_andrew at member dot fsf.org
2012-03-27 [Bug java/52730] Java front end emits assembly steven at gcc dot gnu.org
2012-03-27 [Bug libgcj/52645]gnu/java/net/natPlainDatagramSocketImpl.cc:660:14: error: 'IPPROTO_IPV6' wasnot declared in this scope dave.anglin at bell dot net
2012-03-26 [Bug java/52730] Java front end emits assembly stevenb.gcc at gmail dot com
2012-03-26 [Bug java/52730] Java front end emits assembly hjl.tools at gmail dot com
2012-03-26 [Bug java/52730] Java front end emits assembly ebotcazou at gcc dot gnu.org
2012-03-26 [Bug java/52730] Java front end emits assembly steven at gcc dot gnu.org
2012-03-26 [Bug libgcj/52694] [4.8 regression] bootstrap failure:libjava/java/io/natVMConsole.cc:35:20: error: 'IUCL C' was not declared inthis scope gerald at pfeifer dot com
2012-03-26 [Bug libgcj/52694] [4.8 regression] bootstrap failure:libjava/java/io/natVMConsole.cc:35:20: error: 'IUCL C' was not declared inthis scope gerald at gcc dot gnu.org
2012-03-26 [Bug libgcj/52645]gnu/java/net/natPlainDatagramSocketImpl.cc:660:14: error: 'IPPROTO_IPV6' wasnot declared in this scope ro at CeBiTec dot Uni-Bielefeld.DE
2012-03-24 [Bug libgcj/52645]gnu/java/net/natPlainDatagramSocketImpl.cc:660:14: error: 'IPPROTO_IPV6' wasnot declared in this scope dave.anglin at bell dot net
2012-03-23 [Bug libgcj/52694] [4.8 regression] bootstrap failure:libjava/java/io/natVMConsole.cc:35:20: error: 'IUCL C' was not declared inthis scope dominiq at lps dot ens.fr
2012-03-23 [Bug libgcj/52694] [4.8 regression] bootstrap failure:libjava/java/io/natVMConsole.cc:35:20: error: 'IUCL C' was not declared inthis scope gerald at pfeifer dot com
2012-03-23 [Bug libgcj/52694] [4.8 regression] bootstrap failure:libjava/java/io/natVMConsole.cc:35:20: error: 'IUCL C' was not declared inthis scope dominiq at lps dot ens.fr
2012-03-23 [Bug libgcj/52694] [4.8 regression] bootstrap failure:libjava/java/io/natVMConsole.cc:35:20: error: 'IUCL C' was not declared inthis scope pinskia at gcc dot gnu.org
2012-03-23 [Bug libgcj/52694] [4.8 regression] bootstrap failure:libjava/java/io/natVMConsole.cc:35:20: error: 'IUCL C' was not declared inthis scope pinskia at gcc dot gnu.org
2012-03-23 [Bug java/52690] New: ICE after bootstrap comparison in libjava fang at csl dot cornell.edu
2012-03-22 [Bug java/50045] [4.7/4.8 regression] ICE in gcc/java/lang.c:427with -fdump-tree-all rguenth at gcc dot gnu.org
2012-03-22 [Bug libgcj/51498] make dejagnu work in libjava testsuite withcross-build rguenth at gcc dot gnu.org
2012-03-22 [Bug libgcj/50421] [4.7/4.8 Regression] GC Warning: Out of Memory! Returning NIL! rguenth at gcc dot gnu.org
2012-03-21 [Bug libgcj/52645]gnu/java/net/natPlainDatagramSocketImpl.cc:660:14: error: 'IPPROTO_IPV6' wasnot declared in this scope ro at gcc dot gnu.org
2012-03-21 [Bug libgcj/52645]gnu/java/net/natPlainDatagramSocketImpl.cc:660:14: error: 'IPPROTO_IPV6' wasnot declared in this scope ro at CeBiTec dot Uni-Bielefeld.DE
2012-03-21 [Bug libgcj/52645]gnu/java/net/natPlainDatagramSocketImpl.cc:660:14: error: 'IPPROTO_IPV6' wasnot declared in this scope dave.anglin at bell dot net
2012-03-21 [Bug libgcj/52645]gnu/java/net/natPlainDatagramSocketImpl.cc:660:14: error: 'IPPROTO_IPV6' wasnot declared in this scope ro at CeBiTec dot Uni-Bielefeld.DE
2012-03-21 [Bug libgcj/52645]gnu/java/net/natPlainDatagramSocketImpl.cc:660:14: error: 'IPPROTO_IPV6' wasnot declared in this scope dave.anglin at bell dot net
2012-03-21 [Bug libgcj/52645]gnu/java/net/natPlainDatagramSocketImpl.cc:660:14: error: 'IPPROTO_IPV6' wasnot declared in this scope ro at CeBiTec dot Uni-Bielefeld.DE
2012-03-21 [Bug libgcj/52645] New:gnu/java/net/natPlainDatagramSocketImpl.cc:660:14: error: 'IPPROTO_IPV6' wasnot declared in this scope danglin at gcc dot gnu.org
2012-03-14 [Bug libgcj/52579] [4.8 regression] i386_w32_fallback_frame_stateshould care ffi raw-closure stub function rguenth at gcc dot gnu.org
2012-03-13 [Bug libgcj/52579] New: [4.8 regression]i386_w32_fallback_frame_state should care ffi raw-closure stub function jojelino at gmail dot com
2012-03-13 [Bug libgcj/40181] [4.4 Regression] regressions in libjava testsuiteon s390-linux jakub at gcc dot gnu.org
2012-03-13 [Bug libgcj/21714] [4.5/4.6/4.7/4.8 Regression] libjava bootstrapfailure in java/lang/natConcreteProcess.cc jakub at gcc dot gnu.org
2012-03-13 [Bug java/43055] [4.5/4.6/4.7/4.8 Regression] 'jc1: internalcompiler error: Segmentation fault' using gcj -fprofile-arcs jakub at gcc dot gnu.org
2012-03-13 [Bug libgcj/40180] [4.5/4.6/4.7/4.8 regression] regressions inlibjava testsuite on ia64-linux jakub at gcc dot gnu.org
2012-03-13 [Bug java/42143] [4.5/4.6/4.7/4.8 Regression] gcj creates "dummy"variables jakub at gcc dot gnu.org
2012-03-13 [Bug java/24698] [4.5/4.6/4.7/4.8 regression] SIGABRT when usingResourceBundle.getBundle with a nonexistant key jakub at gcc dot gnu.org
2012-03-13 [Bug java/18190] [4.5/4.6/4.7/4.8 regression] primitive arrayoptimization is gone jakub at gcc dot gnu.org
2012-03-03 [Bug java/52468] Build failure for *-*-mingw32 ktietz at gcc dot gnu.org
2012-03-03 [Bug java/52468] New: Build failure for *-*-mingw32 vanboxem.ruben at gmail dot com
2012-03-01 [Bug libgcj/44415] [4.6/4.7 regression] gmp multilib support brokebootstrap with static libgmp jakub at gcc dot gnu.org
2012-03-01 [Bug java/44495] [4.6/4.7 regression] ICE injava_mangle_resource_name, at java/mangle.c:658 jakub at gcc dot gnu.org
2012-02-26 [Bug java/52384] PR16923 execution test fails howarth at nitro dot med.uc.edu
2012-02-26 [Bug java/52384] PR16923 execution test fails howarth at nitro dot med.uc.edu
2012-02-25 [Bug java/52384] New: PR16923 execution test fails howarth at nitro dot med.uc.edu
2012-02-22 [Bug libgcj/52344] New: [4.x regression] _Jv_platform_nanotime ofwin32.cc is wrong jojelino at gmail dot com
2012-02-22 [Bug java/50045] [4.7 regression] ICE in gcc/java/lang.c:427 with-fdump-tree-all ktietz at gcc dot gnu.org
2012-02-22 [Bug libgcj/50057] [4.7 regression] misalignment ofjava_exception_header resulted in throwable to be null ktietz at gcc dot gnu.org
2012-02-22 [Bug libgcj/50057] [4.7 regression] misalignment ofjava_exception_header resulted in throwable to be null jojelino at gmail dot com
2012-02-22 [Bug libgcj/16997] WeakHashMap leaks memory xiaoyuanbo at yeah dot net
2012-02-22 [Bug libgcj/24154] Make requires too much memory building libjava xiaoyuanbo at yeah dot net
2012-02-22 [Bug libgcj/50057] [4.7 regression] misalignment ofjava_exception_header resulted in throwable to be null ktietz at gcc dot gnu.org
2012-02-22 [Bug libgcj/27031] native Eclipse uses too much memory on startup,sometimes xiaoyuanbo at yeah dot net
2012-02-14 [Bug libgcj/50057] [4.7 regression] misalignment ofjava_exception_header resulted in throwable to be null ktietz at gcc dot gnu.org
2012-02-14 [Bug libgcj/50895] Build failure in jni.cc ktietz at gcc dot gnu.org
2012-02-14 [Bug java/32091] Can't build gcj in mingw32 in window XP (gcc-4.2.0) ktietz at gcc dot gnu.org
2012-02-13 [Bug libgcj/51500] [4.7 regression] 106 unexpected libjava testsuitefailures with mingw32 ktietz at gcc dot gnu.org
2012-02-10 [Bug libgcj/50057] [4.7 regression] misalignment ofjava_exception_header resulted in throwable to be null ktietz at gcc dot gnu.org
2012-02-10 [Bug libgcj/50057] [4.7 regression] misalignment ofjava_exception_header resulted in throwable to be null ktietz at gcc dot gnu.org
2012-02-07 [Bug libgcj/12708] SIGSEGV, Segmentation fault starting java program gyanendra.webmaster at gmail dot com
2012-02-05 [Bug libgcj/51500] [4.7 regression] 106 unexpected libjava testsuitefailures with mingw32 jojelino at gmail dot com
2012-02-05 [Bug libgcj/51500] [4.7 regression] 106 unexpected libjava testsuitefailures with mingw32 jojelino at gmail dot com
2012-02-03 [Bug libgcj/35407] tries to link 32 instead of 64 bit version oflibasound.so in midi-alsa pinskia at gcc dot gnu.org
2012-02-03 [Bug java/48512] [4.6] gcj spec files references incorrectly crtmt.oon i686-w64-mingw32 target ktietz at gcc dot gnu.org
2012-02-03 [Bug java/48512] [4.6] gcj spec files references incorrectly crtmt.oon i686-w64-mingw32 target ktietz at gcc dot gnu.org
2012-02-03 [Bug java/48512] [4.6] gcj spec files references incorrectly crtmt.oon i686-w64-mingw32 target ktietz at gcc dot gnu.org
2012-02-03 [Bug libgcj/33311] gcj: libgcj.spec: No such file or directory pinskia at gcc dot gnu.org
2012-02-02 [Bug libgcj/38414] gcc 4.3-20081204 build broken on OS X 10.4 ppc pinskia at gcc dot gnu.org
2012-02-02 [Bug libgcj/39161] gcc 4.4.0 20090210 - The 'copy-vmresources.sh'script can't find the 'mkinstalldirs' script. pinskia at gcc dot gnu.org
2012-02-02 [Bug libgcj/43258] In-tree build may fail in libjava/classpath/tools pinskia at gcc dot gnu.org
2012-02-02 [Bug libgcj/39161] gcc 4.4.0 20090210 - The 'copy-vmresources.sh'script can't find the 'mkinstalldirs' script. pinskia at gcc dot gnu.org
2012-02-02 [Bug libgcj/44567] FreeBSD 6.x compile error pinskia at gcc dot gnu.org
2012-02-02 [Bug libgcj/46082] libgcj fails to build in current 4.5 branch pinskia at gcc dot gnu.org
2012-02-02 [Bug libgcj/46999] Problem compiling gcc 4.5.2 pinskia at gcc dot gnu.org
2012-02-02 [Bug java/50045] [4.7 regression] ICE in gcc/java/lang.c:427 with-fdump-tree-all pinskia at gcc dot gnu.org
2012-02-02 [Bug java/48512] [4.6] gcj spec files references incorrectly crtmt.oon i686-w64-mingw32 target ktietz at gcc dot gnu.org
2012-02-01 [Bug libgcj/51500] [4.7 regression] 106 unexpected libjava testsuitefailures with mingw32 ktietz at gcc dot gnu.org
2012-02-01 [Bug libgcj/51500] [4.7 regression] 106 unexpected libjava testsuitefailures with mingw32 jojelino at gmail dot com
2012-01-31 [Bug libgcj/51500] [4.7 regression] 106 unexpected libjava testsuitefailures with mingw32 ktietz70 at googlemail dot com
2012-01-30 [Bug libgcj/51500] [4.7 regression] 106 unexpected libjava testsuitefailures with mingw32 ubizjak at gmail dot com
2012-01-30 [Bug libgcj/51500] [4.7 regression] 106 unexpected libjava testsuitefailures with mingw32 ktietz at gcc dot gnu.org
2012-01-30 [Bug libgcj/51500] [4.7 regression] 106 unexpected libjava testsuitefailures with mingw32 ubizjak at gmail dot com
2012-01-30 [Bug libgcj/51500] [4.7 regression] 106 unexpected libjava testsuitefailures with mingw32 ktietz at gcc dot gnu.org
2012-01-30 [Bug libgcj/51500] [4.7 regression] 106 unexpected libjava testsuitefailures with mingw32 ubizjak at gmail dot com
2012-01-30 [Bug libgcj/51500] [4.7 regression] 106 unexpected libjava testsuitefailures with mingw32 jojelino at gmail dot com
2012-01-30 [Bug libgcj/51500] [4.7 regression] 106 unexpected libjava testsuitefailures with mingw32 ktietz at gcc dot gnu.org
2012-01-30 [Bug libgcj/51901] java.security.Security.getProperty throwsExceptionInInitializerError jojelino at gmail dot com
2012-01-24 [Bug libgcj/50895] Build failure in jni.cc vanboxem.ruben at gmail dot com
2012-01-23 [Bug libgcj/50895] Build failure in jni.cc ktietz at gcc dot gnu.org
2012-01-20 [Bug libgcj/50831] [4.7 regression] __gcc_register_frame must throwerror when failed to load dll ktietz at gcc dot gnu.org
2012-01-19 [Bug libgcj/51901] [4.7 regression]java.security.Security.getProperty throws ExceptionInInitializerError jojelino at gmail dot com
2012-01-19 [Bug libgcj/51901] [4.7 regression]java.security.Security.getProperty throws ExceptionInInitializerError jakub at gcc dot gnu.org
2012-01-19 [Bug libgcj/51901] [4.7 regression]java.security.Security.getProperty throws ExceptionInInitializerError rguenth at gcc dot gnu.org
2012-01-19 [Bug libgcj/51901] New: [4.7 regression]java.security.Security.getProperty throws ExceptionInInitializerError jojelino at gmail dot com
2012-01-18 [Bug libgcj/51500] [4.7 regression] 106 unexpected libjava testsuitefailures with mingw32 jojelino at gmail dot com
2012-01-18 [Bug libgcj/50831] [4.7 regression] __gcc_register_frame must throwerror when failed to load dll jojelino at gmail dot com
2012-01-18 [Bug libgcj/50831] [4.7 regression] __gcc_register_frame must throwerror when failed to load dll jojelino at gmail dot com
2012-01-18 [Bug libgcj/50057] [4.7 regression] misalignment ofjava_exception_header resulted in throwable to be null jojelino at gmail dot com
2012-01-18 [Bug libgcj/50057] [4.7 regression] SIGSEGV in natObject.cc:58 jojelino at gmail dot com
2012-01-16 [Bug classpath/39747] Installation documentation should suggestbuilding libgmp as PIC for building with libjava rguenth at gcc dot gnu.org
2012-01-16 [Bug libgcj/51498] make dejagnu work in libjava testsuite withcross-build jojelino at gmail dot com
2012-01-13 [Bug java/41356] Circular dependencies between jars cause errors:jars order shouldn't matter pinskia at gcc dot gnu.org
2012-01-12 [Bug libgcj/23856] Modification Time Incorrectly Set From ExtensionEntry rmathew at gcc dot gnu.org
2012-01-12 [Bug libgcj/23856] Modification Time Incorrectly Set From ExtensionEntry gnu_andrew at member dot fsf.org
2012-01-12 [Bug libgcj/23856] Modification Time Incorrectly Set From ExtensionEntry rmathew at gcc dot gnu.org
2012-01-11 [Bug java/24698] [4.4/4.5/4.6/4.7 regression] SIGABRT when usingResourceBundle.getBundle with a nonexistant key rguenth at gcc dot gnu.org
2012-01-11 [Bug libgcj/23856] Modification Time Incorrectly Set From ExtensionEntry rguenth at gcc dot gnu.org
2012-01-11 [Bug libgcj/23800] Exception in thread "main"java.lang.NullPointerException at java.lang.Object.getClass() rguenth at gcc dot gnu.org
2012-01-11 [Bug libgcj/23686] path embbeded using -rpath is ignored whenhandling System.loadLibrary() rguenth at gcc dot gnu.org
2012-01-11 [Bug libgcj/22341] Interix: gcj out of virtual mem during libgcjmake rguenth at gcc dot gnu.org
2012-01-11 [Bug libgcj/22344] Interix: "copying ..." when making libgcj takestoo long rguenth at gcc dot gnu.org
2012-01-11 [Bug libgcj/21754] ./libtool: /mingw/bin/ar: Invalid argument rguenth at gcc dot gnu.org
2012-01-11 [Bug libgcj/21524] Cancelling a TimerTask puts Timer binary heap ininconsistent state rguenth at gcc dot gnu.org
2012-01-11 [Bug libgcj/21267] [win32] Non-English File Names processedincorrectly rguenth at gcc dot gnu.org
2012-01-11 [Bug libgcj/21217] "Argument list too long" when guilding gcj rguenth at gcc dot gnu.org
2012-01-11 [Bug java/21016] Indirect dispatch code generated when using-findirect-dispatch has wrong line numbers rguenth at gcc dot gnu.org
2012-01-11 [Bug java/20735] gcj writes bogus source filenames for inner classesread from .class files rguenth at gcc dot gnu.org
2012-01-11 [Bug libgcj/20223] libjava testsuite does not fully supportmultilibs rguenth at gcc dot gnu.org
2012-01-11 [Bug libgcj/19003] Potential problems in libjava system calls withgc-boehm rguenth at gcc dot gnu.org
2012-01-11 [Bug java/18433] gcj compiling resources from a file list doesn'twork (ICE) rguenth at gcc dot gnu.org
2012-01-11 [Bug java/16200] gcj generates dependencies on the full contents ofthe extensions directory rguenth at gcc dot gnu.org
2012-01-10 [Bug java/21855] array bounds checking elimination tromey at gcc dot gnu.org
2012-01-10 [Bug java/21855] array bounds checking elimination tromey at gcc dot gnu.org
2012-01-10 [Bug java/21855] array bounds checking elimination aph at gcc dot gnu.org
2012-01-10 [Bug java/21855] array bounds checking elimination rguenth at gcc dot gnu.org
2012-01-10 [Bug java/21855] array bounds checking elimination rguenth at gcc dot gnu.org
2012-01-10 [Bug java/47456] internal compiler error: Segmentation fault whileusing jna ktietz at gcc dot gnu.org
2012-01-10 [Bug java/21855] array bounds checking elimination aph at gcc dot gnu.org
2012-01-10 [Bug java/21855] array bounds checking elimination rguenth at gcc dot gnu.org
2012-01-10 [Bug java/21855] array bounds checking elimination rguenth at gcc dot gnu.org
2012-01-10 [Bug java/21855] array bounds checking elimination aph at gcc dot gnu.org
2012-01-10 [Bug java/21855] array bounds checking elimination rguenth at gcc dot gnu.org
2012-01-10 [Bug tree-optimization/21855] array bounds checking elimination aph at gcc dot gnu.org
2012-01-10 [Bug libgcj/23216] IncompatibleClassChangeError when UsingJava-Gnome rguenth at gcc dot gnu.org
2012-01-10 [Bug tree-optimization/21855] array bounds checking elimination rguenth at gcc dot gnu.org
2012-01-10 [Bug java/19325] Invoking gcj -C on a list of source files consumesinsane amount of memory rguenth at gcc dot gnu.org
2012-01-10 [Bug java/48515] [4.6] GCJ fails to compile jni.cc because ofreflection errors on i686-w64-mingw32 target rguenth at gcc dot gnu.org
2012-01-04 [Bug libgcj/51498] [4.7 regression] temporary hack to make dejagnuwork in libjava rguenth at gcc dot gnu.org
Indexes: [Date Index] [Subject Index] [Author Index] [Thread Index]
Site Nav: [Browse other archives for this mailing list]
[Browse other mailing lists at this site]
Search: Limit to:

Mail converted by MHonArc 2.6.3