java-prs archive
date index for January - March, 2010

This is the mail archive of the java-prs@gcc.gnu.org mailing list for the Java project.

Indexes: [Date Index] [Subject Index] [Author Index] [Thread Index]
Site Nav: [Browse other archives for this mailing list]
[Browse other mailing lists at this site]
Search: Limit to:


2010-03-31 [Bug libgcj/40860] [4.4/4.5 regression] regressions in libjava testsuite on arm-linux mikpe at it dot uu dot se
2010-03-31 [Bug libgcj/40860] [4.4/4.5 regression] regressions in libjava testsuite on arm-linux rearnsha at gcc dot gnu dot org
2010-03-30 [Bug libgcj/40860] [4.4/4.5 regression] regressions in libjava testsuite on arm-linux mikpe at it dot uu dot se
2010-03-30 [Bug libgcj/40860] [4.4/4.5 regression] regressions in libjava testsuite on arm-linux pbrook at gcc dot gnu dot org
2010-03-30 [Bug libgcj/40860] [4.4/4.5 regression] regressions in libjava testsuite on arm-linux mikpe at it dot uu dot se
2010-03-24 [Bug java/43504] many libjava testsuite regressions on x86_64-apple-darwin10 mrs at gcc dot gnu dot org
2010-03-24 [Bug java/43504] many libjava testsuite regressions on x86_64-apple-darwin10 mrs at gcc dot gnu dot org
2010-03-24 [Bug java/43504] many libjava testsuite regressions on x86_64-apple-darwin10 mrs at gcc dot gnu dot org
2010-03-24 [Bug java/43504] many libjava testsuite regressions on x86_64-apple-darwin10 howarth at nitro dot med dot uc dot edu
2010-03-24 [Bug java/43504] many libjava testsuite regressions on x86_64-apple-darwin10 dominiq at lps dot ens dot fr
2010-03-24 [Bug java/43504] many libjava testsuite regressions on x86_64-apple-darwin10 howarth at nitro dot med dot uc dot edu
2010-03-24 [Bug java/43504] New: many libjava testsuite regressions on x86_64-apple-darwin10 howarth at nitro dot med dot uc dot edu
2010-03-22 [Bug libgcj/40860] [4.4/4.5 regression] regressions in libjava testsuite on arm-linux rearnsha at gcc dot gnu dot org
2010-03-21 [Bug target/42811] [4.5 regression] java.lang.ExceptionInInitializerError in ecj1 davek at gcc dot gnu dot org
2010-03-21 [Bug target/42811] [4.5 regression] java.lang.ExceptionInInitializerError in ecj1 davek at gcc dot gnu dot org
2010-03-21 [Bug target/42811] [4.5 regression] java.lang.ExceptionInInitializerError in ecj1 davek at gcc dot gnu dot org
2010-03-21 [Bug target/42811] [4.5 regression] java.lang.ExceptionInInitializerError in ecj1 davek at gcc dot gnu dot org
2010-03-21 [Bug target/42811] [4.5 regression] java.lang.ExceptionInInitializerError in ecj1 davek at gcc dot gnu dot org
2010-03-20 [Bug libgcj/40860] [4.4/4.5 regression] regressions in libjava testsuite on arm-linux mikpe at it dot uu dot se
2010-03-20 [Bug libgcj/40860] [4.4/4.5 regression] regressions in libjava testsuite on arm-linux mikpe at it dot uu dot se
2010-03-20 [Bug java/42811] [4.5 regression] java.lang.ExceptionInInitializerError in ecj1 davek at gcc dot gnu dot org
2010-03-20 [Bug java/42811] [4.5 regression] java.lang.ExceptionInInitializerError in ecj1 rguenth at gcc dot gnu dot org
2010-03-20 [Bug java/42811] [4.5 regression] java.lang.ExceptionInInitializerError in ecj1 davek at gcc dot gnu dot org
2010-03-20 [Bug libgcj/35552] GCJ ARM compiled programs give segmentation fault ramana at gcc dot gnu dot org
2010-03-20 [Bug libgcj/40860] [4.4/4.5 regression] regressions in libjava testsuite on arm-linux ramana at gcc dot gnu dot org
2010-03-20 [Bug java/42409] org.eclipse.jdt.internal.compiler.batch.GCCMain not found ramana at gcc dot gnu dot org
2010-03-20 [Bug libgcj/36658] Building gcj for arm linux from trunk (gcc 4.4.0): libjava/gcj/array.h:24: internal compiler error: verify_gimple failed ramana at gcc dot gnu dot org
2010-03-19 [Bug libgcj/40860] [4.4/4.5 regression] regressions in libjava testsuite on arm-linux mikpe at it dot uu dot se
2010-03-19 [Bug libgcj/43447] New: TestLeak.exe test consumes all available memory on 64-bit Solaris 2 ro at gcc dot gnu dot org
2010-03-19 [Bug boehm-gc/18135] gctest (boehm-gc) uses the installed libgcc_s on darwin howarth at nitro dot med dot uc dot edu
2010-03-17 [Bug java/43369] gcjh's CNI text options don't work tromey at gcc dot gnu dot org
2010-03-17 [Bug libgcj/40860] [4.4/4.5 regression] regressions in libjava testsuite on arm-linux mikpe at it dot uu dot se
2010-03-17 [Bug libgcj/40860] [4.4/4.5 regression] regressions in libjava testsuite on arm-linux mikpe at it dot uu dot se
2010-03-17 [Bug libgcj/40860] [4.4/4.5 regression] regressions in libjava testsuite on arm-linux doko at ubuntu dot com
2010-03-16 [Bug libgcj/40860] [4.4/4.5 regression] regressions in libjava testsuite on arm-linux mikpe at it dot uu dot se
2010-03-16 [Bug libgcj/40860] [4.4/4.5 regression] regressions in libjava testsuite on arm-linux doko at ubuntu dot com
2010-03-16 [Bug libgcj/40860] [4.4/4.5 regression] regressions in libjava testsuite on arm-linux mikpe at it dot uu dot se
2010-03-16 [Bug libgcj/40860] [4.4/4.5 regression] regressions in libjava testsuite on arm-linux doko at ubuntu dot com
2010-03-15 [Bug java/37329] ICE during .jar -> .bin compilation with -freduced-reflection. pluto at agmk dot net
2010-03-15 [Bug libgcj/40860] [4.4/4.5 regression] regressions in libjava testsuite on arm-linux rearnsha at gcc dot gnu dot org
2010-03-15 [Bug libgcj/40860] [4.4/4.5 regression] regressions in libjava testsuite on arm-linux mikpe at it dot uu dot se
2010-03-14 [Bug java/43369] New: gcjh's CNI text options don't work russ at eatnumber1 dot com
2010-03-13 [Bug libgcj/42676] [4.5 regression] javah doesn't generate the header files as checked in in the archive debian-gcc at lists dot debian dot org
2010-03-13 [Bug libgcj/42676] [4.5 regression] javah doesn't generate the header files as checked in in the archive doko at gcc dot gnu dot org
2010-03-13 [Bug libgcj/43278] shs.h:62: syntax error before `*' token diskman at kc dot rr dot com
2010-03-13 [Bug libgcj/43278] shs.h:62: syntax error before `*' token pinskia at gcc dot gnu dot org
2010-03-12 [Bug libgcj/42676] [4.5 regression] javah doesn't generate the header files as checked in in the archive doko at ubuntu dot com
2010-03-10 [Bug java/43302] [Regression] gcc creates "dummy" resources in object files michele at focuseek dot com
2010-03-10 [Bug java/42143] [4.3/4.4/4.5 Regression] gcj creates "dummy" variables michele at focuseek dot com
2010-03-10 [Bug java/42143] [4.3/4.4/4.5 Regression] gcj creates "dummy" variables michele at focuseek dot com
2010-03-09 [Bug java/42143] [4.3/4.4/4.5 Regression] gcj creates "dummy" variables pjames at avtrex dot com
2010-03-09 [Bug java/43302] [Regression] gcc creates "dummy" resources in object files michele at focuseek dot com
2010-03-09 [Bug java/43302] New: [Regression] gcc creates "dummy" resources in object files michele at focuseek dot com
2010-03-07 [Bug libgcj/43279] Constructor java.lang.String(int[], int, int) missing mark at gcc dot gnu dot org
2010-03-07 [Bug libgcj/43279] Constructor java.lang.String(int[], int, int) missing marcus at mc dot pp dot se
2010-03-07 [Bug libgcj/43279] New: Constructor java.lang.String(int[], int, int) missing marcus at mc dot pp dot se
2010-03-06 [Bug java/43278] New: shs.h:62: syntax error before `*' token diskman at kc dot rr dot com
2010-03-04 [Bug libgcj/43258] New: In-tree build may fail in libjava/classpath/tools ro at gcc dot gnu dot org
2010-03-04 [Bug libgcj/40860] [4.4/4.5 regression] regressions in libjava testsuite on arm-linux mikpe at it dot uu dot se
2010-03-01 [Bug libgcj/38251] [4.4/4.5 Regression] tools.zip doesn't build on systems with short command lines ro at gcc dot gnu dot org
2010-03-01 [Bug libgcj/38251] [4.4/4.5 Regression] tools.zip doesn't build on systems with short command lines ro at gcc dot gnu dot org
2010-03-01 [Bug libgcj/38251] [4.4/4.5 Regression] tools.zip doesn't build on systems with short command lines ro at gcc dot gnu dot org
2010-02-28 [Bug libgcj/40860] [4.4/4.5 regression] regressions in libjava testsuite on arm-linux aph at gcc dot gnu dot org
2010-02-27 [Bug java/42811] [4.5 regression] java.lang.ExceptionInInitializerError in ecj1 davek at gcc dot gnu dot org
2010-02-24 [Bug java/40816] error: 'jvariant::jvariant(jbyte)' cannot be overloaded aph at gcc dot gnu dot org
2010-02-22 [Bug libgcj/40860] [4.4/4.5 regression] regressions in libjava testsuite on arm-linux mikpe at it dot uu dot se
2010-02-20 [Bug java/42811] [4.5 regression] java.lang.ExceptionInInitializerError in ecj1 davek at gcc dot gnu dot org
2010-02-19 [Bug libgcj/40860] [4.4/4.5 regression] regressions in libjava testsuite on arm-linux mikpe at it dot uu dot se
2010-02-17 [Bug java/42143] [4.3/4.4/4.5 Regression] gcj creates "dummy" variables mmitchel at gcc dot gnu dot org
2010-02-17 [Bug java/43055] [4.3/4.4/4.5 Regression] 'jc1: internal compiler error: Segmentation fault' using gcj -fprofile-arcs mmitchel at gcc dot gnu dot org
2010-02-17 [Bug java/35923] gcj: error trying to exec 'ecj1': execvp: No such file or directory davek at gcc dot gnu dot org
2010-02-17 [Bug java/42967] gcj: error trying to exec 'ecj1': execvp: No such file or directory davek at gcc dot gnu dot org
2010-02-16 [Bug libgcj/40860] [4.4/4.5 regression] regressions in libjava testsuite on arm-linux doko at ubuntu dot com
2010-02-16 [Bug java/42143] [4.3/4.4/4.5 Regression] gcj creates "dummy" variables rguenth at gcc dot gnu dot org
2010-02-15 [Bug libgcj/40860] [4.4/4.5 regression] regressions in libjava testsuite on arm-linux mikpe at it dot uu dot se
2010-02-15 [Bug java/43086] PR16923 fails with Assertion failed: (class_id) howarth at nitro dot med dot uc dot edu
2010-02-15 [Bug java/43086] New: PR16923 fails with Assertion failed: (class_id) howarth at nitro dot med dot uc dot edu
2010-02-15 [Bug libgcj/40860] [4.4/4.5 regression] regressions in libjava testsuite on arm-linux doko at ubuntu dot com
2010-02-13 [Bug libgcj/40860] [4.4/4.5 regression] regressions in libjava testsuite on arm-linux mikpe at it dot uu dot se
2010-02-13 [Bug java/41802] When attempting to compile pdftk-1.41 my machine comes to a grind rguenth at gcc dot gnu dot org
2010-02-13 [Bug java/41802] When attempting to compile pdftk-1.41 my machine comes to a grind mikpe at it dot uu dot se
2010-02-13 [Bug java/41802] When attempting to compile pdftk-1.41 my machine comes to a grind rguenth at gcc dot gnu dot org
2010-02-13 [Bug java/43055] [4.3/4.4/4.5 Regression] 'jc1: internal compiler error: Segmentation fault' using gcj -fprofile-arcs rguenth at gcc dot gnu dot org
2010-02-13 [Bug java/43055] [4.3/4.4/4.5 Regression'jc1: internal compiler error: Segmentation fault' using gcj -fprofile-arcs rguenth at gcc dot gnu dot org
2010-02-13 [Bug java/41802] When attempting to compile pdftk-1.41 my machine comes to a grind lucabon at interfree dot it
2010-02-12 [Bug java/43055] 'jc1: internal compiler error: Segmentation fault' using gcj -fprofile-arcs eldenc at tucsonembedded dot com
2010-02-12 [Bug java/43055] New: 'jc1: internal compiler error: Segmentation fault' using gcj -fprofile-arcs eldenc at tucsonembedded dot com
2010-02-12 [Bug java/41802] When attempting to compile pdftk-1.41 my machine comes to a grind lucabon at interfree dot it
2010-02-12 [Bug java/41802] When attempting to compile pdftk-1.41 my machine comes to a grind howarth at nitro dot med dot uc dot edu
2010-02-11 [Bug java/41802] When attempting to compile pdftk-1.41 my machine comes to a grind lucabon at interfree dot it
2010-02-11 [Bug java/41802] When attempting to compile pdftk-1.41 my machine comes to a grind pinskia at gcc dot gnu dot org
2010-02-11 [Bug java/41802] When attempting to compile pdftk-1.41 my machine comes to a grind lucabon at interfree dot it
2010-02-10 [Bug java/41802] When attempting to compile pdftk-1.41 my machine comes to a grind howarth at nitro dot med dot uc dot edu
2010-02-10 [Bug java/41802] When attempting to compile pdftk-1.41 my machine comes to a grind rguenth at gcc dot gnu dot org
2010-02-10 [Bug java/41802] When attempting to compile pdftk-1.41 my machine comes to a grind rguenth at gcc dot gnu dot org
2010-02-10 [Bug java/41802] When attempting to compile pdftk-1.41 my machine comes to a grind lucabon at interfree dot it
2010-02-07 [Bug java/42892] Incorrect code generated for enhanced for loop. pinskia at gcc dot gnu dot org
2010-02-07 [Bug java/42892] Incorrect code generated for enhanced for loop. pinskia at gcc dot gnu dot org
2010-02-06 [Bug java/41802] When attempting to compile pdftk-1.41 my machine comes to a grind rguenth at gcc dot gnu dot org
2010-02-06 [Bug java/41802] When attempting to compile pdftk-1.41 my machine comes to a grind lucabon at interfree dot it
2010-02-06 [Bug libgcj/42986] natVMSecureRandom.cc error: expected type-specifier junior_sd at hotmail dot com
2010-02-06 [Bug libgcj/42986] natVMSecureRandom.cc error: expected type-specifier junior_sd at hotmail dot com
2010-02-06 [Bug libgcj/42986] New: natVMSecureRandom.cc error: expected type-specifier junior_sd at hotmail dot com
2010-02-06 [Bug libgcj/40860] [4.4/4.5 regression] regressions in libjava testsuite on arm-linux mikpe at it dot uu dot se
2010-02-05 [Bug java/42811] [4.5 regression] java.lang.ExceptionInInitializerError in ecj1 davek at gcc dot gnu dot org
2010-02-05 [Bug libgcj/40860] [4.4/4.5 regression] regressions in libjava testsuite on arm-linux mikpe at it dot uu dot se
2010-02-05 [Bug java/42967] gcj: error trying to exec 'ecj1': execvp: No such file or directory rguenth at gcc dot gnu dot org
2010-02-05 [Bug java/42967] New: gcj: error trying to exec 'ecj1': execvp: No such file or directory dan_1997 at mail dot ru
2010-02-04 [Bug java/42811] [4.5 regression] java.lang.ExceptionInInitializerError in ecj1 davek at gcc dot gnu dot org
2010-02-03 [Bug libgcj/40860] [4.4/4.5 regression] regressions in libjava testsuite on arm-linux mikpe at it dot uu dot se
2010-02-03 [Bug java/41991] gcj segfaults on i686-apple-darwin9 and x86_64-apple-darwin9 howarth at nitro dot med dot uc dot edu
2010-02-03 [Bug java/42307] WalkerTest execution failures howarth at nitro dot med dot uc dot edu
2010-02-02 [Bug java/41991] gcj segfaults on i686-apple-darwin* and x86_64-apple-darwin* andreast at gcc dot gnu dot org
2010-02-02 [Bug java/41991] gcj segfaults on i686-apple-darwin* and x86_64-apple-darwin* andreast at gcc dot gnu dot org
2010-02-02 [Bug java/41991] gcj segfaults on i686-apple-darwin* and x86_64-apple-darwin* andreast at gcc dot gnu dot org
2010-01-28 [Bug java/42892] Incorrect code generated for enhanced for loop. suckfish at ihug dot co dot nz
2010-01-28 [Bug java/42892] Incorrect code generated for enhanced for loop. pinskia at gcc dot gnu dot org
2010-01-28 [Bug java/42892] Incorrect code generated for enhanced for loop. suckfish at ihug dot co dot nz
2010-01-28 [Bug java/42892] Incorrect code generated for enhanced for loop. pinskia at gcc dot gnu dot org
2010-01-28 [Bug java/42892] Incorrect code generated for enhanced for loop. suckfish at ihug dot co dot nz
2010-01-28 [Bug java/42892] New: Incorrect code generated for enhanced for loop. suckfish at ihug dot co dot nz
2010-01-25 [Bug libgcj/40860] [4.4/4.5 regression] regressions in libjava testsuite on arm-linux mikpe at it dot uu dot se
2010-01-24 [Bug libgcj/40860] [4.4/4.5 regression] regressions in libjava testsuite on arm-linux mikpe at it dot uu dot se
2010-01-24 [Bug java/42524] gcc-4.4.2 build fails on gcj with unrecognized option '-Wl,-rpath' bjg at gnu dot org
2010-01-23 [Bug java/40816] error: 'jvariant::jvariant(jbyte)' cannot be overloaded aph at redhat dot com
2010-01-22 [Bug java/42811] [4.5 regression] java.lang.ExceptionInInitializerError in ecj1 rguenth at gcc dot gnu dot org
2010-01-22 [Bug java/42849] 4.4.3 build failure: jar: internal error: rguenth at gcc dot gnu dot org
2010-01-22 [Bug java/42849] New: 4.4.3 build failure: jar: internal error: ronis at ronispc dot chem dot mcgill dot ca
2010-01-22 [Bug java/40816] error: 'jvariant::jvariant(jbyte)' cannot be overloaded mathieu dot malaterre at gmail dot com
2010-01-21 [Bug libgcj/40860] [4.4/4.5 regression] regressions in libjava testsuite on arm-linux jakub at gcc dot gnu dot org
2010-01-21 [Bug libgcj/40181] [4.4 Regression] regressions in libjava testsuite on s390-linux jakub at gcc dot gnu dot org
2010-01-21 [Bug libgcj/40180] [4.4/4.5 regression] regressions in libjava testsuite on ia64-linux jakub at gcc dot gnu dot org
2010-01-21 [Bug libgcj/40182] [4.4/4.5 regression] regressions in libjava testsuite on sparc-linux jakub at gcc dot gnu dot org
2010-01-21 [Bug libgcj/38251] [4.4/4.5 Regression] tools.zip doesn't build on systems with short command lines jakub at gcc dot gnu dot org
2010-01-21 [Bug libgcj/39747] [4.4/4.5 Regression] Installation documentation should suggest building libgmp as PIC for building with libjava jakub at gcc dot gnu dot org
2010-01-21 [Bug java/42811] [4.5 regression] java.lang.ExceptionInInitializerError in ecj1 jojelino at gmail dot com
2010-01-20 [Bug java/42811] [4.5 regression] java.lang.ExceptionInInitializerError in ecj1 rguenth at gcc dot gnu dot org
2010-01-20 [Bug java/42811] [4.5 regression] java.lang.ExceptionInInitializerError in ecj1 jojelino at gmail dot com
2010-01-19 [Bug java/42811] New: [4.5 regression] java.lang.ExceptionInInitializerError in ecj1 jojelino at gmail dot com
2010-01-15 [Bug libgcj/39747] [4.4/4.5 Regression] Installation documentation should suggest building libgmp as PIC for building with libjava David dot Biesack at sas dot com
2010-01-14 [Bug libgcj/42676] [4.5 regression] javah doesn't generate the header files as checked in in the archive rguenth at gcc dot gnu dot org
2010-01-14 [Bug middle-end/42698] [4.5 Regression] jc1: ICE in redirect_eh_edge_1, at tree-eh.c:2112 rguenth at gcc dot gnu dot org
2010-01-14 [Bug libgcj/40859] [4.4 regression] regressions in libjava testsuite on arm-linux debian-gcc at lists dot debian dot org
2010-01-13 [Bug middle-end/42698] [4.5 Regression] jc1: ICE in redirect_eh_edge_1, at tree-eh.c:2112 aph at gcc dot gnu dot org
2010-01-12 [Bug libgcj/40859] [4.4 regression] regressions in libjava testsuite on arm-linux doko at gcc dot gnu dot org
2010-01-12 [Bug libgcj/40859] [4.4/4.5 regression] regressions in libjava testsuite on arm-linux doko at ubuntu dot com
2010-01-12 [Bug java/42698] [4.5 Regression] jc1: ICE in redirect_eh_edge_1, at tree-eh.c:2112 rguenth at gcc dot gnu dot org
2010-01-12 [Bug java/42700] New: jc1: ICE in java_read_sourcefilenames, at java/jcf-parse.c:192 doko at ubuntu dot com
2010-01-12 [Bug java/42698] [4.5 regression] jc1: ICE in redirect_eh_edge_1, at tree-eh.c:2112 doko at ubuntu dot com
2010-01-12 [Bug java/42698] New: [4.5 regression] jc1: ICE in redirect_eh_edge_1, at tree-eh.c:2112 doko at ubuntu dot com
2010-01-11 [Bug libgcj/42658] [4.5 regression] ICE in _Jv_Linker::verify_class ../.././libjava/link.cc:1904 davek at gcc dot gnu dot org
2010-01-11 [Bug java/41745] Segmentation fault when ecj.jar is run as a binary compiled by gcj gerald at pfeifer dot com
2010-01-11 [Bug libgcj/42658] [4.5 regression] ICE in _Jv_Linker::verify_class ../.././libjava/link.cc:1904 davek at gcc dot gnu dot org
2010-01-10 [Bug libgcj/42676] [4.5 regression] javah doesn't generate the header files as checked in in the archive rguenth at gcc dot gnu dot org
2010-01-10 [Bug libgcj/36658] Building gcj for arm linux from trunk (gcc 4.4.0): libjava/gcj/array.h:24: internal compiler error: verify_gimple failed ramana at gcc dot gnu dot org
2010-01-10 [Bug java/41745] Segmentation fault when ecj.jar is run as a binary compiled by gcj andreast at gcc dot gnu dot org
2010-01-10 [Bug java/16132] Invalid double calculations on ARM (FPA) ramana at gcc dot gnu dot org
2010-01-09 [Bug libgcj/42676] New: [4.5 regression] javah doesn't generate the header files as checked in in the archive debian-gcc at lists dot debian dot org
2010-01-09 [Bug java/41745] Segmentation fault when ecj.jar is run as a binary compiled by gcj andreast at gcc dot gnu dot org
2010-01-09 [Bug java/41745] Segmentation fault when ecj.jar is run as a binary compiled by gcj gerald at pfeifer dot com
2010-01-09 [Bug libgcj/42658] [4.5 regression] ICE in _Jv_Linker::verify_class ../.././libjava/link.cc:1904 davek at gcc dot gnu dot org
2010-01-09 [Bug libgcj/42658] [4.5 regression] ICE in _Jv_Linker::verify_class ../.././libjava/link.cc:1904 jojelino at gmail dot com
2010-01-09 [Bug libgcj/42658] [4.5 regression] ICE in _Jv_Linker::verify_class ../.././libjava/link.cc:1904 jojelino at gmail dot com
2010-01-09 [Bug libgcj/42658] [4.5 regression] ICE in _Jv_Linker::verify_class ../.././libjava/link.cc:1904 davek at gcc dot gnu dot org
2010-01-09 [Bug libgcj/42658] [4.5 regression] ICE in _Jv_Linker::verify_class ../.././libjava/link.cc:1904 jojelino at gmail dot com
2010-01-09 [Bug libgcj/42658] [4.5 regression] ICE in _Jv_Linker::verify_class ../.././libjava/link.cc:1904 jojelino at gmail dot com
2010-01-09 [Bug libgcj/42658] [4.5 regression] ICE in _Jv_Linker::verify_class ../.././libjava/link.cc:1904 davek at gcc dot gnu dot org
2010-01-09 [Bug libgcj/42658] [4.5 regression] ICE in _Jv_Linker::verify_class ../.././libjava/link.cc:1904 jojelino at gmail dot com
2010-01-09 [Bug libgcj/42658] [4.5 regression] ICE in _Jv_Linker::verify_class ../.././libjava/link.cc:1904 davek at gcc dot gnu dot org
2010-01-09 [Bug libgcj/42658] [4.5 regression] ICE in _Jv_Linker::verify_class ../.././libjava/link.cc:1904 jojelino at gmail dot com
2010-01-09 [Bug libgcj/42658] [4.5 regression] ICE in _Jv_Linker::verify_class ../.././libjava/link.cc:1904 jojelino at gmail dot com
2010-01-09 [Bug libgcj/42658] [4.5 regression] ICE in _Jv_Linker::verify_class ../.././libjava/link.cc:1904 davek at gcc dot gnu dot org
2010-01-09 [Bug libgcj/42658] [4.5 regression] ICE in _Jv_Linker::verify_class ../.././libjava/link.cc:1904 jojelino at gmail dot com
2010-01-08 [Bug libgcj/42658] [4.5 regression] ICE in _Jv_Linker::verify_class ../.././libjava/link.cc:1904 jojelino at gmail dot com
2010-01-08 [Bug libgcj/42658] New: [4.5 regression] ICE in _Jv_Linker::verify_class ../.././libjava/link.cc:1904 jojelino at gmail dot com
2010-01-08 [Bug libgcj/36658] Building gcj for arm linux from trunk (gcc 4.4.0): libjava/gcj/array.h:24: internal compiler error: verify_gimple failed ramana at gcc dot gnu dot org
2010-01-07 [Bug java/42409] org.eclipse.jdt.internal.compiler.batch.GCCMain not found jlpoole at pon dot net
2010-01-05 [Bug java/42409] org.eclipse.jdt.internal.compiler.batch.GCCMain not found jlpoole at pon dot net
2010-01-05 [Bug java/42409] org.eclipse.jdt.internal.compiler.batch.GCCMain not found jlpoole at pon dot net
2010-01-04 [Bug java/41745] Segmentation fault when ecj.jar is run as a binary compiled by gcj yuri at rawbw dot com
2010-01-04 [Bug java/42409] org.eclipse.jdt.internal.compiler.batch.GCCMain not found jakub at gcc dot gnu dot org
2010-01-04 [Bug java/42409] org.eclipse.jdt.internal.compiler.batch.GCCMain not found ramana at gcc dot gnu dot org
2010-01-04 [Bug java/42409] org.eclipse.jdt.internal.compiler.batch.GCCMain not found jlpoole at pon dot net
2010-01-03 [Bug java/41745] Segmentation fault when ecj.jar is run as a binary compiled by gcj andreast at gcc dot gnu dot org
2010-01-03 [Bug java/42409] org.eclipse.jdt.internal.compiler.batch.GCCMain not found jakub at gcc dot gnu dot org
2010-01-03 [Bug java/42409] org.eclipse.jdt.internal.compiler.batch.GCCMain not found jlpoole at pon dot net
2010-01-03 [Bug java/42409] org.eclipse.jdt.internal.compiler.batch.GCCMain not found jlpoole at pon dot net
2010-01-03 [Bug java/42409] org.eclipse.jdt.internal.compiler.batch.GCCMain not found jlpoole at pon dot net
2010-01-03 [Bug java/42409] org.eclipse.jdt.internal.compiler.batch.GCCMain not found jlpoole at pon dot net
2010-01-03 [Bug java/41745] Segmentation fault when ecj.jar is run as a binary compiled by gcj gerald at pfeifer dot com
Indexes: [Date Index] [Subject Index] [Author Index] [Thread Index]
Site Nav: [Browse other archives for this mailing list]
[Browse other mailing lists at this site]
Search: Limit to:

Mail converted by MHonArc 2.6.3